##TITLE=JA 4-metoxi $$ Begin of the data block
##JCAMP-DX=5.00 $$ ACD/SpecManager v 10.08
##SPECTROMETER/DATA SYSTEM=Alpha
##DATE=04 Dec 2015 11:34:10
##DATA TYPE=INFRARED SPECTRUM
##DATA CLASS=XYDATA
##ORIGIN=
##OWNER=
##NPOINTS=1765
##FIRSTX=399.76428223
##LASTX=3997.64306641
##MAXX=3997.64306641
##MINX=399.76428223
##MAXY=0.89017135
##MINY=0.60423034
##XFACTOR=1.0000000000
##YFACTOR=1.000000000000000e-9
##FIRSTY=0.81959397
##DELTAX=2.03961372
##XUNITS=1/CM
##YUNITS=ARBITRARY UNITS
##XYDATA=(X++(Y..Y))
399.8H19593966n57840K48253m41670j891255j931370j210570j241207j470625j167179
418.1H09930503r75012j280725j407981r50873o28412j065552j210392p06553p05779
436.5H00999224j227975j344740j161397j219213j357495j005888m69804o25491r84550
454.8G91602671o75201n31197j322567j969040j773715j834214k620041k553046j160979
473.2G77162671K2233N30541J655280L149271L165245K019465J721144J656473J97172
491.5G91279495j282156j075446p99001j741528k095461p95484p0870p68899q68261
509.9G81782389k75135q50380j838922r51529Q99673R65058o0439j40786k77757j674593
530.3G77577579k359569j046360O4850l71277k21491J227975J675427R16362J040518
$$ plain form
399.8 819593966 819036126 819284379 818842709 816951454 815020084 813809514 812568307 811097682 809930503
418.1 809930503 808955491 807674766 806266785 805315912 804687500 803621948 802411556 801705003 800999224
436.5 800999224 799771249 798426509 797265112 796045899 794688404 793682516 793212712 792587221 791602671
454.8 791602671 790927470 790396273 789073706 787104666 785330951 783496737 780876696 778323650 777162671
473.2 777162671 777184904 777715445 779370725 782519996 785685241 787704706 789425850 791082323 791279495
491.5 791279495 789997339 788921893 788122892 786381364 784285903 783490419 783419549 782650650 781782389
509.9 781782389 781507254 780656874 778817952 777866423 778766096 779731154 779670715 779529929 779252172 777577579
530.3 777577579 775218010 774171650 774236500 773865223 773643732 774871707 776547134 777463496 778504014
548.7G78504014J651049P18891p40230n00679K57075l91245j030803j12891M95494
567G78850675m85361r86218p7844J5080j177848j088917M53234J050293M49121O10233
587.4G77612448J254201K46405j637161j591384J29044J098514J175821J381278J421749
605.8G81090915J728535L269732M677117L949821J893759J144766J898229J788140
622.1H01441014O00576K23994O27459L60310M4107P12514J074135k41458j530588k42054
642.5H03070009K371073L307282L189445L977656M385591L154397J977861K033710
658.8H27467024J764775N26011Q8632Q12232Q03530k74539r3877P83444O02185m95314
679.2H31984103l98457L82900k30372j378775j142502n10334j116992j740574r12369
$$ plain form
548.7 778504014 780155063 780873954 780133724 779633045 779890120 779498875 778468072 778355181 778850675
567 778850675 778365314 777379096 777301252 777316332 776138484 775049567 775502801 776553094 777002215 777612448
587.4 777612448 778866649 779113054 777475893 775884509 776013553 777112067 778287888 779669166 781090915
605.8 781090915 782819450 786089182 790766299 794716120 796609879 797754645 799652874 801441014
622.1 801441014 802041590 802265584 802893043 803253353 803297460 804009974 805084109 804842651 803312063 803070009
642.5 803070009 805441082 808748364 811937809 815915465 820301056 823455453 825433314 827467024
658.8 827467024 829231799 829757810 829846442 830658674 831462204 831187665 831093788 831877232 832479417 831984103
679.2 831984103 831585646 831968546 831738174 830359399 829216897 828706563 827589571 825848997 824936628
697.5H24936628j44779p25806r65774P1466N73218k14398m55618M78148P83563J01507
717.9H24438155L18765J455188J442492N67556R28640K006650J631021M44949N08308
736.3H33741724J092196M30882m42147J9848M69506m52280j207829o81579n23388j263321
756.7H31183612p94649J159132K112508J549840J641094K539695K136051O97732N18263
775.1H42743278J326322J037598K1159j32739l02732j662016k101243L87490L358245
793.4H44675362L657460K334297J555264O21021j183152k168775j659751j475990k229333
811.8H44126403k374828j763999k088428l303289l670216l375947l961146m756927
828.1H18831623l879071j695990J86383K093196M944504P252097O970465M890084L117979
$$ plain form
697.5 824936628 824791849 824066043 823100269 823171735 823744953 823530555 823074937 823553085 824336648 824438155
717.9 824438155 824756920 826212108 827654600 828222156 829150796 831157446 832788467 833233416 833741724
736.3 833741724 834833920 835264802 834822655 834842503 835312009 834859729 833651900 832970321 832446933 831183612
756.7 831183612 830388963 831548095 833660603 835210443 836851537 839391232 841527283 842225015 842743278
775.1 842743278 844069600 845107198 845128357 844995618 844692886 843030870 840929627 841317117 844675362
793.4 844675362 848332822 850667119 852222383 852843404 851660252 849491477 847831726 846355736 844126403
811.8 844126403 841751575 839987576 837899148 834595859 830925643 827549696 823588550 818831623
828.1 818831623 814952552 813256562 813442945 815536141 820480645 827732742 834703207 839593291 842711270
846.4H42711270K110541J617074K186835L621101M135728L134548K185703J972735
862.8H63675535J367092K31922J33335J097500J284600N72026M69803R03666N21243
881.1H70256722l19243k28703K48850j91450q36849n09978o7651n55635r86754m52698
901.5H66356611p7784o48737r76026m34995k66015r56118j237571q02815r09388j610041
921.9H58437121j499951n43594k27154o14822l89099K11716n0724o79254m93944j02758
942.3H54047537n69582j179814q95739m99487r48489j340627q42631m65870r23038
960.7H46382260j206994p88510o85811j254201j433134r90152j025736j694739j876116
979H35426867j480460j578868k083361j971423j536310j765251k264798k117455j819074
$$ plain form
846.4 842711270 844821811 846438885 848625720 852246821 856382549 859517097 861702800 863675535
862.8 863675535 865042627 865274549 865407884 866505384 867789984 868362010 868831813 869735479 870256722
881.1 870256722 869937479 869708776 869957626 869766176 868929327 868419349 868351698 867796063 866809309 866356611
901.5 866356611 866278827 865630090 864654064 864219069 863953054 862996936 861759365 860956550 860047162 858437121
921.9 858437121 856937170 856393576 856166422 855551600 855162501 855374217 855323493 854644239 854150295 854047537
942.3 854047537 853477955 852298141 851402402 850902915 849954426 848613799 847771168 847305298 846382260
960.7 846382260 845175266 844386756 843700945 842446744 841013610 840023458 838997722 837302983 835426867
979 835426867 833946407 832367539 830284178 828312755 826776445 825011194 822746396 820628941 818809867
997.4H18809867k226293k705038k474010k293467k869010l271759k852201k821088
1013.7G97297001l894389m798353m715442m415870m181027l116608j010716J118302
1030G72282898K889872M859805O656647P175982O430685N350709M192770K571702R88781
1048.4H13399851L75450K56062l09945r58025j066983j119256j638472k082288k016127
1066.7H04840267k110780k766907l301263l467321l992498n022466n826354o246090
1083G72106588o742716p124424o722510n662501m595101l406763j607835M15564J829266
1101.4G38489568K499879K649426K282560J951396K823532M923999O698192O962478
1117.7G69281030N955994M409849K887488K048969K496064L984749N198121N052209
$$ plain form
997.4 818809867 816583574 813878536 811404526 809111059 806242049 802970290 800118089 797297001
1013.7 797297001 793402612 788604259 783888817 779472947 775291920 772175312 771164596 772282898
1030 772282898 775172770 780032575 786689222 793865204 800295889 805646598 809839368 812411070 813399851
1048.4 813399851 813775301 814031363 813721418 812763393 811696410 810577154 808938682 806856394 804840267
1066.7 804840267 802729487 799962580 796661317 793193996 789201498 784179032 778352678 772106588
1083 772106588 765363872 758239448 751516938 745854437 741259336 737852573 736244738 736660302 738489568
1101.4 738489568 740989447 743638873 745921433 747872829 750696361 755620360 762318552 769281030
1117.7 769281030 775237024 779646873 782534361 784583330 787079394 791064143 796262264 801314473
1134H01314473L741384J930773o2823j910568l151834l903865m822374o118178p532835
1152.4G79484153q869231r525299q532584o035030l963649m461706p636129j1347354
1168.7G19113171j2847900j0408163m665435J032412K976358O93500k665758l684521
1185F89543664j353740L180265P775784J0331928J0052801Q225083P211685Q240462
1201.3G43207932J0531723J2554526J3187766J1877180Q839845N297780K713621J489997
1217.7H09700370R57250M05550m34696j727879l537596n532026p368445r123087j0745704
1236G72593737j1515916j0746360q813142o745816m874825k810478o33478R76562J801670
1254.4G29231954K401769L326535M525900N544066N998075N781353N179822M715443
$$ plain form
1134 801314473 805055857 806986630 806923807 805013239 801861405 797957540 793135166 787016988 779484153
1152.4 779484153 770614922 761089623 752557039 746522009 742558360 738096654 730460525 719113171
1168.7 719113171 706265271 695857108 691191673 692224085 695200443 695893943 693228185 689543664
1185 689543664 688189924 691370189 699145973 709477901 719530702 727755785 734967470 743207932
1201.3 743207932 753739655 766294181 779481947 791359127 800198972 805496752 808210373 809700370
1217.7 809700370 810657620 811063170 810628474 808900595 805362999 799830973 792462528 783339441 772593737
1236 772593737 761077821 750331461 741518319 734772503 729897678 727087200 726453722 727430284 729231954
1254.4 729231954 731633723 734960258 739486158 745030224 751028299 756809652 761989474 766704917
1270.7G66704917M444122L996074L479541L542602M447698N690754O655037P041931
1287H06002676O504596M837215K452433o9261k577483n011023o570518n891919l120601
1305.4G96556115r34243j425803l438353m428506l133893j15633K959788M279732L534794
1323.7G93853998K142430J615166K332926L694892M905641N355537M820228L655672
1340H22376490K563357J816392R98199O2227n73039j064479j896382l023624m135728
1358.4H17123413n675077p686437p963061n759537k977073n54025P59005M00961j345396
1376.7G86322773l369749m669845m378498k683043j057387m15861k57910j89185r9659
1395.1G69201636L09050Q08955J077175J242101J449406J441419J180172R01878O95348
$$ plain form
1270.7 766704917 771149039 775145113 778624654 782167256 786614954 792305708 798960745 806002676
1287 806002676 812507272 817344487 819796920 819727659 817150176 812139153 805568635 799676716 796556115
1305.4 796556115 795621872 794196069 790757716 786329210 783195317 783079684 786039472 790319204 793853998
1323.7 793853998 795996428 797611594 799944520 803639412 808545053 813900590 818720818 822376490
1340 822376490 824939847 826756239 827754438 827816665 827243626 826179147 824282765 821259141 817123413
1358.4 817123413 811448336 803761899 795798838 790039301 787062228 786508203 787267208 787668169 786322773
1376.7 786322773 782953024 778283179 773904681 771221638 770164251 769748390 769490480 769301295 769201636
1395.1 769201636 769510686 770319641 771396816 772638917 774088323 775529742 776709914 777611792 778307140
1413.5G78307140M03404l20375j348019j536548j169324n82456L40164P95364M02331
1431.8G75291681l20494j217365j620174o05166Q41380K119600K532006J573920r3877
1450.2G78501511j133681j534223k709866m103899l091097j947105j385152n97477
1466.5G61999011J35422J43111m93288p82669k65241L99292J109004J853049K542018
1484.9G66639709L237725L958344M313112L845214L338755K365052j71065l147423
1501.2G84379423n967319j3220072k6091218k0007074j661599J4536321K6901544L0177116
1517.5G89047122K2773266J4620721P740736K866030P35700l15905j208066k446592
1533.8H33813012k544523k499461m630506o346762n828083n767822o002605o726086
$$ plain form
1413.5 778307140 778710544 778390169 777042150 775505602 774336278 773753822 774093986 774889350 775291681
1431.8 775291681 774971187 773753822 772133648 771528482 772369862 774489462 777021468 778595388 778501511
1450.2 778501511 777367830 775833607 773123741 769019842 765928745 763981640 762596488 761999011
1466.5 761999011 762134433 762277544 761784256 761001587 760736346 761135638 762244642 764097691 766639709
1484.9 766639709 769877434 773835778 778148890 781994104 785332859 787697911 787526846 784379423
1501.2 784379423 778412104 765192032 739100814 719093740 717432141 731968462 758870006 789047122
1517.5 789047122 811820388 826441109 834181845 837047875 837783575 837467670 836259604 833813012
1533.8 833813012 831268489 828769028 824138522 817791760 811963677 806195855 800193250 793467164
1550.1G93467164o965339o713033o343245q431375j0201753o094575m637599m605591
1566.4G39474654m533589m848241l741682j832545J121283M592478N972028N238890
1582.8G41443276K755106J29878j978695l946781n664110o450117n910933m967868
1599.1G15409756m668236m897297m979848m603565l592014k268553j417458j485288
1615.4F87497497j694024o71268Q00550K469182L828228M615784N093276N151510N652309
1633.7G12743044O831109O040812M411221L646254K879381K164185J406074R64701
1650.1G41086781J347840K585649L334701M165173N304456N971908N124510L400445
1666.4G72321463K447247J706243Q32379N4717n10693o14047n40137o69897r19700
$$ plain form
1550.1 793467164 786501825 779788792 773445547 765014172 754812419 748717844 744080245 739474654
1566.4 739474654 734941065 730092824 726351142 724518597 725639880 730232358 736204386 741443276
1582.8 741443276 744198382 744328260 742349565 738402784 732738674 726288557 720377624 715409756
1599.1 715409756 710741520 705844223 700864375 696260810 692668796 690400243 688982785 687497497
1615.4 687497497 685803473 685132205 685932755 688401937 692230165 696845949 701939225 707090735 712743044
1633.7 712743044 719574153 725614965 730026186 733672440 736551821 738716006 740122080 741086781
1650.1 741086781 742434621 745020270 748354971 752520144 757824600 763796508 768921018 772321463
1666.4 772321463 774768710 776474953 777307332 777362049 776851356 776237309 775697172 775027275 774107575
1684.7G74107575m15563J27137M33564Q53359J435698J750826J833260K071083J755476
1703.1G83952415J370966J474381K262115L646493N360902P573425J0547221J0807157
1719.4H26995075Q605599P786215P167458N851924M674852L788889L565967K964735
1735.7H71400714K044797J932323J936853J615345J381040J358628J313388J029492
1752H84012580Q25763R17256R33170O24716L30568L89158M55618L23951K41042K49803
1772.4H89303625J51753J3411M1247J71840J34825o3479k324K56061J64390k22862
1792.8H89948487k00450L3557p3254l06547k01642L8743j2815j68264j18494l0518
1813.2H88908803j33454j85788K1994J45674m7982j49190N4896j1862l05235k04027
$$ plain form
1684.7 774107575 773692012 773819149 774252713 775106072 776541770 778292596 780125856 782196939 783952415
1703.1 783952415 785323381 786797762 789059877 792706370 798067272 805640697 816187918 826995075
1719.4 826995075 835600674 843386889 850554347 856406271 861081123 864870012 868435979 871400714
1735.7 871400714 873445511 875377834 877314687 878930032 880311072 881669700 882983088 884012580
1752 884012580 884838343 885755599 886688769 887313485 887644053 888033211 888488829 888812780 889053822 889303625
1772.4 889303625 889455378 889468789 889510036 889681876 889816701 889753222 889750898 890006959 890171349 889948487
1792.8 889948487 889748037 889781594 889708340 889401793 889200151 889238894 889226079 889057815 888939321 888908803
1813.2 888908803 888775349 888589561 888611555 888757229 888709247 888560057 888614953 888603091 888297856 888093829
1833.6H88093829N0128j1385k14696k07722j73032l21269m32909k96354j13010k25604
1854H86147976m09722k89619j27256k32935k86818j18434j62423m63486m64797k46346
1874.4H83346140k44081m58538m59790k10405j46746k84136k82407j10209q1002k30491
1894.8H80838335j90616j1504p7784k36392j57714m1067j74404k82406r0599M4465
1915.2H79620314j60993l03149j36614j10626k80738k65896r1791r6679k76327k91407
1935.6H77606094j38760j37865l07620l20077j88589k45273l60906k67029j73688l07739
1956H75158548m09484k72572j72138k67386l31044k41697j90199k60889k64228j61230
1976.4H72587681j51336k55645k55882j59979j99795l18587k92718k04504k36809l26455
$$ plain form
1833.6 888093829 888143957 888132572 887917876 887710154 887537122 887215853 886782944 886486590 886373580 886147976
1854 886147976 885738254 885448635 885321379 885088444 884801626 884683192 884520769 884057283 883592486 883346140
1874.4 883346140 883102059 882643521 882183731 881973326 881826580 881542444 881260037 881149828 881068826 880838335
1894.8 880838335 880647719 880636215 880558431 880322039 880164325 880123258 879948854 879666448 879575849 879620314
1915.2 879620314 879459321 879156172 879019558 878908932 878628194 878362298 878270507 878173828 877897501 877606094
1935.6 877606094 877467334 877329469 877021849 876701772 876513183 876267910 875907004 875639975 875466287 875158548
1956 875158548 874749064 874476492 874304354 874036968 873705924 873464227 873274028 873013139 872748911 872587681
1976.4 872587681 872436345 872180700 871924818 871764839 871565044 871246457 870953739 870749235 870512426 870185971
1996.8H70185971l29315k73943k89083l31282l00348k57790k82169k93433k57016l04579
2017.2H67267013m66943n83828o48439n32090j4603L41415J78337m8101j46210j54078
2037.6H65192473j10209r6679j15633j06096p3552p6533q8572m0114M9889Q3983L3438
2060H64652395j4543k1518l6954m4406k2530k1101m7862m8876m4584p6413r9302r5844
2084.5H64078462q8990q7559j01387j27614j31488j01328q2194r6083q2851l5941l2365
2106.9H63110662n9188n4657j0968L0697M2438N8234Q8930P3254K2471K7538O2882
2129.4H63392293L8505O795L0160K6345m6253r3877n5611j5915n2273p7307j8359N007
2153.9H63139510p1466j13189o3658l4690q0228j43885j59264q9824j6034r000j5020
$$ plain form
1996.8 870185971 869856656 869582713 869293630 868962348 868662000 868404210 868122041 867828608 867571592 867267013
2017.2 867267013 866800070 866216242 865567803 865035713 865021110 865362525 865540862 865492761 865346551 865192473
2037.6 865192473 865082264 864985585 864869952 864763856 864690304 864613771 864525199 864485085 864534974 864618957 864652395
2060 864652395 864637852 864616334 864579380 864534974 864512444 864491343 864443481 864394605 864350021 864273608 864174306 864078462
2084.5 864078462 863989472 863901913 863800526 863672912 863541424 863440096 863357902 863261819 863178968 863143027 863110662
2106.9 863110662 863051474 862996817 862985849 863016546 863058984 863117218 863206148 863279402 863301873 863329411 863392293
2129.4 863392293 863430798 863437593 863467753 863494098 863447845 863353968 863298357 863282442 863230169 863152862 863134503 863139510
2153.9 863139510 863068044 862954855 862891197 862856507 862776279 862632394 862473130 862383306 862367272 862358272 862343252
2176.3H62343252l7968q3983o6996j2815l4153j08243j16527o7830p7724j13785p2658
2198.7H61550570k7180o9738j25110j06811p9215j13666j18971n0604n8353j54138
2219.1H60646784j62840p7426p2777j57893j58966o7949n9724j40846j40547n3823
2239.5H59553993m4465j14739j12415m3153o5506j58250j41025o3479j04546j85013
2259.9H58521402j46806r4414j72079k43723j44601k0146n6804j19507o8724l6657
2280.3H57417941r4771j13964m1247q881o9499r3043n4002p9512j63317j53601n6505
2302.7H56489599l8862p9751l5704K6405m3988j51157j03772j2219p6294j68204q3864
2325.2H55722189L3617l7253j67489j50740j28746j94192j87337r8169j11699k25246
$$ plain form
2176.3 862343252 862305284 862221301 862154305 862141490 862107337 861999094 861882567 861814737 861737013 861623228 861550570
2198.7 861550570 861523390 861453652 861328542 861221731 861142516 861028850 860909879 860859275 860800922 860646784
2219.1 860646784 860483944 860406518 860333741 860175848 860016882 859948933 859889209 859748363 859607816 859553993
2239.5 859553993 859509528 859394789 859282374 859239221 859173715 859015465 858874440 858810961 858706415 858521402
2259.9 858521402 858374596 858280182 858108103 857864380 857719779 857699633 857642829 857523322 857454598 857417941
2280.3 857417941 857323170 857209206 857167959 857159078 857089579 856996536 856942534 856863022 856699705 856546104 856489599
2302.7 856489599 856450737 856370986 856335282 856361687 856317699 856166542 856062770 856050551 855974257 855806053 855722189
2325.2 855722189 855755806 855718553 855551064 855400324 855271578 855077386 854890049 854791880 854680181 854454935
2345.6H54454935r1613K23220L46481K22266J45078J55330m3571l05772l01302j96099
2366H54608953k68757l94464l48687k70963l19779l44634k57313j74880j80900j85609
2386.4H51862967j22070r6798j56880j89602j58250j42336j55449j60873j41919j30832
2406.8H50407958j74940k05576j74701j80781k36392k26855j74880j78338k06053j82748
2427.2H48466694j30593j19985j40905j43468j13964j03534j42693j73688j60635j31309
2447.6H47105920j30295j45078j20819j13070j56641j59800j09315q1062j22964j71841
2467.9H45795035j48773j39534j91272j97947j60336j70827j97470j60098j04487j39952
2488.3H44184339k06172j73986j34170j83285k04265j21772q6606j75297k12967j33097
$$ plain form
2345.6 854454935 854363322 854586542 854933023 855155289 855300367 855455697 855412126 855106354 854805052 854608953
2366 854608953 854340196 853945732 853597045 853326082 853006303 852661669 852404356 852229476 852048576 851862967
2386.4 851862967 851740897 851644099 851487219 851297617 851139367 850997031 850841582 850680709 850538790 850407958
2406.8 850407958 850233018 850027442 849852741 849671960 849435568 849208713 849033833 848855495 848649442 848466694
2427.2 848466694 848336101 848216116 848075211 847931743 847817779 847714245 847571552 847397864 847237229 847105920
2447.6 847105920 846975625 846830547 846709728 846596658 846440017 846280217 846170902 846089840 845966876 845795035
2467.9 845795035 845646262 845506728 845315456 845117509 844957173 844786346 844588876 844428778 844324291 844184339
2488.3 844184339 843978167 843804181 843670011 843486726 843282461 843160689 843074083 842898786 842685819 842552722
2508.7H42552722r6977j65463j87814r8526m2618j00672j36554p7009p3314j66059
2529.1H41407716j99914j45971j48237k40326k76089k22742k32935k91407k20895j01328
2549.5H39327872j30356k00510j47998r3102j55092k03073j39057j08481k15292k92003
2569.9H37642908k27153j97590k74360k61605j35004j23859k45571k58505j37746j04666
2590.3H35676849j71483j48475q1360j39475k13444j35064l6955j15872k28941j80602
2610.7H34225178j35005k40981l08693k18034j60932k26796k49684j99258k33948l49403
2631.1H31902444l65913k71797k53141l33666l27230k22087k16305k95699k82883k17081
2651.5H29116642k40385l16918k99275k19166k48671l37004l07739k31087k60592l10302
$$ plain form
2508.7 842552722 842455745 842290282 842102468 842003942 841961324 841860652 841724098 841647089 841573775 841407716
2529.1 841407716 841207802 841061831 840913594 840673268 840397179 840174437 839941502 839650095 839429200 839327872
2549.5 839327872 839197516 838997006 838849008 838755906 838600814 838397741 838258684 838150203 837934911 837642908
2569.9 837642908 837415755 837218165 836943805 836682200 836547196 836423337 836177766 835919261 835781515 835676849
2590.3 835676849 835505366 835356891 835275531 835136056 834922612 834787548 834750593 834634721 834405780 834225178
2610.7 834225178 834090173 833849192 833540499 833322465 833161533 832934737 832685053 832485795 832251847 831902444
2631.1 831902444 831536531 831264734 831011593 830677927 830350697 830128610 829912305 829616606 829333723 829116642
2651.5 829116642 828876257 828559339 828260064 828040898 827792227 827455223 827147484 826916397 826655805 826345503
2671.9H26345503k65419k24114k70485l32952l46422l36230l49939l48508k72215k15888
2692.3H23383331k49922k60353k30849k49982k89678k70784j97470j91808k47717k32220
2712.7H20962548j90139k03192k02656j37746q0347j04427k01345k55346k04444j58727
2733.1H19224179j48773j40489j65104j94252j77741j09851q2076j81138k55764j83463
2753.5H17585528r6381r7096j06036n6982m8042j12176j19746n2511k8968j03831k22862
2775.9H16540897k87294k93017l09169k94566k15352k14934l82185n16594m80652m43399
2796.3H13103735n18143n84841n68270n50866n22673m53055m62413n71311o45876o49213
2816.7H07577074p03216q78632j098156j340807j671910k025127k127946j751721r62734
$$ plain form
2671.9 826345503 826080084 825855970 825585485 825252533 824906111 824569881 824219942 823871434 823599219 823383331
2692.3 823383331 823133409 822873056 822642207 822392225 822102547 821831763 821634293 821442485 821194768 820962548
2712.7 820962548 820772409 820569217 820366561 820228815 820148468 820044041 819842696 819587350 819382906 819224179
2733.1 819224179 819075406 818934917 818769813 818575561 818397820 818287969 818205893 818024755 817768991 817585528
2753.5 817585528 817489147 817392051 817286015 817229033 817180991 817068815 816949069 816896558 816867590 816763759 816540897
2775.9 816540897 816253603 815960586 815651417 815356851 815141499 814926565 814544380 814027786 813547134 813103735
2796.3 813103735 812585592 812000751 811432481 810881615 810358942 809905887 809443474 808872163 808226287 807577074
2816.7 807577074 806873858 805995226 804897070 803556263 801884353 799859226 797731280 795979559 795016825
2835.1G95016825J1444Q13067J170695J172781R47654N77629J45674k40803m43518
2853.4G99171448m72069m41253m97461o47246p39873p63833p94590p28726n37396n67972
2873.8G92981029q51691r43363q53419q87513j007319j069069j085758j127779j150311
2892.2G84004807j079201r97603r71258q66651n80728k69711q6189L8624J50383J12474
2912.6G79454947j99199o33180r28522j093149j199186j194179j041591q09252o27399
2930.9G71729290l96192J9968M31001O29008O54459N13732R5368m73619q30948q92878
2951.3G71479189r40084r96947q86143p17401o53029p28905q74877r86457j029670
2969.7G63665676r43482p48575n07950j35959K37942L37482K94327L32475L64840L24428
$$ plain form
2835.1 795016825 795028269 795841336 797012031 798184812 799132466 799710095 799855769 799614966 799171448
2853.4 799171448 798699379 798258126 797760665 797113419 796373546 795609713 794815123 794086397 793549001 792981029
2873.8 792981029 792129338 791185975 790332556 789445043 788437724 787368655 786282897 785155118 784004807
2892.2 784004807 782925606 781928003 780956745 780090094 779509366 779239655 779153466 779192090 779342473 779454947
2912.6 779454947 779255748 778622568 777694046 776600897 775401711 774207532 773165941 772356689 771729290
2930.9 771729290 771333098 771353066 771784067 772413075 773067534 773581266 773676634 773203015 772372067 771479189
2951.3 771479189 770539105 769542158 768656015 767938614 767285585 766556680 765681803 764695346 763665676
2969.7 763665676 762722194 761973619 761465669 761329710 761567652 761905134 762199461 762531936 762896776 763221204
2990.1G63221204J88947j4961n3584N1498J53840K99513M40836N76854Q24928J055717
3010.5G66744792R95577P41720N54204M33981L00825J61111P570j73926k79784k43187
3030.9G69242883j49608k24769m24862l40998j57952l31283o63936p90239p10904p14958
3051.3G64733374q45373r05036r98915j139283j105845r34660q31008r66907j231909
3069.6G55774438j268744j081824q97468q32557r97663j247465j386226j464784j446008
3088G45151699j418114j566589j631558j450598j264274j252234j342774j279533j067400
3106.3G32878625j007557j131117j072168p93636o67036p32600q61049r58025q44896
3124.7G24810541o02842n04255n79119o62446o61790o20246p00653r68814j180172
$$ plain form
2990.1 763221204 763410151 763395190 763341606 763393104 763546944 763846457 764287293 764864147 765689075 766744792
3010.5 766744792 767740369 768482089 769036293 769470274 769771099 769932210 769939780 769765854 769486070 769242883
3030.9 769242883 769093275 768868506 768443644 768102646 767944694 767613411 766949475 766159236 765448332 764733374
3051.3 764733374 763888001 762982965 761984050 760844767 759738922 758804262 757973254 757006347 755774438
3069.6 755774438 754505694 753423870 752526402 751693845 750696182 749448717 748062491 746597707 745151699
3088 745151699 743733585 742166996 740535438 739084840 737820566 736568332 735225558 733946025 732878625
3106.3 732878625 731871068 730739951 729667783 728874147 728207111 727474511 726613462 725655437 724810541
3124.7 724810541 724207699 723703444 723124325 722461879 721800089 721179843 720479190 719510376 718330204
3143G18330204j209437j193464j129151j071274j238882j502395j565337j498580j449287
3161.4G06472397j409471j346648j254916j149655j023769q58724o27875l65258j32083
3179.8F98303998R3102L47257O07907Q42810J018822J120329J193881J281142J375318
3198.1G06184566J411140J385212J374662J371443J311481J182497J013279Q08358
3214.4G16042638N41925K29359m2021k49029m76539p08818q62479r34124j035035j302481
3234.8G11203396j570880j627863j592934j597762j609325j663685j805246j853466
3251.1F97882235j747072j672744j721442j759231j672924j535654j414061j226484
3267.5F85132623r58741r07183j053154j028359q21114n73933l52502j80781n5313
$$ plain form
3143 718330204 717120767 715927303 714798152 713726878 712487996 710985601 709420264 707921684 706472397
3161.4 706472397 705062926 703716278 702461362 701311707 700287938 699429214 698801339 698436081 698303998
3179.8 698303998 698397100 698744357 699352264 700195074 701213896 702334225 703528106 704809248 706184566
3198.1 706184566 707595706 708980918 710355580 711727023 713038504 714221001 715234280 716042638
3214.4 716042638 716584563 716813922 716771901 716522872 716046333 715337515 714475036 713540912 712505877 711203396
3234.8 711203396 709632516 708004653 706411719 704813957 703204632 701540947 699735701 697882235
3251.1 697882235 696135163 694462419 692740977 690981746 689308822 687773168 686359107 685132623
3267.5 685132623 684173882 683266699 682213545 681185186 680364072 679790139 679437637 679256856 679201543
3285.8F79201543O1572K15232L04997K25306L8147j50502j80542M947J42872k7120
3306.2F79836452m22418p35283p96855p18772o85096p54952q59678q71062q70764j126588
3326.6F71994984j458645j510799j418709j384736j424968j625895j912773k095222
3342.9F59163237k213836k183378j992047k129554k584279k756059k608121k506613
3359.2F40189350k584994k610088k373933k180517k317786k563894k539516k249717
3375.5F20768905j995802j861573j791238j686395j474857j185179r08732r19163j163483
3393.9F07782483j075089n58317k42531m88460p36594m43816p332J66774J90914J63197
3414.3F04751229K33591M91857O67036O95527Q05735J021266J178265J168072J238585
$$ plain form
3285.8 679201543 679263115 679478347 679783344 680008650 680046797 679896295 679715753 679720700 679863572 679836452
3306.2 679836452 679414034 678678751 677881896 677163124 676478028 675723076 674863398 673992336 673121572 671994984
3326.6 671994984 670536339 669025540 667606831 666222095 664797127 663171232 661258459 659163237
3342.9 659163237 656949401 654766023 652773976 650644422 648060143 645304084 642695963 640189350
3359.2 640189350 637604356 634994268 632620335 630439818 628122032 625558138 623018622 620768905
3375.5 620768905 618773103 616911530 615120292 613433897 611959040 610773861 609865129 608945966 607782483
3393.9 607782483 606707394 606149077 605906546 605418086 604681492 604237676 604230344 604397118 604588032 604751229
3414.3 604751229 604984820 605476677 606143713 606839240 607644975 608666241 609844506 611012578 612251163
3432.7F12251163J432955J361966J076341J069903J392901J657784J716971J698554
3449F23658538J757920J863360J934469K034843K122521J996160J932800K237021K385319
3467.3F41922951J965046J461804J468956J792967K029658J964450J666545J648963
3483.6F55921340J864910J789034J619219J716078J859188J883089J792252J738251
3500F70183361J799166J646995J407206J528800J826525J979589J854956J608849J579046
3518.3F85414493J772702J977861J850307J529157J545608J766741J854241J934230
3534.6F99645340J953364J823962J926481K198100K149523J736581J530528J709640
3551G14673519J861274J908541K014697K145290K178073K052307J992226K261281K404988
$$ plain form
3432.7 612251163 613684118 615046084 616122425 617192328 618585229 620243013 621959984 623658538
3449 623658538 625416458 627279818 629214287 631249130 633371651 635367811 637300611 639537632 641922951
3467.3 641922951 643887997 645349801 646818757 648611724 650641382 652605832 654272377 655921340
3483.6 655921340 657786250 659575284 661194503 662910581 664769769 666652858 668445110 670183361
3500 670183361 671982527 673629522 675036728 676565528 678392053 680371642 682226598 683835447 685414493
3518.3 685414493 687187195 689165056 691015363 692544520 694090128 695856869 697711110 699645340
3534.6 699645340 701598704 703422666 705349147 707547247 709696770 711433351 712963879 714673519
3551 714673519 716534793 718443334 720458031 722603321 724781394 726833701 728825927 731087208 733492196
3569.3G33492196K192258K126396K314031K494574K660751K799690K782822K671480
3585.6G53534198K556801K523541K534151K590120K678335K727568K687096K609253
3601.9G74441063K509475K342940K349793K483905K498150K423286K226710K233446
3618.3G93508768K420664K171993J757443J536191J710772J976907J735926J499355
3634.6H08318019J365244J286030J302660J263916J099765R76444J140415J110256
3650.9H17862749O05226M65214Q52585R44018N17130K38597K74480K34902J70409L20256
3671.3H22485566K83957Q1002M5002J46329K86699L73482M65632O44386N12004J12712
3691.7H25436771R4294K05636J72496J04428J03473J56761J40309K4140j11223l4809
$$ plain form
3569.3 733492196 735684454 737810850 740124881 742619455 745280206 748079896 750862718 753534198
3585.6 753534198 756090999 758614540 761148691 763738811 766417146 769144714 771831810 774441063
3601.9 774441063 776950538 779293478 781643271 784127176 786625326 789048612 791275322 793508768
3618.3 793508768 795929432 798101425 799858868 801395059 803105831 805082738 806818664 808318019
3634.6 808318019 809683263 810969293 812271953 813535869 814635634 815612078 816752493 817862749
3650.9 817862749 818467975 818933189 819785774 820729792 821246922 821485519 821759999 821994901 822165310 822485566
3671.3 822485566 822769523 822850525 822895527 823041856 823328555 823702037 824167669 824812055 825324059 825436771
3691.7 825436771 825531065 825736701 825909197 826013625 826117098 826273859 826414168 826438308 826327085 826292276
3712.1H26292276J49310J12414K0087j550n2869j59442j40012M173M0352m828J6928
3734.5H26276839J26481O4790l05235o38545l89933N6743j04785k15530L3676N4181
3754.9H24958682j17600j41859k7955p7247j68622j16765r4474j24156j14501o6936
3775.3H23908567j5437p3016k07364k23220j62184j43111j00970q2016j56164j60396
3795.7H22584689j10507j62721j49012j18792k05815j39594k9027j05262k21372j30891
3816.1H21211696j669j25587j51813j13368j34170r0838o6817r000K0146j64866l29912
3838.5H20043802k33710j04367j3769Q35j81437n31197p02440q9169L06070M5359j70827
3861H18369150j53601o4731j22726j90377n9366l636l7253p7844j65164j11401k0564
$$ plain form
3712.1 826292276 826441586 826554000 826574087 826572537 826519668 826360226 826220214 826224387 826264739 826259911 826276839
3734.5 826276839 826403320 826468110 826162875 825524330 825134397 825191140 825086355 824870825 824904501 824958682
3754.9 824958682 824841082 824699223 824671268 824594021 824425399 824308634 824214160 824090004 823975503 823908567
3775.3 823908567 823893130 823820114 823612750 823389530 823227346 823084235 822983265 822901249 822745085 822584689
3795.7 822584689 822474182 822311461 822162449 822043657 821837842 821698248 821669221 821563959 821342587 821211696
3816.1 821211696 821210027 821084440 820932627 820819259 820685089 820594251 820527434 820518434 820538580 820373714 820043802
3838.5 820043802 819810092 819705725 819691956 819692791 819511354 818980157 818277717 818188548 818494618 818539977 818369150
3861 818369150 818215549 818150818 818028092 817837715 817778349 817774713 817737460 817659616 817494452 817383051 817362487
3883.4H17362487m3511j08540j77801j56879n7698n0783j39534j95623j95443j55390
3903.8H16081285m6610J013n0426q4281q5532o5506l5166q1182j71125j45912m3273
3926.2H15273285m0770o5326k4498j8179p4327j23024j60039j28507l9876n7340r9360
3948.7H14442039o4612l5047m1187o4075p8619q0704q9944r7334p7367l6597N722J3172
3973.1H13795447j8358o1989j04606o4611r775j02401k01822j58071p4089m9591m8160
3995.6H12901974n5075
3997.6H12846899
$$ plain form
3883.4 817362487 817318976 817210436 817032635 816875756 816818058 816767275 816627741 816432118 816236675 816081285
3903.8 816081285 816034675 816035688 815985262 815900981 815815449 815749943 815714777 815633595 815462470 815316558 815273285
3926.2 815273285 815232515 815167189 815142691 815124512 815050185 814927161 814767122 814638615 814598739 814541399 814442039
3948.7 814442039 814377427 814342380 814301193 814237118 814158499 814077795 813987851 813890517 813813150 813776553 813782275 813795447
3973.1 813795447 813777089 813715100 813610494 813545883 813536108 813433707 813231885 813073814 812999725 812950134 812901974
3995.6 812901974 812846899
3997.6 812846899
##END=$$ End of the data block
