##TITLE=J 203 $$ Begin of the data block
##JCAMP-DX=5.00 $$ ACD/SpecManager v 10.08
##DATE=07 Oct 2014 10:20:24
##DATA TYPE=INFRARED SPECTRUM
##DATA CLASS=XYDATA
##ORIGIN=Marcelo Quint
##OWNER=
##NPOINTS=1765
##FIRSTX=399.76428223
##LASTX=3997.64306641
##MAXX=3997.64306641
##MINX=399.76428223
##MAXY=0.84685433
##MINY=0.08444894
##XFACTOR=1.0000000000
##YFACTOR=1.000000000000000e-9
##FIRSTY=0.81930602
##DELTAX=2.03961372
##XUNITS=1/CM
##YUNITS=ARBITRARY UNITS
##XYDATA=(X++(Y..Y))
$$ plain form
399.8 819306016 816309690 813577354 811622798 809963822 807791591 805367410 803367496 802210391
416.1 802210391 801211059 799112260 797084987 796222270 796466351 797599018 799197257 800927043 802599132
434.4 802599132 804125309 805504858 806989491 808967113 810894191 811962545 812721193 813740432 814526439
452.8 814526439 815000057 815376163 815171838 814342022 813179612 811829388 810405076 808837593 807164311
471.2 807164311 805195272 802879333 800526321 798276186 796467245 795055449 793406129 791174889
487.5 791174889 788272083 784664810 780284762 775318444 771145463 769894361 772259057 777015269
503.8 777015269 782925546 789002001 793775618 796699107 798449755 799815714 801004767 802032471
520.1 802032471 803097427 804361045 805865586 807524979 809485853 811916053 814411461 816602826
$$ packed form
399.8H19306016k996326k732336j954556j658976k172231k424181j999914j157105
416.1H02210391r99332k098799k027273q62717K44081J132667J598239J729786J672089
434.4H02599132J526177J379549J484633J977622J927078J068354P58648J019239P86007
452.8H14526439M73618L76106k04325q29816j162410j350224j424312j567483j673282
471.2H07164311j969039k315939k353012k250135j808941j411796j649320k231240
487.5G91174889k902806l607273m380048m966318m172981j251102K364696M756212
503.8G77015269N910277O076455M773617K923489J750648J365959J189053J027704
520.1H02032471J064956J263618J504541J659393J960874K430200K495408K191365
$$ plain form
536.4 816602826 818726122 820897460 822995424 825132787 827216923 829104066 831024587 832852781
552.7 832852781 834166527 835278511 836648107 838061631 839270473 840165317 840747476 841208339 841695309
571.1 841695309 842228591 842652261 842710495 842531681 842544079 842696726 842717230 842595398 842513740 842534781 842319489
593.5 842319489 841716111 841221452 841183484 841153264 840771556 840206623 839688540 839287937 838878453 838436604
613.9 838436604 837953091 837303162 836475790 835392773 833899915 831800997 827705443 821741819 819546103
632.3 819546103 823981583 829348922 831475437 831611037 831231058 830720723 830053091 829246104 828507423
650.6 828507423 827873886 827145040 826370180 825554132 824469388 823272407 822358370 821357012 819280744
669 819280744 816870570 814372003 810993731 806985617 803985476 803313613 804291368 805281997 805405736
$$ packed form
536.4H16602826K123296K171338K097964K137363K084136J887143J920521J828194
552.7H32852781J313746J111984J369596J413524J208842Q94844N82159M60863M86970
571.1H41695309N33282M23670N8234j78814J2398J52647K0504j21832q1658K1041k15292
593.5H42319489o03378m94659l7968l0220l81708n64933n18083m00603m09484m41849
613.9H38436604m83513o49929q27372j083017j492858k098918m095554n963624k195716
632.3H19546103M435480N367339K126515J35600l79979n10335o67632q06987p38681
650.6H28507423o33537p28846p74860q16048j084744j196981r14037j001358k076268
669H19280744k410174k498567l378272m008114l000141o71863R77755R90629J23739
$$ plain form
687.3 805405736 804435253 802320004 798949242 793494880 785088003 774413466 763832867 755163670
703.7 755163670 748100460 741558850 735313058 728540361 716975093 692815959 645438433 561766267
720 561766267 440869629 316579700 238969058 226843581 260563672 318517238 395074695
734.3 395074695 491068155 598950863 697951615 768957973 809461534 829118669 837767899
748.5 837767899 841108024 841967523 841790855 841151237 840238810 839126050 837825835 836287796 834450364
766.9 834450364 832435966 830393910 828335106 826144099 823575914 820388079 816193342 810150027
783.2 810150027 801208436 788909733 774171650 760657966 755218208 762052119 775361061 784691870
799.5 784691870 786905229 785789669 784401715 783466697 783007205 782915890 783116877 783539176 783987641
$$ packed form
687.3H05405736r70483k115249l370762n454362q406877j0674537j0580599q669197
703.7G55163670p063210o541610o245792o772697j1565268k4159134m7377526q3672166
720E61766267j20896638j24289929p7610642j2125477L3720091N7953566P6557457
734.3C95074695R5993460J07882708R9000752P1006358M0503561J9657135Q649230
748.5H37767899L340125Q59499j76668o39618r12427j112760j300215j538039j837432
766.9H34450364k014398k042056k058804k191007k568185l187835m194737o043315
783.2H10150027q941591j2298703j4738083j3513684n439758O833911J3308942R330809
799.5G84691870K213359j115560j387954r35018m59492r1315K00987M22299M48465
$$ plain form
817.9 783987641 784062684 783408999 781982124 779867351 777046561 773377180 768837333 763779640 758870482
836.2 758870482 754909396 752435684 751325011 750980139 750892043 751020491 751512051 752271891 753047526
854.6 753047526 753415644 752490878 748768389 740107119 724192739 699849486 668952823 638560891
870.9 638560891 619284689 617715359 631575286 653131008 674944878 692826748 705789149 714290619
887.2 714290619 719019175 720804572 720730543 720234096 721042335 724809706 732439756 743600965 756985009
905.6 756985009 770773292 783111572 792904913 800019145 804766476 807676554 809295177 810032189
921.9 810032189 810241222 810133755 809778512 809194863 808396459 807472169 806523323 805609047 804737270 803828359
942.3 803828359 802786291 801586390 800230622 798703492 796963930 794853926 792208731 788968623
$$ packed form
817.9G83987641P5043o53685j426875k114773k820790l669381m539847n057693m909158
836.2G58870482l961086k473712j110673l44872q8096J28448M91560P59840P75635
854.6G53047526L68118r24766l722489q661270j5914380k4343253l0896663l0391932
870.9F38560891j9276202j569330J3859927K1555722K1813870J7881870J2962401Q501470
887.2G14290619M728556J785397p4029m96447Q08239L767371P630050J1161209J3384044
905.6G56985009J3788283J2338280R793341P114232M747331K910078J618623P37012
921.9H10032189K09033j07467l55243n83649p98404r24290r48846r14276q71777r08911
942.3H03828359j042068j199901j355768j527130j739562k110004k645195l240108
$$ plain form
958.6 788968623 785050750 780308425 774796367 768987060 763657570 759691477 757701039 757685244 759052694
977 759052694 761026978 763110340 765055954 766613662 767563760 767831922 767415643 766258359 764253974
995.3 764253974 761305451 757266343 751802206 743941844 731631696 711796165 678963661 623144448
1011.6 623144448 541929483 463323683 432998359 465573907 529531538 584564924 614949942
1025.9 614949942 626015604 627134085 624015987 618648469 611512601 603528857 596675038 593482137
1042.2 593482137 596005738 604857087 619109869 636843324 655588865 672815144 686400115 694953322
1058.6 694953322 698037088 696204007 690415442 681202233 668388367 651222229 628331363 598024249
1074.9 598024249 559531331 514265358 465817630 418038279 372649103 329116285 286916286
$$ packed form
958.6G88968623l917873m742325n512058n809307n329490l966093j990438j5795J367450
977G59052694J974284K083362J945614J557708R50098K68162m16279j157284k004385
995.3G64253974k948523m039108n464137p860362j2310148j9835531l2832504n5819213
1011.6F23144448q1214965p8605800l0325324L2575548O3957631N5033386L0385018
1025.9F14949942J1065662J118481l118098n367518p135868p983744o853819l192901
1042.2E93482137K523601Q851349J4252782J7733455J8745541J7226279J3584971Q553207
1058.6F94953322L083766j833081n788565r213209j2813866j7166138k2890866l0307114
1074.9E98024249l8492918m5265973m8447728m7779351m5389176m3532818m2199999
$$ plain form
1089.2 286916286 247395352 213426977 187845573 172418073 167792007 173655927 188950807 211705208
1105.5 211705208 237870321 260173708 270961493 268420130 258362800 249332815 247595444 255708933
1121.8 255708933 272923172 296010852 320663214 343649179 364212185 383673340 404177904
1136.1 404177904 427855372 456471324 490853488 530154169 571846902 612641931 649542153
1150.3 649542153 680469573 704374969 721291006 732209861 738464475 740713179 738287568 729967892
1166.7 729967892 716313481 701372445 690920293 688666821 694623530 706320643 720297754 733029485
1183 733029485 742118239 746942282 748056352 746343076 742606580 737532496 731734753 725678027 719555140
1201.3 719555140 713286400 706758201 699880362 692381322 683849216 673955500 662401557 648714364
$$ packed form
1089.2B86916286l9520934l3968375k5581404j5427500m626066N863920J5294880K2754401
1105.5B11705208K6165113K2303387J0787785k541363j0057330r029985j737371Q113489
1121.8B55708933J7214239K3087680K4652362K2985965K0563006J9461155K0504564
1136.1D04177904K3677468K8615952L4382164L9300681M1692733M0795029L6900222
1150.3F49542153L0927420K3905396J6916037J0918855O254614K248704k425611q319676
1166.7G29967892j3654411j4941036j0452152k253472N956709J1697113J3977111J2731731
1183G33029485R088754M824043J114070j713276l736496n074084n797743o056726o122887
1201.3G19555140o268740o528199o877839p499040q532106r893716j1553943j3687193
$$ plain form
1217.7 648714364 632279694 612400532 588031411 557461381 518381000 468675792 408349663
1231.9 408349663 341597944 276384294 220858008 179593325 152521595 136708051 128523558
1246.2 128523558 124884322 123493358 122485399 120286703 116152622 110790737 106113069 104188465
1262.5 104188465 106098324 112080120 121890254 134476960 147518799 158247948 165224314 169013351
1278.8 169013351 171369061 174062252 178488031 185645953 196459517 211944193 233423382 262360811
1295.2 262360811 299467713 342991561 387834758 428568661 464225739 497923523 531454980
1309.4 531454980 563733816 593098581 618918359 642337918 664932370 687061071 708020568
1323.7 708020568 726013303 738381565 742368817 735611200 717962801 693792880 671793222 661966264
$$ packed form
1217.7F48714364j6434670j9879162k4369121l0570030l9080381m9705208o0326129
1231.9D08349663o6751719o5213650n5526286m1264683k7071730j5813544q184493
1246.2A28523558l639236j390964j007959k198696m134081n361885m677668j924604
1262.5A04188465J909859N981796R810134J2586706J3041839J0729149O976366L789037
1278.8A69013351K355710K693191M425779P157922J0813564J5484676K1479189K8937429
1295.2B62360811L7106902M3523848M4843197M0733903L5657078L3697784L3531457
1309.4E31454980L2278836K9364765K5819778K3419559K2594452K2128701K0959497
1323.7G08020568J7992735J2368262L987252o757617j7648399k4169921k1999658r826958
$$ plain form
1340 661966264 669281006 690187633 716817200 741423011 759754777 771188438 776668429 776885808
1356.4 776885808 771769762 759462714 736403704 704798996 673754692 650665283 640821695 644766092
1372.7 644766092 658707023 676656127 694318473 709441483 720120192 725674629 725716829 720484972
1389 720484972 712080479 700929523 685778320 666862965 642272413 610242963 567527175 511050224
1405.3 511050224 459468246 444089890 482453316 560802460 643292069 708969414 753193736
1419.6 753193736 774782479 782793283 783752263 778855562 767890513 752389252 735864103 717805862
1435.9 717805862 700304031 689330935 683409333 679748952 676756620 672773838 668332040 665764451
1452.2 665764451 667495728 676908791 694218814 711836874 729535699 749352455 766920388 778528273
$$ packed form
1340F61966264P314742K0906627K6629567K4605811J8331766J1433661N479991K17379
1356.4G76885808n116046j2307048k3059010l1604708l1044304k3089409r843588L944397
1372.7F44766092J3940931J7949104J7662346J5123010J0678709N554437M2200n231857
1389G20484972q404493j1150956j5151203j8915355k4590552l2029450m2715788n6476951
1405.3E11050224n1581978j5378356L8363426P8349144Q2489609O5677345M4224322
1419.6G53193736K1588743Q010804R58980m896701j0965049j5501261j6525149j8058241
1435.9G17805862j7501831j0973096n921602l660381k992332l982782m441798k567589
1452.2F65764451J731277R413063J7310023J7618060J7698825J9816756J7567933J1607885
$$ plain form
1468.5 778528273 786847830 793908060 798926890 802391529 805633783 809013128 812244356 815236568
1484.9 815236568 818296015 820663810 820686877 818511605 813855112 802689433 780901730 751130879
1501.2 751130879 724527955 717977047 745856643 778785467 796691537 806407750 811461091 813613832
1517.5 813613832 814059198 813451529 812448442 811996043 812076032 812942386 814827323 817075968 818773925
1535.8 818773925 820379078 821733713 821597338 820491552 819068193 817849457 816753328 815572023
1552.2 815572023 814534903 813927591 812493205 808484733 804706216 801255941 796908021 790296793
1568.5 790296793 779638469 767014146 752039790 735579908 731327295 743192673 763559699
1582.8 763559699 782455385 794372916 800222874 802721322 803552866 803160667 801554441 799052358
$$ packed form
1468.5G78528273Q319557P060230N018830L464639L242254L379345L231228K992212
1484.9H15236568L059447K367795K3067k175272m656493j1165679k1787703k9770851
1501.2G51130879k6602924o550908K7879596L2928824J7906070R716213N053341K152741
1517.5H13613832M45366o07669j003087m52399P9989Q66354J884937K248645J697957
1535.8H18773925J605153J354635j36375j105786j423359j218736j096129j181305
1552.2H15572023j037120o07312j434386m008472l778517l450275m347920o611228
1568.5G90296793j0658324j2624323j4974356j6459882m252613J1865378K0367026
1582.8G63559699J8895686J1917531N849958K498448Q31544l92199j606226k502083
$$ plain form
1599.1 799052358 796084881 792797744 789065838 784445882 778746307 773165882 770182610 771890521
1615.4 771890521 778005302 783674300 786840141 787969768 787624180 786763966 785740077 785071731 784772813
1633.7 784772813 783844292 782053232 780513108 779416502 778691709 777725160 776084542 775023937 773952305
1652.1 773952305 770560443 766605318 763084352 758824408 752875209 745867014 739620924 732881427
1668.4 732881427 724509597 716625690 708013177 697769403 688519478 680591166 672123909 661251485
1684.7 661251485 651871085 644077003 634488225 623127460 606288731 582266629 550355434 503732622
1701.1 503732622 455402195 400790125 332760930 266123593 207436278 159649745 123877123
1715.3 123877123 99275753 87299317 84448941 85746832 89726344 96649610 106647700 120877616
$$ packed form
1599.1G99052358k967477l287137l731906m619956n699575n580425k983272J707911
1615.4G71890521O114781N668998L165841J129627l45588q60214j023889o68346k98918
1633.7G84772813r28521j791060j540124j096606p24793r66549j640618j060605j071632
1652.1G73952305l391862l955125l520966m259944n949199p008195o246090o739497
1668.4G32881427q371830p883907q612513j0243774r249925p928312q467257j0872424
1684.7F61251485r380400p794082r588778j1360765j6838729k4022102l1911195m6622812
1701.1E03732622m8330427n4612070o8029195o6637337n8687315m7786533l5772622
1715.3A23877123k4601370j1976436k850376J297891L979512O923266R998090J4229916
$$ plain form
1731.7 120877616 145165190 180232584 222680286 284946024 366556317 453105479 536356926
1745.9 536356926 609506011 670386314 715210319 743980289 764416873 780356526 791876972
1760.2 791876972 800732255 807236135 812247097 816548824 819924772 822477102 824241221 825640202
1776.5 825640202 827005386 828339219 829433441 830409527 831198096 832087517 833124995 833711565 833828986
1794.9 833828986 834032178 834385276 834503770 834246099 833877802 833691001 833500564 833090842 832471073 831885219
1815.3 831885219 831387937 830981672 830926597 831275940 831792295 832398057 833177745 833880246 834634125 835609436
1835.7 835609436 836671531 837814629 839169443 840565443 841550767 842236221 842861056 843529463 844191909
1854 844191909 844774127 845252693 845597029 845841050 846170247 846647739 846854329 846486151 845966935 845693946
$$ packed form
1731.7A20877616K4287574L5067394M2447702O2265738Q1610293Q6549162Q3251447
1745.9E36356926P3149085O0880303M4824005K8769970K0436584J5939653J1520446
1760.2G91876972Q855283O503880N010962M301727L375948K552330J764119J398981
1776.5H25640202J365184J333833J094222R76086P88569Q89421J037478N86570J17421
1794.9H33828986K03192L53098J18494k57671l68297j86801j90437m09722o19769n85854
1815.3H31885219m97282m06265n5075L49343N16355O05762P79688P02501P53879R75311
1835.7H35609436J062095J143098J354814J396000R85324O85454O24835O68407O62446
1854H44191909N82218M78566L44336K44021L29197M77492K06590l68178n19216k72989
$$ plain form
1874.4 845693946 845540822 845354736 845092595 844774961 844427943 844107330 843741298 843129933 842445433 841779590
1894.8 841779590 841034830 840306520 839679420 839097083 838593602 838151932 837588787 836830437 836061954 835474551
1915.2 835474551 834909141 834174573 833377659 832511187 831496656 830474913 829471350 828394830 827174902
1933.6 827174902 825812280 824412346 823082149 821716428 820172250 818777382 817884207 817524612 817596138
1951.9 817596138 818010986 818675816 819507897 820496500 821618438 822826385 823969781 824873745 825595140
1970.3 825595140 826288939 826919138 827398181 827746749 828038394 828339219 828692615 829106688 829582512 830132723
1990.7 830132723 830652297 831111372 831603229 832109809 832559586 832966447 833386838 833775103 834078848 834345400
2011.1 834345400 834638059 834981978 835287273 835449159 835542917 835657835 835790217 835916281 836035550 836135447
$$ packed form
1874.4H45693946j53124j86086k62141l17634l47018l20613l66032o11365o84500o65843
1894.8H41779590p44760p28310o27100n82337n03481m41670n63145p58350p68483n87403
1915.2H35474551n65410p34568p96914q66472j014531j021743j003563j076520j219928
1933.6H27174902j362622j399934j330197j365721j544178j394868q93175l59595P1526
1951.9H17596138M14848O64830Q32081R88603J121938J207947J143396R03964P21395
1970.3H25595140O93799O30199M79043L48568K91645L00825L53396M14073M75824N50211
1990.7H30132723N19574M59075M91857N06580M49777M06861M20391L88265L03745K66552
2011.1H34345400K92659L43919L05295J61886R3758J14918J32382J26064J19269R9897
$$ plain form
2031.5 836135447 836176455 836186230 836190999 836152256 836011589 835781217 835542977 835322440 835087657 834817827 834513247
2053.9 834513247 834176302 833804548 833418608 833054006 832691491 832271874 831791282 831307411 830866396 830490112
2074.3 830490112 830149174 829758942 829337060 829010487 828789592 828574598 828318894 828027129 827734232 827466726
2094.7 827466726 827200532 826948464 826769769 826661289 826570392 826452374 826311231 826209545 826146305 826083779
2115.1 826083779 826049387 826041877 826039255 826063931 826121628 826176763 826218724 826254845 826259851 826252639 826244533 826240122 826299310
2141.6 826299310 826417089 826533437 826647103 826804221 826995492 827233195 827553570 827877700 828129411 828359902
2162 828359902 828633487 828941286 829259515 829545975 829736531 829827070 829890132 830012202 830192864 830334485
2182.4 830334485 830390632 830382645 830359042 830387235 830442548 830440223 830349863 830186963 829954505 829679728 829403341
$$ packed form
2031.5H36135447M1008R775M769l8743j40667k30372k38240k20537k34783k69830l04580
2053.9H34513247l36945l71754l85940l64602l62515m19617m80592m83871m41015l76284
2074.3H30490112l40938l90232m21882l26573k20895k14994k55704k91765k92897k67506
2094.7H27466726k66194k52068j78695j08480r0897j18018j41143j01686o3240o2526
2115.1H26083779l4392p510k622K4676N7697N5135M1961L6121N006p212q106m411N9188
2141.6H26299310J17779J16348J13666J57118J91271K37703L20375L24130K51711K30491
2162H28359902K73585L07799L18229K86460J90556R0539O3062J22070J80662J41621
2182.4H30334485N6147p987k3603K8193N5313k325r0360j62900k32458k74777k76387
$$ plain form
2204.8 829403341 829138458 828930199 828812003 828754961 828721285 828687847 828615367 828470170 828240335 827966392
2225.2 827966392 827761352 827670157 827630699 827603221 827570617 827508688 827434897 827353358 827214062 827029467 826881588
2247.7 826881588 826776862 826674581 826574743 826497793 826454043 826455295 826500952 826546371 826555312 826501071 826352477
2270.1 826352477 826081216 825709879 825278223 824787617 824318707 824002206 823889196 823963165 824176192 824527681
2290.5 824527681 825025558 825573385 826112092 826656103 827161610 827564836 827910364 828282833 828611851 828817666
2310.9 828817666 828923523 828963697 828959107 828896463 828796983 828687727 828594863 828687429 828971326 829031169 828696430
2333.3 828696430 828375518 828299224 828277290 828184009 827975273 827529967 827127635 827138841 827450752 827665865
2353.7 827665865 827561080 827180386 826611996 826067805 825564921 824920535 824223399 823551893 822832942 822139621
$$ packed form
2204.8H29403341k64883k08259j18196n7042l3676l3438p2480j45197k29835k73943
2225.2H27966392k05040r1195l9458k7478l2604o1929p3791q1539j39296j84595j47879
2247.7H26881588j04726j02281r9838p6950m3750J252M5657M5419Q941n4241j48594
2270.1H26352477k71261l71337m31656m90606m68910l16501j13010P3969K13027L51489
2290.5H24527681M97877N47827N38707N44011N05507M03226L45528L72469L29018K05815
2310.9H28817666J05857M0174m590o2644r9480j09256r2864R2566K83897N9843l34739
2333.3H28696430l20912p6294k1934r3281k08736m45306m02332J1206L11911K15113
2353.7H27665865j04785l80694n68390n44191n02884o44386o97136o71506p18951o93321
$$ plain form
2374.1 822139621 821512878 820846260 820128560 819456935 818923950 818584561 818437040 818445265 818536520 818648100
2394.5 818648100 818790436 818975329 819169879 819365203 819592118 819862843 820149124 820407391 820638120 820876360
2414.9 820876360 821134984 821406484 821654260 821874201 822128177 822433650 822744191 823015273 823242307 823450685
2435.3 823450685 823638141 823783457 823917270 824061275 824154258 824199736 824259996 824302971 824307263 824311614 824316144
2457.8 824316144 824303329 824279487 824226260 824114323 823959053 823821127 823739827 823658764 823522031 823356152
2478.1 823356152 823161125 822926342 822691619 822461545 822212219 821939826 821624398 821299672 821041584 820815146
2498.5 820815146 820574105 820393503 820267677 820084572 819899797 819792747 819672704 819518805 819373965 819221318
2518.9 819221318 819075346 818947792 818823218 818738043 818706632 818687320 818659425 818654239 818682015 818689585 818666041
$$ packed form
2374.1H22139621o26743o66618p17700o71625n32985l39389j47521Q225R1255J11580
2394.5H18648100J42336J84893J94550J95324K26915K70725K86281K58267K30729K38240
2414.9H20876360K58624K71500K47776K19941K53976L05473L10541K71082K27034K08378
2435.3H23450685J87456J45316J33813J44005R2983M5478O0260M2975M292M351M530
2457.8H24316144j2815k3842n3227j11937j55270j37926q1300q1063j36733j65879
2478.1H23356152j95027k34783k34723k30074k49326k72393l15428l24726k58088k26438
2498.5H20815146k41041j80602j25826j83105j84775j07050j20043j53899j44840j52647
2518.9H19221318j45972j27554j24574q5175l1411j9312k7895n186K7776P570k3544
$$ plain form
2541.4 818666041 818652034 818629444 818561494 818502903 818498373 818519354 818548560 818578422 818587303 818583488 818599105 818641961
2565.8 818641961 818688333 818685889 818674862 818746388 818841517 818866551 818874657 818967760 819137812 819320738 819490671
2588.3 819490671 819673479 819905937 820161164 820375204 820496082 820549905 820596695 820596576 820512891 820418537 820387304
2610.7 820387304 820402503 820410013 820381701 820296824 820152938 819952607 819722831 819543004 819512725 819681823 819970369
2633.2 819970369 820306599 820675254 820999801 821227729 821389139 821527302 821617723 821621060 821581960 821585655 821648836
2655.6 821648836 821703076 821729481 821753919 821756661 821709454 821633637 821609378 821625531 821597278 821548223 821528792 821536660
2680.1 821536660 821555316 821574986 821578801 821531594 821457565 821401954 821376264 821344852 821235120 821113884 821067333
2702.5 821067333 820997357 820855975 820715487 820601583 820498049 820410132 820333123 820236146 820078433 819841206
$$ packed form
2541.4H18666041j4007k2590o7950n8591m530K0981K9206K9862Q881l815J5617M2856
2565.8H18641961M6372k444j1027P1526R5129K5034Q106R3103J70052J82926J69933
2588.3H19490671J82808K32458K55227K14040J20878N3823M6790j19q3685r4354l1233
2610.7H20387304J5199P510k8312q4877j43886k00331k29776j79827l0279J69098K88546
2633.2H19970369L36230L68655L24547K27928J61410J38163R0421L337l9100L695O3181
2655.6H21648836N4240K6405K4438K742m7207p5817k4259J6153k8253m9055j9431P868
2680.1H21536660J8656J9670L815m7207p4029n5611k5690l1412j09732j21236m6551
2702.5H21067333o9976j41382j40488j13904j03534q7917p7009r6977j57713k37227
$$ plain form
2722.9 819841206 819575071 819375813 819255948 819118142 818935454 818776548 818651259 818513691 818348289 818163812
2743.3 818163812 817947090 817686915 817432165 817230523 817058146 816906989 816824675 816829443 816863716 816832483
2763.7 816832483 816739678 816686869 816684663 816665471 816604853 816522062 816429853 816307783 816144109 815944076 815721095
2786.1 815721095 815514147 815325379 815136135 814937651 814671695 814342737 814041257 813779294 813558340 813415527
2806.5 813415527 813384831 813510954 813696980 813763559 813670278 813470960 813234627 812972009 812630892 812192023
2826.9 812192023 811673343 811099708 810506105 809895694 809230268 808497250 807676375 806690514 805480421
2845.3 805480421 804132104 802779198 801452994 800215483 799135268 798215449 797460437 796791553 796096146
2863.6 796096146 795344472 794507980 793531954 792471707 791433871 790377080 789161623 787653387 785840571
$$ packed form
2722.9H19841206k66135j99258j19865j37806j82688j58906j25289j37568j65402j84477
2743.3H18163812k16722k60175k54750k01642j72377j51157q2314M768L4273l1233
2763.7H16832483r2805n2809k206j9192o0618q2791r2209j22070j63674k00033k22981
2786.1H15721095k06948j88768j89244j98484k65956l28958l01480k61963k20954j42813
2806.5H13415527l0696J26123J86026O6579r3281j99318k36333k62618l41117m38869
2826.9H12192023n18680n73635n93603o10411o65426p33018q20875r85861j210093
2845.3H05480421j348317j352906j326204j237511j080215r19819p55012o68884o95407
2863.6G96096146p51674q36492r76026j060247j037836j056791j215457j508236j812816
$$ plain form
2882 785840571 783951759 782308877 781142414 780612528 780781448 781494021 782481909 783462346 784162998
2900.3 784162998 784539044 784808636 785259128 786055803 787135959 788376749 789660811 790801346 791647911
2918.7 791647911 792079508 792055309 791658580 790904224 789740264 788083792 785728097 782433927 778044164
2937 778044164 772418559 765487850 757416368 748589098 739513993 730773568 722882271 716176927 710943162
2955.4 710943162 707552910 706317961 707200050 709846616 713837564 718738854 724152386 729774833
2971.7 729774833 735279322 740374804 745033085 749355078 753353417 757048666 760501385 763741314
2988 763741314 766785800 769573689 772029161 774234354 776307166 778270006 780189037 782224834 784449160
3006.4 784449160 786772907 789060771 791242301 793359816 795426309 797309220 798907638 800247908
$$ packed form
2882G85840571j888812j642882j166463n29886J68920P12573R87888R80437P00652
2900.3G84162998L76046K69592M50492P96675J080156J240790J284062J140535Q46565
2918.7G91647911M31597k4199l96729p54356j163960j656472k355695l294170m389763
2937G78044164n625605o930709q071482q827270r075105q740425p891297o705344n233765
2955.4G10943162l390252j234949Q82089K646566L990948M901290N413532N622447
2971.7G29774833N504489N095482M658281M321993L998339L695249L452719L239929
2988G63741314L044486K787889K455472K205193K072812J962840J919031K035797K224326
3006.4G84449160K323747K287864K181530K117515K066493J882911J598418J340270
$$ plain form
3022.7 800247908 801430464 802597404 803782105 804850519 805681527 806247473 806478620 806316495 805683017
3041.1 805683017 804289699 801892042 798575580 794858515 791670322 789846957 789595127 790323973 791084647
3059.4 791084647 791319549 791031182 790561855 790304005 790408313 790765047 791140199 791337430 791353941 791387975
3079.8 791387975 791783333 792805672 794393241 796210408 797794521 798764586 798971593 798473656 797527254
3098.2 797527254 796562135 796032727 796215713 797141016 798610866 800278902 801871896 803291082 804401934
3116.5 804401934 805017412 805108905 804835141 804490387 804356635 804600358 805245101 806084812 806865692 807577610
3136.9 807577610 808271289 808839023 809219182 809488773 809707880 809874535 810007632 810121596 810245156 810410440
3157.3 810410440 810554683 810617149 810643613 810682893 810685813 810647845 810598135 810499847 810396791 810350895 810362279
$$ packed form
3022.7H00247908J182556J166940J184701J068414Q31008N65946K31147j62125o33478
3041.1H05683017j393318k397657l316462l717065l188193j823365k51830P28846P60674
3059.4G91084647K34902k88367m69327k57850J04308L56734L75152J97231J6511L4034
3079.8G91387975L95358J022339J587569J817167J584113R70065K07007m97937r46402
3098.2G97527254r65119n29408J82986R25303J469850J668036J592994J419186J110852
3116.5H04401934O15478R1493k73764l44754j33752K43723O44743Q39711P80880P11918
3136.9H07577610O93679N67734L80159K69591K19107J66655J33097J13964J23560J65284
3157.3H10410440J44243O2466K6464L9280K920l7968m9710r8288j03056m5896J1384
$$ plain form
3179.8 810362279 810383856 810303926 810140729 810037732 810022056 810042918 810052931 810039341 810046554 810087860 810141385
3202.2 810141385 810140789 810045183 809928656 809861302 809810936 809719622 809563458 809314489 809020460 808795750 808646560
3224.6 808646560 808528543 808459938 808419287 808394730 808414042 808411658 808326364 808223009 808246851 808409512 808510780
3247.1 808510780 808465064 808418691 808421195 808357298 808220506 808109820 808054566 808034301 808022141 807973742 807919085
3269.5 807919085 807874441 807778895 807635665 807514250 807471454 807425499 807273865 807028472 806752920 806572080
3289.9 806572080 806487918 806347251 806108236 805853069 805706382 805739045 805849493 805939555 805973113 805921376
3310.3 805921376 805832386 805766881 805708945 805585384 805399597 805232167 805050194 804759085 804406047 804137111
3330.7 804137111 803980231 803902328 803971350 804171979 804376423 804559886 804797709 805103242 805454135 805835068
$$ packed form
3179.8H10362279K1577p9930j63197j02997j5676K0862J0013j3590P213M1306N3525
3202.2H10141385n96r5606j16527o7354n0366r1314j56164k48969k94029k24710j49190
3224.6H08646560j18017o8605m0651k4557J9312k384q5294j03355K3842J62661J01268
3247.1H08510780m5716m6373K504o3897j36792j10686n5254k0265j2160m8399n4657
3269.5H07919085m4644r5546j43230j21415m2796m5955j51634k45393k75552j80840
3289.9H06572080q4162j40667k39015k55167j46687L2663J10448R0062L3558n1737
3310.3H05921376q8990o5505n7936j23561j85787j67430j81973k91109l53038k68936
3330.7H04137111j56880p7903O9022K00629K04444J83463K37823L05533L50893L80933
$$ plain form
3351.1 805835068 806148529 806335449 806441724 806563139 806719124 806824267 806912422 807005703 807029247 807040155
3371.5 807040155 807065129 807008564 806869209 806731761 806672990 806637764 806501627 806244612 805958033 805752039
3391.9 805752039 805572033 805278718 804799616 804192305 803598702 803010106 802281618 801301599 800071418
3410.2 800071418 798749208 797457099 796135724 794735491 793232799 791697383 790306985 789090812
3426.5 789090812 788113952 787578881 787465453 787668109 788333952 789511561 790931404 792319238 793697059
3444.9 793697059 795189917 796647489 797966182 799233317 800391495 801367521 802253127 803117216 803882241
3463.2 803882241 804392576 804669738 805012167 805587649 806168854 806514144 806724727 806989133 807288826 807448030
3483.6 807448030 807472765 807500780 807455301 807305574 807147384 806978345 806865513 806848586 806752503 806487679
$$ packed form
3351.1H05835068L13461J86920J06275J21415J55985J05143Q8155R3281K3544J0908
3371.5H07040155K4974n6565j39355j37448n8771l5226j36137k57015k86579k05994
3391.9H05752039j80006k93315m79102o07311n93603n88596p28488r80019j230181
3410.2H00071418j322210j292109j321375j400233j502692j535416j390398j216173
3426.5G89090812r76860n35071j13428K02656O65843J177609J419843J387834J377821
3444.9G93697059J492858J457572J318693J267135J158178R76026Q85606Q64089P65025
3463.2H03882241N10335K77162L42429N75482N81205L45290K10583K64406K99693J59204
3483.6H07448030K4735K8015m5479j49727j58190j69039j12832j6927r6083k64824
$$ plain form
3504 806487679 806168377 805872560 805510879 805057764 804634571 804221034 803804278 803480208 803242028 802917957
3524.4 802917957 802370667 801672339 800973058 800466061 800167680 799808681 799300253 798894346 798821807 798884273
3544.8 798884273 798674703 798344493 798213184 798215032 798324049 798678994 799300075 800074816 801085830 802332938
3565.2 802332938 803142607 803214610 803286791 803758919 804463625 805140138 805746675 806382418 807129443 807955563
3585.6 807955563 808286548 807835758 807409048 807316363 807139516 806751311 806270421 805762827 805505514 805509210
3606 805509210 805308700 804795563 804232776 803685725 803332686 803027153 802385211 801823914 801858723 802386463
3626.4 802386463 802626312 802182078 801887274 801906168 802091897 802555978 803309321 804281235 805529237 807065308
3646.8 807065308 808334708 808765173 809047997 809748709 810581446 811265767 812016308 812966347 814132214
$$ packed form
3504H06487679l19302k95817l61681m53115m23193m13537m16756l24070k38180l24071
3524.4H02917957n47290o98328o99281n06997k98381l58999n08428m05907p2539O2466
3544.8G98884273k09570l30210j31309J848J09017L54945O21081P74741J011014J247108
3565.2H02332938Q09669P2003P2181M72128P04706O76513O06537O35743P47025Q26120
3585.6H07955563L30985m50790m26710r2685j76847l88205m80890n07594k57313L696
3606H05509210k00510n13137n62787n47051l53039l05533o41942n61297L4809N27740
3626.4H02386463K39849m44234k94804J8894J85729M64081P53343R71914J248002J536071
3646.8H07065308J269400M30465K82824P00712Q32737O84321P50541R50039J165867
$$ plain form
3665.2 814132214 815507352 816758692 817626297 818488777 819246709 819466710 819536865 819822609 820446312
3683.5 820446312 821430385 822584212 823457003 823859811 824099481 824391127 824834585 825408280 825871468
3701.9 825871468 826113522 826399624 826863110 827266753 827230275 826974094 826947927 827121675 827351391 827598810
3722.3 827598810 827727735 827517390 827239096 827396333 828086734 828655481 828306437 827734590 827804387 828219235
3742.7 828219235 828275383 828021705 827936828 827751875 827235103 826885819 826844990 826823890 826760173 826825798 827048242
3765.1 827048242 827321827 827446520 827296257 827066064 827059150 827299178 827459216 827419817 827461243 827586353
3785.5 827586353 827547789 827390313 827367425 827528954 827709198 827821493 827826917 827625990 827436864 827364802
3805.9 827364802 827245414 827214360 827415049 827688515 827896953 828155994 828209996 827884078 827720582 827731192
$$ packed form
3665.2H14132214J375138J251340Q67605Q62480P57932K20001P0155K85744O23703
3683.5H20446312R84073J153827Q72791M02808K39670K91646M43458N73695M63188
3701.9H25871468K42054K86102M63486M03643l6478k56181k6167J73748K29716K47419
3722.3H27598810J28925k10345k78294J57237O90401N68747l49044n71847O9797M14848
3742.7H28219235N6148k53678q4877j84953n16772l49284m0829k1100o3717O5625K22444
3765.1H27048242K73585J24693j50263k30193o914K40028J60038l9399M1426J25110
3785.5H27586353l8564j57476k2888J61529J80244J12295N424k00927j89126p2062
3805.9H27364802j19388l1054K00689K73466K08438K59041N4002l25918j63496J0610
$$ plain form
3826.3 827731192 827729225 827810884 827992976 828338742 828684628 828683197 828439116 828118086 827792585 827739298 828136146
3848.7 828136146 828806698 828976274 828202784 827719629 827891767 828297317 828509748 828425765 828464150 828635395
3869.1 828635395 828548729 828245044 827969849 827972591 828252792 828509510 828579426 828372300 828062534 828019857
3889.5 828019857 828082383 827974319 827980816 828362763 828835428 828930378 828549147 827981353 827531278 827275276
3909.9 827275276 827209055 827329159 827565372 827718854 827687263 827598751 827505529 827351332 827294230 827452958
3930.3 827452958 827515662 827302337 827098310 827141225 827370346 827492535 827442467 827450752 827425361 827150941 826838017
3952.7 826838017 826760232 826821685 826827466 826772094 826657593 826477230 826327384 826235831 826177776 826177537 826172888 826069951
3977.2 826069951 825901449 825760067 825681567 825636744 825625837 825655222 825674534 825619042 825516760 825497329
$$ packed form
3826.3H27731192j967Q1659J82092L45766L45886j431k44081l21030l25501n3287L96848
3848.7H28136146O70552J69576p73490m83155J72138M05550K12431q3983L8385J71245
3869.1H28635395q6666l03685k75195K742K80201K56718O9916k07126l09766m2677
3889.5H28019857O2526j08064O497L81947M72665R4950l81231n67794m50075k56002
3909.9H27275276o6221J20104K36213J53482l1591q8512r3222j54197n7102J58728
3930.3H27452958O2704k13325k04027M2915K29121J22189n0068Q285k5391k74420l12924
3952.7H26838017p7785O1453N781n5372j14501j80363j49846r1553n8055k39m649j02937
3977.2H26069951j68502j41382p8500m4823j0907K9385J9312n5492j02282j9431
$$ plain form
3997.6 825497329
$$ packed form
3997.6H25497329
##END=$$ End of the data block
