##TITLE=J 189 $$ Begin of the data block
##JCAMP-DX=5.00 $$ ACD/SpecManager v 10.08
##DATE=07 Oct 2014 10:20:24
##DATA TYPE=INFRARED SPECTRUM
##DATA CLASS=XYDATA
##ORIGIN=Marcelo Quint
##OWNER=
##NPOINTS=1765
##FIRSTX=399.76428223
##LASTX=3997.64306641
##MAXX=3997.64306641
##MINX=399.76428223
##MAXY=0.81871510
##MINY=0.04614103
##XFACTOR=1.0000000000
##YFACTOR=1.000000000000000e-9
##FIRSTY=0.79639429
##DELTAX=2.03961372
##XUNITS=1/CM
##YUNITS=ARBITRARY UNITS
##XYDATA=(X++(Y..Y))
399.8G96394289m80175k191425k628445k678276l079772l061890l176570l823519l801167
418.1G71473050j766980k85565j85430M84287R50635J040160J262248J563430J908302
436.5G76444137J838088J596213J705229K060056K095758J683891J104415M45246P8440
454.8G89051473M4584k63512r02712j330674j624584j921713j991809k365410k932310
473.2G75763333k817273k579391k465964k124011j920581k168477k693414l328920
489.5G55665302m227757n178571n344212m215896j726806J828372N097807O515443
505.8G48413682O347179N069435L216267J872360J299858J064778J018226J197159
522.1G69498944J486838J751304K123177K356768K234518K235234K530277K680361
$$ y = [796394289, 795914114, 793722689, 791094244, 788415968, 785336196, 782274306, 779097736, 775274217, 771473050, 769706070, 769420505, 769235075, 769719362, 770669997, 771710157, 772972405, 774535835, 776444137, 778282225, 779878438, 781583667, 783643723, 785739481, 787423372, 788527787, 788973033, 789051473, 789096057, 788832545, 787929833, 786599159, 784974575, 783052862, 781061053, 778695643, 775763333, 772946060, 770366669, 767900705, 765776694, 763856113, 761687636, 758994222, 755665302, 751437545, 746258974, 740914762, 736698866, 734972060, 736800432, 741898239, 748413682, 754760861, 759830296, 763046563, 764918923, 766218781, 767283559, 768301785, 769498944, 770985782, 772737086, 774860263, 777217031, 779451549, 781686783, 784217060, 786897421]
538.5G86897421K518415K300382K264857K283752K057910J881361J853883J591862
554.8H03649843J422524J567304J545906J054824L49700N4360L01599M25875J26958
573.1H10498893n6684J39594K83063O7293j32680r7572j05560k34783m76062o37889
593.5H09247613n48065l53336l31998n86748p21812o29306n72384n17368m81069o79433
613.9H03826094r31084r10163p72894q00729j132428k166152m943848p192135k865612
632.3G82111049M785597N984187K256453J4603n10275q04961r82880r08435p63416
650.6G91181922p52866r63450j100361j101613j255751j371860j438856k384067l121376
669G77691722j840055k061427l698170m711330l710806j055300J047849J192212J21355
$$ y = [786897421, 789415836, 791716218, 793981075, 796264827, 798322737, 800204098, 802057981, 803649843, 805072367, 806639671, 808185577, 809240401, 809590101, 809644461, 809946060, 810371935, 810498893, 810442209, 810581803, 810864866, 810932159, 810799479, 810701907, 810596347, 810361564, 809885502, 809247613, 808699548, 808346212, 808014214, 807427466, 806705654, 806076348, 805503964, 804986596, 804505527, 803826094, 802895010, 801984847, 801211953, 800411224, 799278796, 797112644, 792168796, 784976661, 782111049, 786896646, 792880833, 795137286, 795151889, 794641614, 793836653, 792853773, 791945338, 791181922, 790429056, 789465606, 788365245, 787263632, 786007881, 784636021, 783197165, 780813098, 777691722, 775851667, 773790240, 770092070, 765380740, 761669934, 760614634, 761662483, 762854695, 762976050]
687.3G62976050j193165k710641m856884q183241j2093902j4325261j2907386r209931
703.7F97495639o383359n347133n128681o262184j2196898k6623607n1990688q9271307
720D94291782j23846918j21986419p3470265j1361211L0750036N4212138P4491754
734.3C23080897R7415537J13604039J07222974P8518152M5415104K2076905R604513
748.5G96938121L674746P81178p02917j348615j590013j715899j663029j605928j733363
766.9G91034281j865506j900673j965046k188861k550841l183960m528702o855070
783.2G65995622j0048271j3593077j6442061j5481829o499231P563889J4957070J0381639
799.5G36833751K301932j449526j717686j116753m57108M1366L19659M28379L46541
$$ y = [762976050, 761782885, 759072244, 754215360, 746032119, 733938217, 719612956, 706705570, 697495639, 691112280, 685765147, 680636466, 674374282, 662177384, 635553777, 583563089, 494291782, 370444864, 248458445, 174988180, 163626969, 194377005, 248589143, 323080897, 420496434, 534100473, 641323447, 719841599, 765256703, 787333608, 796938121, 800612867, 801394045, 800691128, 799342513, 797752500, 796036601, 794373572, 792767644, 791034281, 789168775, 787268102, 785303056, 783114195, 780563354, 777379394, 772850692, 765995622, 755947351, 742354274, 725912213, 710430384, 703931153, 711495042, 726452112, 736833751, 739135683, 737686157, 735968471, 734851718, 734394610, 734435976, 734755635, 735184014, 735530555]
817.9G35530555q9288q82089j725375k535343l408254m254162n118310n755604n618930
836.2G06143200m609644l088117j691401p80284k43843J53125N72323J030267J298547
854.6F98784173Q95202o55473l905952r409487j7376005k6808203l4259200l3585012
870.9E73680043k0834982j139760J5490889K3680449K3953795J9613803J4198780R383142
887.2F58026159N297899K113938J21117m13299R27806M125953Q350253J2403429J5171051
905.6G06124306J5797019J4143705J1218667Q220017N600572L462732J838028P26521
921.9G67131567J45078r9540k54989l74138n36680q17299j115859j292646j333534
940.3G61451960j360298j399219j407265j485527j739263k079606k442062l003419
$$ y = [735530555, 735441267, 734559178, 732833803, 730298460, 726890206, 722636044, 717517734, 711762130, 706143200, 701533556, 698445439, 696754038, 695973754, 695729911, 695883036, 696455359, 697485626, 698784173, 699679375, 699023902, 695117950, 685708463, 668332458, 641524255, 607265055, 573680043, 552845061, 551705301, 567196190, 590876639, 614830434, 634444237, 648643017, 658026159, 663324058, 665437996, 665559113, 665145814, 666073620, 670199573, 678549826, 690953255, 706124306, 721921325, 736065030, 747283697, 755503714, 761104286, 764567018, 766405046, 767131567, 767276645, 767177105, 766922116, 766547978, 766011298, 765193999, 764078140, 762785494, 761451960, 760091662, 758692443, 757285178, 755799651, 754060388, 751980782, 749538720, 746535301]
956.6G46535301l826439m766941n769432o678641p128477o672799m947245k241970
972.9G04503357M51208K269148L015519K963602K466977J723766R03607K28226l41654
991.3G18183756j099289k136886l238558m440248o118894q937061j3993859k2388876
1007.6F55830085l6546111o0760021q6602896q3184809l3711016L0242055O3230545
1021.8D48497832N6693554L3957004J4462710K806663k784073n552590p491410q463800
1038.2E32125890p387459l571272K568722R535372J5544832J9355893K0468235J8855751
1054.5F07495964J4816701R229124L313005j944900o236374r852946j3499677j8038094
1070.8E85282803k4122596l1885445m0315211m7069997m9767434m8202902m4748426
$$ y = [746535301, 742708862, 737941921, 732172489, 725493848, 718365371, 711692572, 706745327, 704503357, 704954565, 707223713, 710239232, 713202834, 715669811, 717393577, 718297184, 718525410, 718183756, 717084467, 714947581, 711709023, 707268775, 701149881, 692212820, 678218961, 655830085, 619283974, 558523953, 471921057, 388736248, 355025232, 385267287, 448497832, 505191386, 539148390, 553611100, 556417763, 553633690, 548081100, 540589690, 532125890, 524738431, 521167159, 523735881, 533271253, 548816085, 568171978, 588640213, 607495964, 622312665, 631541789, 634854794, 632909894, 626673520, 616820574, 603320897, 585282803, 561160207, 529274762, 488959551, 441889554, 392122120, 343919218, 299170792]
1085.1B99170792m1852653l9539948l6147505l0433998k2559627j3648056m591435
1099.4A10397570M080698J1966116J8451870K1785095J8951074R379595j982942q624613
1115.7A84404463q079187k061963O360904J4258906J9438893K1091669K0266787J9061267
1132B74741739J9171238K1175653K4902761L0036479L5926580M1009039M3248713M1758418
1148.3E31970620L7366152L1547427K5175750J8572390J2280643O920159K253354k914310
1164.6F63172185r240090j4888108j6127885j1177361k199292O987274J3545453J6228617
1180.9F46300793J5048206J1180877O494940K366960q08061l146410m777193n758166
1197.3F66901946o234050o404400o482541o729484p353127q318841r539068j1070728
$$ y = [299170792, 257318139, 217778191, 181630686, 151196688, 128637061, 114989005, 110397570, 114478268, 126444384, 144896254, 166681349, 185632423, 195012018, 193029076, 184404463, 176325276, 174263313, 180624217, 194883123, 214322016, 235413685, 255680472, 274741739, 293912977, 315088630, 339991391, 370027870, 405954450, 446963489, 490212202, 531970620, 569336772, 600884199, 626059949, 644632339, 656912982, 663833141, 666086495, 663172185, 653932095, 639043987, 622916102, 611738741, 609539449, 616526723, 630072176, 646300793, 661348999, 672529876, 679024816, 681391776, 680583715, 677437305, 672660112, 666901946, 660667896, 654263496, 647780955, 641051471, 633698344, 625379503, 615840435, 604769707]
1213.6F04769707j2997210j5385509j8248021k1621943k5888503l1793117l9933175
1227.9D38902229m9814135n8955908o3380807o0104579m9658760l5810277k2888862
1242.1I8288901j3214253o926171l225044j410506j031176j732692k949290l694333
1258.4F4105436l152996j252927J334995M129104O832429Q941918R560518Q207180
1274.8I8705657N725078L547140K598472K946145M300401O412074R377934J3366252
1291.1A46979153J8737734K5739580L3840313M0753499M3028712L9952070L5633624
1305.4C84664685L4166693L4333110L3186078L0207545K6726603K4650932K4230957
1319.6E92166603K3851752K2328973J8851459J2670159L572822q257568k0709217k8945148
$$ y = [604769707, 591772497, 576386988, 558138967, 536517024, 510628521, 478835404, 438902229, 389088094, 330132186, 266751379, 206646800, 156988040, 121177763, 98288901, 85074648, 78148477, 74923433, 73512927, 72481751, 70749059, 67799769, 64105436, 60952440, 59699513, 61034508, 65163612, 71996041, 80937959, 90498477, 98705657, 104430735, 107977875, 110576347, 113522492, 117822893, 124234967, 133612901, 146979153, 165716887, 191456467, 225296780, 266050279, 309078991, 349031061, 384664685, 418831378, 453164488, 486350566, 516558111, 543284714, 567935646, 592166603, 616018355, 638347328, 657198787, 669868946, 673441768, 665184200, 644474983, 615529835]
1336F15529835k7832508j4678061O164909K4433076L3409715L1803190K3795426J4795840
1352.3G07421422P275581R38297n517602j4142275k6007235l4666896l3818722k5322497
1368.6E76160073j0973572L867805J5034914J9981801J9723475J6807318J1846781
1382.9F52448595O063044K20716m890204q467436j2324750j7022133k0662785k6193857
1399.2E69171190l3690572m4721007n8569819n3080082j6490161L8268238Q1014127
1413.5D81901914Q7654918P1710706N0305009K5814652R735942J152814n994737j3211728
1429.8G09069490j7998457j9100844k0908535j9211352j1368751o456733m622281m208326
1446.1F05194211n167544n287528l292620J030922R715736K0552993K1827220K0724953
$$ y = [615529835, 587697327, 573019266, 579184175, 603617251, 637026966, 668830156, 692625582, 707421422, 714697003, 715635300, 710117698, 695975423, 669968188, 635301292, 601482570, 576160073, 565186501, 569054306, 584089220, 604071021, 623794496, 640601814, 652448595, 658511639, 658732355, 653842151, 645374715, 633049965, 616027832, 595365047, 569171190, 535480618, 490759611, 432189792, 379109710, 362619549, 400887787, 481901914, 569556832, 641267538, 691572547, 717387199, 727123141, 728275955, 722281218, 709069490, 691071033, 671970189, 651061654, 631850302, 620481551, 614024818, 609402537, 605194211, 600026667, 594739139, 591446519, 592477441, 602193177, 622746170, 644573390, 665298343]
1462.4F65298343K2277415K0140230J3395727Q882165Q025348P940531P318556O956935
1478.7G60235250O672680N993247M507125K723753P12037j512527l469825o755769
1495G69105971j4045417k5069416l3982158l1453013j0549307K9055238L8375318K1884501
1511.4G43321717J1488855N391597K304614O94036k65598j97351J04785M51088J189530
1529.7G64483273J814365K877891L086329J731992M47690N91934P29322Q7560o95467
1548.1G75154889j362861j597344j816392k282143l500760k992391j539886k759397
1564.4G57303715m735291p632852j1734664j3838828j7684102j9821703n016387J3328612
1580.7F90168500K2715270K1169842J3155162N802155J509428o65844j891613k630174
$$ y = [665298343, 687575758, 707715988, 721111715, 729993880, 738019228, 745959759, 753278315, 760235250, 766907930, 772901177, 777408302, 780132055, 780844092, 779331565, 775861740, 769105971, 755060554, 729991138, 696008980, 664555967, 654006660, 683061898, 721437216, 743321717, 754810572, 760202169, 762506783, 763200819, 762935221, 762737870, 762842655, 763293743, 764483273, 766297638, 769175529, 772261858, 773993850, 774441540, 775033474, 775762796, 775850356, 775154889, 773792028, 772194684, 770378292, 768096149, 764595389, 761602998, 760063112, 757303715, 752568424, 744935572, 733200908, 719362080, 701677978, 681856275, 676839888, 690168500, 712883770, 734053612, 747208774, 753010929, 754520357, 753854513, 751962900, 749332726]
1597G49332726l025830k916515k350151k282143l604293n440533n787909l557920J074433
1615.4G21441865O632328O962836L721356J323343J93595k28405l80516n13196j275599
1633.7G37877607j838207p68185j57773o92546j489282k462745k211094j237094k639711
1652.1G24380970m086435k486467k900660n019665p281959p990956p367313q651853
1668.4F78595662r977817q693934r637952j1321246j0407269r790123j0781586j1924863
1684.7E96060872q710861p498741j0080278j2622833j9159079k6595116l3907860m7900051
1701.1D29586053m8539162n3921014o5723955o2493682n3388969m1962273k9634550
1715.3G3922448j8295594p759332j726494Q54511K536003M388328O377645R492096
$$ y = [749332726, 746306896, 743390381, 741040230, 738758087, 735153794, 729713261, 723925352, 720367432, 721441865, 728074193, 735037029, 738758385, 740081728, 740275323, 740046918, 739666402, 739153206, 737877607, 736039400, 735271215, 735113442, 734420896, 732931614, 730468869, 728257775, 727020681, 724380970, 720294535, 717808068, 714907408, 709887743, 702605784, 694614828, 687247515, 678595662, 668617845, 659923911, 650285959, 638964713, 628557444, 618767321, 607985735, 596060872, 587350011, 579851270, 569770992, 557148159, 537989080, 511393964, 477486104, 429586053, 381046891, 327125877, 261401922, 198908240, 145519271, 103556998, 73922448, 55626854, 47867522, 46141028, 46995539, 49531542, 53919870, 60297515, 69789611]
1731.7F9789611J7731480K7133137L4220830N3135499P3551074Q2233876Q3183497
1745.9D40979004P6883793O7853331N3281546L5633445K5285244J9646704J4214039
1760.2G33777106J1160254Q592010O242573M841924L723800L318250L267765K795637
1776.5G77719319K119958J809478J630902J523972J370370J055658N41866M95791Q14915
1794.9G89082229O98626L87848K19643L19898K38299J788k70903l29435k10523k31624
1815.3G89905846l61919k74897n4717L9160L04401O05703R42766J444638J601219J402199
1835.7G95554399J370848J380980J143753J083911J440346J601279J400769J179575
1852H06155860R48012P64430O27100N04196L48449J19328j79410k78115J05917L01660
$$ y = [69789611, 87521091, 114654228, 148875058, 202010557, 275561631, 357795507, 440979004, 517862797, 585716128, 638997674, 674631119, 699916363, 719563067, 733777106, 744937360, 753529370, 759771943, 764613867, 768337667, 771655917, 774923682, 777719319, 779839277, 781648755, 783279657, 784803629, 786173999, 787229657, 787771523, 788267314, 789082229, 789780855, 790168703, 790388346, 790708244, 790946543, 790948331, 790677428, 790347993, 790137470, 789905846, 789543927, 789269030, 789214313, 789253473, 789557874, 790163577, 791106343, 792550981, 794152200, 795554399, 796925247, 798306227, 799449980, 800533891, 801974237, 803575516, 804976285, 806155860, 807103872, 807868302, 808495402, 808999598, 809348047, 809467375, 809287965, 809009850, 809115767, 809417427]
1872.4H09417427J09434q2970j86980k93851l55124l95417m95851o15180n66482n25594
1892.8H06009412o73533o52849n86033o43850o70373o18219o40452p21813p29024p30693
1913.2G99342573q32379r57906q41678p61032q74400r17911r63986j100600j250506
1931.5G90842175j406192j541138j656115j842737k002478j802564j287043q21709
1947.9G78482199m01438L0756M46141P91431J026570J202524J345098J399517J342654
1966.2G85665452J265467J164019R76801P80165O66797N99980N29945M42744L86357
1984.6G92477727M18544M93765N80608P29144Q55744P85649O73532O68884O31868N27859
2005G98843324M58956M39465M25577L86357L37244L46303L43680K74956K45810K69472
$$ y = [809417427, 809526861, 809443891, 809256911, 808963060, 808607936, 808212519, 807716668, 807101488, 806535006, 806009412, 805335879, 804683030, 804096997, 803453147, 802782774, 802164555, 801524103, 800802290, 800073266, 799342573, 798510194, 797552288, 796710610, 795949578, 795075178, 794157267, 793193281, 792092681, 790842175, 789435983, 787894845, 786238730, 784395993, 782393515, 780590951, 779303908, 778482199, 778080761, 778111517, 778557658, 779349089, 780375659, 781578183, 782923281, 784322798, 785665452, 786930919, 788094938, 789071739, 789851904, 790518701, 791118681, 791648626, 792091370, 792477727, 792896271, 793390036, 793970644, 794699788, 795555532, 796341181, 797014713, 797683597, 798315465, 798843324, 799302280, 799741745, 800167322, 800553679, 800890923, 801237226, 801580906, 801855862, 802101672, 802371144]
2025.4H02371144K56598K11299J78575J45078P8619n37l4690n5492r1612j29283j81198
2047.8H02748501k36749k69235k76386k97845l42548l73601m04239m16577m00007m30047
2068.2G99301267m89772m78685m09245l82066l78251l49879l09468k78055k63810k47598
2088.6G95714438k38597k38538k49863k53081j99676j08778p1466j01447j12892r3877
2109G94046223p0333k1458L2485O9677J14620J21653Q3685J01805J47044J35780J09076
2131.4G94870257P9930O0439R4712J51098J84595J87994J89900K12312K54154L30150
2151.8G96615541M22239M52519M11093L82781M07636M30644M07576L73900L64840L57688
2172.2H00626457L09467K39372J93477J80423J59800R9600N3465Q7798J32024Q5950
$$ y = [802371144, 802627742, 802839041, 803017616, 803162694, 803241313, 803240776, 803206086, 803150594, 803058982, 802929699, 802748501, 802511752, 802242517, 801966131, 801668286, 801325738, 800952137, 800547898, 800131321, 799731314, 799301267, 798811495, 798332810, 797923565, 797541499, 797163248, 796813369, 796503901, 796225846, 795962036, 795714438, 795475841, 795237303, 794987440, 794734359, 794534683, 794425905, 794354439, 794252992, 794140100, 794046223, 793975890, 793954432, 793986917, 794056594, 794171214, 794292867, 794376552, 794478357, 794625401, 794761181, 794870257, 794950187, 795010626, 795105338, 795256436, 795441031, 795629025, 795818925, 796031237, 796285391, 796615541, 797037780, 797490299, 797901392, 798284173, 798691809, 799122453, 799530029, 799903929, 800268769, 800626457, 800935924, 801175296, 801368773, 801549196, 801708996, 801808596, 801862061, 801949859, 802081883, 802167833]
2192.6H02167833O556m4047r9540j87695k56419k68102k20358j42515r7692m6671J8657
2215H00830007M9889K2173m9830r1076j08361j30236j35899j63257j97589j94252j77502
2237.5G99654067j31786o1155m7445j16229j72496j46270p5936j6451J8358L0935K7955
2259.9G98963547M7564P9632N6505l1471j28686k21670l21090m14491m71950m59373
2280.3G97098517l73244k16007k623K06590L68655M70638N35667O01232N76377L95417
2300.7G99661219K00868R7275J7225m8041n8353j29223l08096m58956n35607n62609
2321.1G97875702m32968j89721j08183j29461n6088J311n7578j35779j85549j71066
2341.5G96410620l6716J56998J67787j44839o07312r63389j054407r12547o54876m28021
$$ y = [802167833, 802174389, 802130342, 802030802, 801843107, 801586688, 801318586, 801098228, 800955713, 800858021, 800811350, 800830007, 800879896, 800902069, 800852239, 800761163, 800652802, 800522566, 800386667, 800223410, 800025821, 799831569, 799654067, 799522281, 799461126, 799413681, 799297452, 799124956, 798978686, 798902750, 798886299, 798904657, 798935592, 798963547, 799011111, 799090743, 799147248, 799115777, 798987091, 798765421, 798444331, 798029840, 797557890, 797098517, 796725273, 796509266, 796506643, 796713233, 797081888, 797552526, 798088193, 798689425, 799265802, 799661219, 799862087, 799959362, 799976587, 799928546, 799870193, 799740970, 799432874, 798973918, 798438311, 797875702, 797442734, 797253013, 797144830, 797015369, 796959281, 796960592, 796903014, 796767235, 796581686, 796410620, 796373904, 796530902, 796698689, 796553850, 795946538, 794983149, 793928742, 793016195, 792361319, 791933298]
2361.9G91933298k54393j25229m6730N1856J72556K16841K00153J67608J56045J58191
2382.3G92630196J20043M6134K1398J09733K12609K35439K33590K73526L24965L29494
2402.7G94537127L17991L44217L80754L91841L83735L60489L42249L53218L95655M41075
2423.1G98248351M42803M07755L71337L15964K79009L08991L21329K90095K62082K14338
2443.5H01462054J65463J51217J42157J12414J02759R2566K2053j2576J7523j1146
2463.9H02244484q1300q7321n8591o6519r1136r3102j22845k04206k38538k38120k54810
2486.3H00707996k42531k20001k47955l03865l02970k74361k66730k23756j37687r6738
2506.7G98391402j24216j22249r0957j17183j47402j22786r5844o8724m9591k5451
$$ y = [791933298, 791678905, 791553676, 791506946, 791558802, 791731358, 791948199, 792148352, 792315960, 792472005, 792630196, 792750239, 792796373, 792817771, 792927504, 793140113, 793375552, 793609142, 793882668, 794207633, 794537127, 794855118, 795199335, 795580089, 795971930, 796355665, 796716154, 797058403, 797411621, 797807276, 798248351, 798691154, 799098909, 799470246, 799786210, 800065219, 800374210, 800695539, 800985634, 801247716, 801462054, 801627517, 801778734, 801920891, 802033305, 802136064, 802228630, 802250683, 802238107, 802255630, 802244484, 802163184, 802075863, 802017272, 801950753, 801859617, 801766515, 801643670, 801439464, 801200926, 800962806, 800707996, 800465465, 800245464, 799997509, 799693644, 799390674, 799116313, 798849583, 798625827, 798488140, 798391402, 798267186, 798144937, 798053980, 797936797, 797789395, 797666609, 797570765, 797502041, 797452450, 797426999]
2527.1G97426999K5749J6153l6300m5239j9789J4663M0709L6300J6868l755j9312K265
2551.6G97455311O4790J06871R3103O9320K7656j3172M1842J11640R0182O9022Q4519
2574G98201084O5684M4823Q8632J77145K55168K82466K74420L06547L66687L54350
2594.4H00417006K55883J41382J12712J50085J06752q345m7743J4901O9499L9458p9810
2616.8H01171780j87517j61945j12296j47640j43528j7941J80721L89934N15341N00262
2637.2H01987171M04835K68996J51455J45555J56998J12653J05262J27196R6560M8279
2657.6H03604960M7207M1306O736K4974P2062K1756o2406m6492J1206L2782K6405L1889
2682.1H03812385O0439L8802l4570m5777k6107l7193l3796n0723p9453r3818q4460
$$ y = [797426999, 797452748, 797468901, 797432601, 797387362, 797367573, 797382236, 797422945, 797459245, 797476113, 797472358, 797453046, 797455311, 797520101, 797626972, 797720075, 797789395, 797817051, 797803879, 797845721, 797957361, 798047543, 798116565, 798201084, 798266768, 798311591, 798400223, 798577368, 798832536, 799115002, 799389422, 799695969, 800062656, 800417006, 800672889, 800814271, 800926983, 801077068, 801183820, 801175475, 801127732, 801142633, 801212132, 801251590, 801171780, 800984263, 800822318, 800710022, 800562382, 800418854, 800400913, 800581634, 800971568, 801486909, 801987171, 802392006, 802661002, 802812457, 802958012, 803115010, 803227663, 803332925, 803460121, 803556681, 803604960, 803652167, 803693473, 803700209, 803725183, 803797245, 803819001, 803756595, 803710103, 803721309, 803754091, 803780496, 803812385, 803872824, 803911626, 803877056, 803831279, 803805172, 803767979, 803734183, 803683460, 803604007, 803510189, 803425729]
2704.5H03425729n7697p3254p9453o0916o2049n3048o3240j50263k52069k99811k62916
2727H02011013j87337j77563j97410j66834j24931j33037j49072j55389k14934k93613
2747.4H00210893k72572j85430j62959j74344j41441m7148L7015M7922L4571M947m3094
2769.8G99308360m5598j6451m3452j28507j89364j85251k04027k78831k86996k18093
2790.2G97711790k28882l34382l63529l35217l57091l65496k83360j47104l8267N8771
2810.6G95317233R7036J788j17063k00630l27527n13435o19471n85496n87881o67035
2831G91797519p69377r20355j065612j188874j342357j528203j692474j776159j802683
2849.3G79711425j792907j697362j521468j381516j255453j107872j097798j205623
$$ y = [803425729, 803368032, 803294778, 803215325, 803154409, 803092360, 803039312, 802976072, 802825809, 802573740, 802273929, 802011013, 801823676, 801646113, 801448703, 801281869, 801156938, 801023901, 800874829, 800719440, 800504506, 800210893, 799938321, 799752891, 799589932, 799415588, 799274147, 799226999, 799264014, 799311936, 799346507, 799351454, 799308360, 799262762, 799246311, 799202859, 799074352, 798884988, 798699737, 798495710, 798216879, 797929883, 797711790, 797482908, 797148526, 796784997, 796449780, 796092689, 795727193, 795443833, 795296729, 795258462, 795317233, 795414269, 795416057, 795298994, 795098364, 794770837, 794257402, 793637931, 793052435, 792464554, 791797519, 791028142, 790107787, 789042175, 787853301, 786510944, 784982741, 783290267, 781514108, 779711425, 777918518, 776221156, 774699688, 773318172, 772062719, 770954847, 769857049, 768651426]
2865.7G68651426j272023j331448j413405j372636j253724j305818j571954j890421
2882G57239997k080261k015531j584232q34823q8513M34756P34032P35640L80397q4758
2902.4G52836704k41577M6193N54025J026512J304268J304329J036763O47843K42293
2920.7G58757353k33829p76649j303613j792073k346516l089070m046619n209923o595373
2939.1G33363688q094370r444118j0434925j0860086j0515571r464323p963538o067992
2955.4F60518765l753483j181066J406908L686369N404234O520927P097184P264972
2971.7F86964810P108092O683409O191016N715012N225599M827619M540801M308343
2988G31564701M073381L687322L199101K831697K613068K504527K530456K677023K865613
$$ y = [768651426, 767379403, 766047955, 764634550, 763261914, 762008190, 760702372, 759130418, 757239997, 755159736, 753144205, 751559973, 750725150, 750636637, 751071393, 751805425, 752541065, 752921462, 752836704, 752595127, 752641320, 753195345, 754221857, 755526125, 756830454, 757867217, 758515060, 758757353, 758523524, 757746875, 756443262, 754651189, 752304673, 749215603, 745168984, 739959061, 733363688, 725269318, 715825200, 705390275, 694530189, 684014618, 674550295, 666586757, 660518765, 656765282, 655584216, 656991124, 660677493, 666081727, 672602654, 679699838, 686964810, 694072902, 700756311, 706947327, 712662339, 717887938, 722715557, 727256358, 731564701, 735638082, 739325404, 742524505, 745356202, 747969270, 750473797, 753004253, 755681276, 758546889]
3006.4G58546889K977371K965748K879441K749443K523542K167761J764357J467109
3022.7G78041661J321971J270592J350940J499951J480400J171112P12753K21610m87447
3041.1G86583543j573503k911210m117608m606784l938436k267361l82185P71940Q41439
3059.4G68399835K64048k86341l97205j17898K58923M91976M50254J65820j53124j53244
3079.8G68923044M06444J226008J881600K243518K054930J252115K49982o20902j187324
3098.2G76429415j242161o77764K92241J234591J839757K027392J953304J748324J337528
3116.5G84942627P41899J24574l31045m41491j73867K67804O28054Q46684R71198R82285
3136.9G88558722P78853M50910K83241K72691K48611K12789K26974K41459J96099J23143
$$ y = [758546889, 761524260, 764490008, 767369449, 770118892, 772642434, 774810195, 776574552, 778041661, 779363632, 780634224, 781985164, 783485115, 784965515, 786136627, 786849380, 787070990, 786583543, 785010040, 782098830, 777981222, 773374438, 769436002, 767168641, 766786456, 767558396, 768399835, 768663883, 768377542, 767980337, 767862439, 768121362, 768613338, 769063592, 769229412, 769076288, 768923044, 769329488, 770555496, 772437096, 774680614, 776735544, 777987659, 778237641, 777616739, 776429415, 775187254, 774509490, 774801731, 776036322, 777876079, 779903471, 781856775, 783605099, 784942627, 785684526, 785809100, 785478055, 785036564, 784862697, 785130501, 785758555, 786605239, 787576437, 788558722, 789337575, 789788485, 790071726, 790344417, 790593028, 790805817, 791032791, 791274250, 791470349, 791593492]
3157.3G91593492M1246l2484q2314j12474j19627j16109j23322j55688k00212j71542
3177.7G90520966j8597L3200j49846l11911k68877j30653p0095o9201l5405j2159m0651
3200.1G89446771o0141q4460j76131k34426k27749k35200k41875k44022k49624k48015
3220.5G87445128k75075l04163k49386j68919j09494p0751j36673j98484j13010j6689
3240.9G85802484j1147m529R298m8280j37925j55628j17421j11401j06335p9512p7725
3263.4G84961879p9810l0697K5332p8082k40922k34902j60932j28746j38820j93774
3283.8G83700526k52903k51829j50741q3386j36614k09570k00272j01387J9431J49548
3304.2G82482803K03609N9426j28090j31905m4167m4823q6367r0242j17480k13683
$$ y = [791593492, 791634738, 791602254, 791519940, 791407466, 791287839, 791171730, 791048408, 790892720, 790692508, 790520966, 790502369, 790535569, 790385723, 790073812, 789804935, 789674282, 789604187, 789534986, 789499581, 789487422, 789446771, 789386630, 789302170, 789126039, 788891613, 788663864, 788428664, 788186789, 787942767, 787693143, 787445128, 787170053, 786865890, 786616504, 786447585, 786338091, 786267340, 786130667, 785932183, 785819173, 785802484, 785791337, 785786808, 785796106, 785747826, 785609901, 785454273, 785336852, 785225451, 785119116, 785039604, 784961879, 784882069, 784851372, 784876704, 784798622, 784557700, 784322798, 784161866, 784033120, 783894300, 783700526, 783447623, 783195794, 783045053, 782961667, 782825053, 782615483, 782415211, 782313824, 782333255, 782482803, 782686412, 782745838, 782617748, 782485843, 782441676, 782396853, 782310486, 782220244, 782102764, 781889081]
3324.6G81889081l58522m85420m30167k54512j06990M2081J34706J94669K81513K87592
3345G81194031K85328M13298M36068K65062J79052J91569K11895K55406K62379J88828
3365.4G83882916P5400j8060m2796j6451k4915o5982n8294j8000j4186p0870j45972
3387.8G83482790j75476k12610k89082l51251m06444n09381o66082p74801q87751j100898
3408.2G78109014j308382j456320j551211j651406j800776j874327j744926j484156
3424.5G65237510j288712j084924o70731j14083M49836J030386J547813J766205J757383
3442.9G68630683J758278J838326J931966J823961J619041J528144J356006J082063
3459.2G81568468R73165R15587P20381O09577O83904P56681P07209N16236K52366J13487
$$ y = [781889081, 781530559, 781045139, 780614972, 780360460, 780253470, 780295551, 780430257, 780624926, 780906439, 781194031, 781479359, 781892657, 782328725, 782593787, 782772839, 782964408, 783176303, 783431709, 783694088, 783882916, 783958316, 783940256, 783897460, 783881009, 783856094, 783790112, 783731818, 783713818, 783699632, 783628762, 783482790, 783307314, 783094704, 782805622, 782454371, 782047927, 781538546, 780872464, 780097663, 779209912, 778109014, 776800632, 775344312, 773793101, 772141695, 770340919, 768466592, 766721666, 765237510, 763948798, 762863874, 762193143, 762079060, 762528896, 763559282, 765107095, 766873300, 768630683, 770388961, 772227287, 774159253, 775983214, 777602255, 779130399, 780486405, 781568468, 782541633, 783457220, 784177601, 784787178, 785471082, 786227763, 786934972, 787451208, 787703574, 787817061]
3479.6G87817061K22444K96176J53899J04070J41501J1981j25945j38819j45197k09451
3500G88127720k91526k33293q5592j71900m08291m40062l39329l22640l51369m36604
3520.4G85047114n82755n85019n01395n10454m63962m00663m66704n04136l62992k47241
3540.8G80421793l38912m38153l00646o974J41859K44320M57346N70893N79775O16073
3561.1G81947374O55413N87344O72937J162946J370430J122117R73284J001835Q94189
3579.5G90387869O37114L53932R54j87933J19090K35021j33813l04818j47939j92821
3599.9G90766656l34322l43204n82158r14812p73669n03301m47929m81486o02842l73542
3620.3G85409391P0870Q7559l44813q08716m7564R07481Q86082P74741Q02637P70807
$$ y = [787817061, 788039505, 788335681, 788489580, 788593650, 788735151, 788747132, 788621187, 788482368, 788337171, 788127720, 787836194, 787602901, 787517309, 787345409, 786937118, 786497056, 786157727, 785835087, 785483718, 785047114, 784464359, 783879340, 783377945, 782867491, 782403529, 782002866, 781536162, 781032026, 780669034, 780421793, 780082881, 779644728, 779344082, 779337108, 779478967, 779723287, 780180633, 780751526, 781331301, 781947374, 782602787, 783190131, 783863068, 785026014, 786396444, 787518561, 788491845, 789493680, 790387869, 791024983, 791378915, 791379869, 791191936, 791311026, 791546047, 791412234, 791107416, 790959477, 790766656, 790432334, 790089130, 789506972, 788592160, 787818491, 787315190, 786867261, 786385775, 785782933, 785409391, 785480261, 785567820, 785223007, 784414291, 784366727, 785274208, 786160290, 786935031, 787737668, 788508475]
3640.7G88508475O92248N09501K42829M13954J401603J934886J564324J358986J571656
3659G98198462J446247J147508R51112O10828L67820P44999Q44717N28097J040459
3677.4H05880249J448512J195490R52184P37310M60326N04315J074910J278460R57132
3695.8H14488888O32942L64840J85251L10778L53337K2530l26991j33455N47648O95944
3716.2H17141712K47895j74284k38776j24216q7261m6074j51456m71234n33879R0897
3736.5H15653324O25909L66210l20494p01844j84477n1021l44992J86264O82295M11331
3756.9H16322505Q4997K66850L62992Q5652j9670O3718L31640N78046L42071j02878
3777.3H18315923k50876j5259J25230J27613K00391J79589L2485k56300m96984l79562
$$ y = [788508475, 789200723, 789710224, 789953053, 790367007, 791768610, 793703496, 795267820, 796626806, 798198462, 799644709, 800792217, 801743329, 802354157, 802721977, 803466976, 804311693, 804839790, 805880249, 807328761, 808524251, 809476435, 810213745, 810674071, 811178386, 812253296, 813531756, 814488888, 815121830, 815486670, 815671921, 815982699, 816336036, 816358566, 816031575, 815898120, 816445768, 817141712, 817389607, 817215323, 816976547, 816852331, 816765070, 816718996, 816567540, 816096306, 815562427, 815653324, 816279233, 816645443, 816324949, 815623105, 815438628, 815387607, 815042615, 815228879, 815911174, 816322505, 816407502, 816674352, 817037344, 817122996, 817103326, 817167044, 817498684, 818076730, 818418801, 818315923, 818065047, 818049788, 818175018, 818302631, 818503022, 818682611, 818715096, 818458796, 817961812, 817582250]
3797.7H17582250m88580n66065J88530M20033L06547N51462L54231k92123o04212k60293
3818.1H17191780j79291M0412N47588L53813R6679J8179j71721k69175m44889l90172
3838.5H16793203K66374O29961N44548L26991j03354p35402j154840k37346R04918
3856.9H17235053P72774Q5056m11153k27213J28865p0453j47700J61886L28303L18587
3877.3H18174005n9605k11299O8844P7069J27732O9082j81556l2603J50501q5771l99232
3899.7H17697167l90172j13070K88427M80712K66254L4034o9082k69532l09646K0504
3920.1H17635596J62303L7790O3240K2590j44779k2889K46168K15947n1081k53499
3940.5H17911386k19047P16M9889j05500p2420J29044J42693l7372j43766j41442o5386
$$ y = [817582250, 817093670, 816527605, 816716135, 817136168, 817442715, 817994177, 818348408, 818056285, 817452073, 817191780, 817012489, 817052901, 817600489, 817954302, 818050981, 818069160, 817897439, 817628264, 817183375, 816793203, 817059577, 817689538, 818234086, 818561077, 818457723, 817722321, 816567481, 816330135, 817235053, 818007827, 818092883, 817681730, 817454517, 817583382, 817512929, 817365229, 817527115, 817855418, 818174005, 818114400, 817903101, 817971945, 818049014, 818176746, 818245828, 818064272, 818031669, 818182170, 818096399, 817697167, 817306995, 817193925, 817482352, 817963064, 818229318, 818263352, 818194270, 817924738, 817615092, 817635596, 817797899, 817835689, 817898929, 817921519, 817776740, 817753851, 818000019, 818215966, 818164885, 817911386, 817692339, 817693055, 817742944, 817637444, 817565024, 817694068, 817836761, 817799389, 817655623, 817514181, 817448795]
3962.9H17448795N781n2094j11699j49489j48654j9609M3869r2268j95563j37031p5400
3985.4H16516638l4332k9743n7519k3544J5736M4823
3997.6H16432059
$$ y = [817448795, 817454576, 817402482, 817290783, 817141294, 816992640, 816973031, 817016900, 816924632, 816729069, 816592038, 816516638, 816482306, 816452563, 816395044, 816371500, 816387236, 816432059]
##END=$$ End of the data block
