##TITLE=Isocianate ISO ET  16A1 $$ Begin of the data block
##JCAMP-DX=5.00 $$ ACD/SpecManager v 10.08
##SPECTROMETER/DATA SYSTEM=Alpha
##DATE=25 Nov 2015 09:11:28
##DATA TYPE=INFRARED SPECTRUM
##DATA CLASS=XYDATA
##ORIGIN=
##OWNER=
##NPOINTS=1667
##FIRSTX=599.64648438
##LASTX=3997.64306641
##MAXX=3997.64306641
##MINX=599.64648438
##MAXY=1.11428928
##MINY=0.08625107
##XFACTOR=1.0000000000
##YFACTOR=0.000000010000000
##FIRSTY=1.04486907
##DELTAX=2.03961372
##XUNITS=1/CM
##YUNITS=ARBITRARY UNITS
##XYDATA=(X++(Y..Y))
599.6A04486907j7131m9674q7285j33646j96993k49565k76780k97284k90966k47038
620A02640545j17659J15359L53086N40959O54448O10947L76678P8249j25444j34933
640.4A04992235J03676M41563N81908M86589L41880K36821J79339J46627R4319L6728
660.8A07641685O008k9588o6602K2853J36673J01519L0362j7273m5324r5057j52946
683.3A07532310j80792j93608j75822j13916m0984O449K9671L7825K5559K7108P9787
705.7A07033587J70707K50399K71774K24960J45947N7733k7585q3375r9623q9478r1815
728.1A07763231j34456k07126k97237m00567m89116n58865o23846o64353o71506o57797
748.5A03058362o10244m53842j42539K06328L83639L21734J33527j9837k8491R8550
$$ y = [104486907, 104469776, 104420102, 104332817, 104199171, 104002178, 103752613, 103475833, 103178549, 102887583, 102640545, 102522886, 102638245, 102991331, 103532290, 104186738, 104797685, 105174363, 105252612, 105127168, 104992235, 105095911, 105537474, 106119382, 106605971, 106947851, 107184672, 107364011, 107510638, 107604957, 107641685, 107647693, 107618105, 107551503, 107574356, 107711029, 107812548, 107842910, 107825637, 107780313, 107685256, 107532310, 107351518, 107157910, 106982088, 106868172, 106827188, 106833637, 106863308, 106901133, 106926692, 106953800, 107033587, 107204294, 107454693, 107726467, 107951427, 108097374, 108155107, 108127522, 108044147, 107944524, 107855046, 107763231, 107628775, 107421649, 107124412, 106723845, 106234729, 105675864, 105052018, 104387665, 103716159, 103058362, 102448118, 101994276, 101851737, 102058065, 102441704, 102763438, 102896965, 102877128, 102848637, 102947187]
768.9A02947187K57278L09586J87016j514j17111j73676k42317l00348k78020k49827
789.3A02338254m77480j188505k357280l574384l860145k431488l42727L16179p67869
807.7H7654555k033931k309585j594400m26460O83779J468265J827091J840675J754945
826H8864934J726246J710189J619315J464581J278597J031125P43991M78447J75649
844.4I9093074k66517q09419j246917j297349q58366j89668L02321M58514M70191O15269
864.8I6271133R82547J416582J689333J718843J569259J302910R81617O76572M05896
883.2A07014692J78373L862j41632k83611m36962o23000q34775j022040j132787j128471
903.5A01593649j001906q20750p20674p87961q81517p51198m03046r1630K3377J6355
$$ y = [102947187, 103204465, 103514051, 103701067, 103699553, 103582442, 103408766, 103166449, 102866101, 102588081, 102338254, 101860774, 100672269, 98314989, 94740605, 90880460, 88448972, 88106245, 88422424, 87654555, 85620624, 83311039, 81716639, 81290179, 81973958, 83442223, 85269314, 87109989, 88864934, 90591180, 92301369, 93920684, 95385265, 96663862, 97694987, 98438978, 98917425, 99093074, 98826557, 98017138, 96770221, 95472872, 94614506, 94424838, 94727159, 95185673, 95655864, 96271133, 97253680, 98670262, 100359595, 102078438, 103647697, 104950607, 105932224, 106608796, 107014692, 107193065, 107196927, 107055295, 106771684, 106334722, 105711722, 104876947, 103854907, 102722120, 101593649, 100591743, 99770993, 99050319, 98262358, 97380841, 96629643, 96226597, 96134967, 96158344, 96174699]
923.9I6174699K0766P7343J62101K51979L42035M48382O03062Q24481J096249J331448
944.3A01332545J413548J305473J057220P47680M52709K26558R7716N2595L7992L8218
964.7A06762254O0785Q9455J06311J08528R2530N3322K563m6754r6583j61576k37203
987.2A06733632l18909m23741n60546p22289r10699j099301j258540j445424j686985
1005.5I8307198j889783j956749k025741k704227l707272k403176J811367M719335
1021.8I0150952M065270K211988R97060K69139l49212r35626j414162j645440j583904
1040.2I1766065j355183j143533j053893j081914j168895j253646j321179j409197
1056.5H1978625j555532j745266j943213k117562k238434k307380k348983k361745
$$ y = [96174699, 96195465, 96272808, 96434909, 96686888, 97028923, 97477305, 98080367, 98904848, 100001097, 101332545, 102746093, 104051566, 105108786, 105856466, 106309175, 106535733, 106633449, 106686044, 106724036, 106762254, 106823039, 106912494, 107018805, 107127333, 107219863, 107273185, 107275748, 107228994, 107132411, 106970835, 106733632, 106414723, 105990982, 105430436, 104708147, 103797448, 102698147, 101439607, 99994183, 98307198, 96417415, 94460666, 92434925, 89730698, 86023426, 83620250, 85431617, 90150952, 94216222, 96428210, 97425270, 97694409, 97345197, 96409571, 94995409, 93349969, 91766065, 90410882, 89267349, 88213456, 87131542, 85962647, 84709001, 83387822, 81978625, 80423093, 78677827, 76734614, 74617052, 72378618, 70071238, 67722255, 65360510]
1072.8F5360510k332788k272642k199709k117688k033937j967251j918388j888388
1089.2D8629719j878515j874617j873707j863274j796198j643443j403168j060733
1105.5C5236064n61938J18720Q71730J495189J871699K058002K176762K280640K292693
1123.8D7839561K117077J785773J434987J180768J047963J001996J001012J021332
1140.1E8430469J056629J099915J141697J193058J272935J385450J509965J620233
1156.5F8710351J709485J787281J866806J930809J958710J964551J947301J838464
1172.8H3713758J552904J164907R66680J152247J537401J778870J730657J458669J075119
1191.1I6131212O75076L03960j03671o38026j184273j429253j164353n48369j34611
$$ y = [65360510, 63027722, 60755080, 58555371, 56437683, 54403746, 52436495, 50518107, 48629719, 46751204, 44876587, 43002880, 41139606, 39343408, 37699965, 36296797, 35236064, 34674126, 34792846, 35664576, 37159765, 39031464, 41089466, 43266228, 45546868, 47839561, 49956638, 51742411, 53177398, 54358166, 55406129, 56408125, 57409137, 58430469, 59487098, 60587013, 61728710, 62921768, 64194703, 65580153, 67090118, 68710351, 70419836, 72207117, 74073923, 76004732, 77963442, 79927993, 81875294, 83713758, 85266662, 86431569, 87398249, 88550496, 90087897, 91866767, 93597424, 95056093, 96131212, 96806288, 97110248, 97006577, 96368551, 95184278, 93755025, 92590672, 92042303, 91907692]
1209.5I1907692m10444j253146k158993k778554k967435k651006j839298o95169M83048
1227.9G7636695J405585J918924K034628J886040J647252J446259J313323J192885
1244.2I0481591J008219P38311M35441J72550j1718j25731j93697k27427k39873k49970
1264.6I1787696k69264k90239k84570k19530j07056p600L0679j25r0117k22200l86965
1287H9940709o16413q99059j067030q70985l08138K01433K87384P5382j05524r6214
1307.4H6541545P8148L07053N21976P50131J087057J498681J714898J587969J186287
1325.8I5273745O06358j5843n45108r30143j194787j379096j319856r05460m37152
1344.1H9152658o8617K48510M91756N95814N22858K46763k52432j018273k064234l005678
$$ y = [91907692, 91497248, 90244102, 88085109, 85306555, 82339120, 79688114, 77848816, 77153647, 77636695, 79042280, 80961204, 82995832, 84881872, 86529124, 87975383, 89288706, 90481591, 91489810, 92228121, 92663562, 92836112, 92824394, 92698663, 92504966, 92277539, 92037666, 91787696, 91518432, 91228193, 90943623, 90724093, 90617037, 90609437, 90640116, 90639991, 90549874, 90327674, 89940709, 89324296, 88425237, 87358207, 86487222, 86179084, 86380517, 86667901, 86743283, 86637759, 86541545, 86619693, 86926746, 87448722, 88198853, 89285910, 90784591, 92499489, 94087458, 95273745, 95880103, 95864260, 95319152, 94389009, 93194222, 91815126, 90495270, 89589810, 89152658, 89084041, 89332551, 89824307, 90420121, 90942979, 91189742, 90937310, 89919037, 87854803, 84849125]
1364.5H4849125l747743m437000m144776k573514n2803K534943L930760M095155L427780
1382.9H3881927K609080K167993J903826J466632J142896R85181P46429M69935J77163
1401.2I5551062k80899q75378j449817j955736j954627q07488R60982K635699L648198
1419.6I5471996K633149J162403K75100m60428j115710j396638j286376j207065j004195
1437.9I3072236p80619r01532j056456j059425r18371n85895l01546j95402p2372L98779
1458.3H7599397O99955O83033R18317J284546J173055Q34203O03497O01852Q22574
1476.7I5220429J123309J280308J132637O42788J10168k36345l54594m83787r90069
1495.1I7444844j757401k306658k646285l090513m663360p249046m844278j802045
$$ y = [84849125, 81101382, 76664382, 72519606, 69946092, 69893289, 72428232, 76358992, 80454147, 83881927, 86491007, 88659000, 90562826, 92029458, 93172354, 94157535, 94903964, 95373899, 95551062, 95270163, 94394785, 92944968, 90989232, 89034605, 88227117, 89188099, 91823798, 95471996, 98105145, 99267548, 99542648, 99082220, 97966510, 96569872, 95283496, 94076431, 93072236, 92291617, 91390085, 90333629, 89274204, 88355833, 87769938, 87468392, 87272990, 87200618, 87599397, 88299352, 88982385, 89900702, 91185248, 92358303, 93192506, 93796003, 94397855, 95220429, 96343738, 97624046, 98756683, 99399471, 99509639, 99273294, 98918700, 98434913, 97444844, 95687443, 93380785, 90734500, 87643987, 82980627, 75731581, 70887303, 69085258]
1511.4F9085258q69649r60100j806176k622241l350055k565324q55810M59612J417106
1529.7E7932621K202273L247499L126937K637607L774083M638064L941029L502613
1546H5002726L033007K761346K338522J740259J198977J385284K224928J478279Q71849
1564.4A02035177N02014k01404j097989j749391k302003j969033K68602J792616J849890
1582.8I9128479Q38500m61197j407754j928139k076870j878280j344287p98476o36941
1601.1H9435035r42445j437020j441664l09705J478845K602845L348464L966748K879346
1619.5I9580449J653916J209437P53200K53618l4785k09105l68631k96021J54114L39663
1639.9A03035855K86579J74022J91283M50969L30436R0075M38714N83291K94399Q0037
$$ y = [69085258, 68215609, 67255509, 65449333, 62827092, 59477037, 56911713, 56055903, 56515515, 57932621, 60134894, 63382393, 66509330, 69146937, 72921020, 77559084, 81500113, 85002726, 88035733, 90797079, 93135601, 94875860, 96074837, 97460121, 99685049, 101163328, 102035177, 102537191, 102335787, 101237798, 99488407, 97186404, 95217371, 95485973, 97278589, 99128479, 99966979, 99505782, 98098028, 96169889, 94093019, 92214739, 90870452, 90071976, 89435035, 88492590, 87055570, 85613906, 85304201, 86783046, 89385891, 92734355, 96701103, 99580449, 101234365, 102443802, 103197002, 103450620, 103415835, 103206730, 102838099, 102542078, 102696192, 103035855, 103322434, 103496456, 103687739, 104138708, 104469144, 104559219, 104997933, 105581224, 105875623, 105955660]
1660.3A05955660J7476M9901q2349k85089k39826r9372j23203j21773j66904l50500
1680.7A04554021n74624n25367k20001k86973m61197o04307r51100j204425j340341
1699I8385686j722497j678085k016884k562047k606493k705359k899438l280652l853273
1717.4G5060958l266025k187729j913458j524568n79023N49102J864040M060674N402726
1735.7G7466697M671853M877794M791844L805548K951944K267271J902008J552642
1752A04287601R90951O18839M78780L37303K87199K31027N7674j30558k96366l59607
1772.4A06502843k75910k29573j32072J74987M73213N64552M72581K40529P3301J68837
1792.8A08033288K62522J64581Q0001J10042J77455J46806N7376Q690N6446J03724
$$ y = [105955660, 105973136, 106023037, 105940688, 105655599, 105415773, 105316401, 105193198, 105071425, 104904521, 104554021, 103979397, 103454030, 103234029, 102947056, 102485859, 101881552, 100930452, 99726027, 98385686, 96663189, 94985104, 92968220, 90406173, 87799680, 85094321, 82194883, 78914231, 75060958, 71794933, 69607204, 67693746, 66169178, 65590155, 66139257, 68003297, 72063971, 77466697, 82138550, 87016344, 91808188, 95613736, 98565680, 100832951, 102734959, 104287601, 105278552, 105897391, 106376171, 106713474, 107000673, 107231700, 107289374, 107158816, 106862450, 106502843, 106226933, 105997360, 105865288, 106040275, 106513488, 107078040, 107550621, 107791150, 107864451, 108033288, 108295810, 108460391, 108540392, 108650434, 108827889, 108974695, 109032071, 109040761, 109097207, 109200931]
1813.2A09200931O8485K9135J9014j8883o2001m7338m7302j5068J10042J12343K0742
1835.7A09370100l540k2638r2113p0596O0118Q3518L8874O282k0313l6383m2176l6180
1860.2A09234953m9186j14941k09547j91032l9375j598p2360r8586o8199m3536l1423
1882.6A08315170j8633l3843n3609k4926l7551p9334n4884k6512k1303O187M7064O9416
1907.1A08087242J05130J53804J48916R9624R4962J23787J05774J18077J49393J17850
1927.5A09304559P4017N6637N4800N1761L3164p129k0265K9075N7673L5453J7190J2612
1951.9A09699547R191L58r680j1074q643j6904j3888K1339M2081K7263R739R048J7250
1978.5A09775627J8417J2231K182j3983l2509k7787J9335M3965J3482o139j943J31
$$ y = [109200931, 109269416, 109298551, 109317565, 109298682, 109236681, 109189343, 109142041, 109126973, 109237015, 109349358, 109370100, 109366560, 109343922, 109251809, 109181213, 109241331, 109324849, 109363723, 109370005, 109349692, 109313309, 109271133, 109234953, 109185767, 109070826, 108861279, 108670247, 108630872, 108629274, 108556914, 108458328, 108390129, 108346593, 108315170, 108296537, 108262694, 108209085, 108184159, 108146608, 108067274, 108012390, 107985878, 107964575, 107970762, 108017826, 108087242, 108192372, 108346176, 108495092, 108594716, 108689678, 108813465, 108919239, 109037316, 109186709, 109304559, 109378576, 109435213, 109490013, 109541774, 109574938, 109567809, 109547544, 109576619, 109634292, 109669745, 109686935, 109699547, 109708738, 109709096, 109699416, 109688342, 109679699, 109662795, 109648907, 109670246, 109712327, 109739590, 109749329, 109758377, 109775627, 109794044, 109806275, 109808457, 109794474, 109761965, 109734178, 109753513, 109797478, 109810960, 109804821, 109802878, 109803009]
2002.9A09803009K15j812p046o902j0073k3782j6237O223M459n675k253L672K241o795
2031.5A09739244j5998j7202j6975k4498l3021l7849m3726n3715p1025q7643r3746
2053.9A09243846r8741j14608j34242j45351j43147j24764j02640q7618o4505k7096
2074.3A08201134M101J9705L7957N8448N9688N2226N6779O2358N3394M4072L9124K5881
2098.8A08714867Q773j1932l6955o0463q1599q8727q5903j01232j31953j62089k01607
2121.2A07761180k53093l09503l64876m10592m56059n02575n31685n49448n59485n45644
2141.6A03278220n12898m71342m15504l51858k97344k58672k42555k57421k95210l41141
2162I9834275l87311m15653m19533m10426l98385l93617l96753m11784m52364n14310
$$ y = [109803009, 109803224, 109801412, 109794366, 109787464, 109777391, 109753609, 109737372, 109743595, 109748054, 109742379, 109740126, 109743798, 109746039, 109739244, 109723246, 109706044, 109689069, 109664571, 109631550, 109593701, 109549975, 109496260, 109425235, 109337592, 109243846, 109145105, 109030497, 108896255, 108750904, 108607757, 108482993, 108380353, 108292735, 108228230, 108201134, 108205235, 108224940, 108262897, 108321345, 108381033, 108433259, 108490038, 108552396, 108605790, 108649862, 108688986, 108714867, 108723640, 108711708, 108674753, 108614290, 108532691, 108443964, 108358061, 108256829, 108124876, 107962787, 107761180, 107508087, 107198584, 106833708, 106423116, 105967057, 105464482, 104932797, 104383349, 103823864, 103278220, 102765322, 102293980, 101878476, 101526618, 101229274, 100970602, 100728047, 100470626, 100175416, 99834275, 99446964, 99031311, 98611778, 98201352, 97802967, 97409350, 97012597, 96600813, 96148449, 95634139]
2182.4I5634139n80204o44344p11829p80808q35586q67969q89331r11146r28510r42498
2202.8H7541914r63801r89449j022822j074588j143491j225990j325632j456916j638466
2221.2G6700759j871723k170390k553916l011936l531116m082215m609424n048710
2237.5D9821329n326891n367896n137193m661006m019758l331491k692430k158971
2253.8A7125693j749218j456755j246332j073507r11070p43538n74910m11063k50469
2272.2H708831q3724R5817L10587N75997Q87600J258333J705982K214782K743924L256959
2292.5B1675088L701953M063609M357547M573235M666015M608819M418963M114861
2308.9E6180090L735602L329926K915013K520496K191430J913417J663041J433068
$$ y = [95634139, 95053935, 94409591, 93697762, 92916954, 92081368, 91213399, 90324068, 89412922, 88484412, 87541914, 86578113, 85588664, 84565842, 83491254, 82347763, 81121773, 79796141, 78339225, 76700759, 74829036, 72658646, 70104730, 67092794, 63561678, 59479463, 54870039, 49821329, 44494438, 39126542, 33989349, 29328343, 25308585, 21977094, 19284664, 17125693, 15376475, 13919720, 12673388, 11599881, 10688811, 9945273, 9370363, 8959300, 8708831, 8625107, 8720924, 9031511, 9607508, 10495108, 11753441, 13459423, 15674205, 18418129, 21675088, 25377041, 29440650, 33798197, 38371432, 43037447, 47646266, 52065229, 56180090, 59915692, 63245618, 66160631, 68681127, 70872557, 72785974, 74449015, 75882083]
2325.2G5882083J234555J101870J022595R43929Q70627Q34858P92885P46173P62767
2343.5H4192342Q04185P19244N88101N87886O90079P75701Q46100R22119J005537J070863
2363.9I2202157J096147J122969J132375J089347J045078J019114R74816R06176Q35061
2382.3A01423240P65872O96182O31726N76949N25331M69256M17876L81291L51059L10457
2402.7A06549239K74885K59793K47454K28894K06661J80185J60992J54138J42550J24860
2423.1A08529651J18756J25492J24371J16611J10840J06240J06156R9849Q5187P5209
2443.5A09598362P6557Q4662Q3566O9129N6923N7864O8033O9499N7649M9973M4989
2465.9A10317206L5072K6262K6571L5942M3392M1425L3248K5332K0277J8227J5164
$$ y = [75882083, 77116638, 78218508, 79241103, 80185032, 81055659, 81890517, 82683402, 83429575, 84192342, 84996527, 85715771, 86303872, 86891758, 87581837, 88357538, 89203638, 90125757, 91131294, 92202157, 93298304, 94421273, 95553648, 96642995, 97688073, 98707187, 99682003, 100588179, 101423240, 102189112, 102885294, 103517020, 104093969, 104619300, 105088556, 105506432, 105887723, 106238782, 106549239, 106824124, 107083917, 107331371, 107560265, 107766926, 107947111, 108108103, 108262241, 108404791, 108529651, 108648407, 108773899, 108898270, 109014881, 109125721, 109231961, 109338117, 109437966, 109523153, 109598362, 109674919, 109759581, 109843147, 109912276, 109969199, 110027063, 110095096, 110164595, 110222244, 110272217, 110317206, 110352278, 110378540, 110405111, 110441053, 110484445, 110525870, 110559118, 110584450, 110604727, 110622954, 110638118]
2488.3A10638118J3661J7691J6975J2303J4507K1232K6297K3723J6212J4735J1861
2510.8A10827315N364R334J4341O485N150J9491K2137R334N806Q356L004n9N447O259
2539.3A10947764n674j9205j8501p975J001K479q058j5104j1182j1563j8704k9695
2563.8A10805583l6085l9613n2869o0594n8008n8579n8222n5134n5599n8270n6684
2586.2A10215926n2774m5204k7835p415K0230N5051P4577P2312N4121L5489L2723K9480
2610.7A10456681J1671o378p486k778j8716m4620n2309m0543k9909l6741m8625m6754
2635.2A10133493l6824k6929j4568j430Q726P784p86m399n031j2362k3722l0518l6204
2661.7A09957230l7622k9612k0993k5594l4165k8730k1910j8597P832M8220N0664K0599
$$ y = [110638118, 110651779, 110669470, 110686445, 110698748, 110713255, 110734487, 110760784, 110784507, 110800719, 110815454, 110827315, 110832679, 110842013, 110856354, 110862839, 110867989, 110887480, 110909617, 110918951, 110924757, 110933113, 110936117, 110936058, 110941505, 110947764, 110942090, 110922885, 110904384, 110896409, 110897410, 110899889, 110891831, 110876727, 110865545, 110853982, 110835278, 110805583, 110769498, 110729885, 110677016, 110616422, 110558414, 110499835, 110441613, 110386479, 110330880, 110272610, 110215926, 110163152, 110117948, 110090113, 110082698, 110102928, 110157979, 110232556, 110304868, 110358989, 110394478, 110427201, 110456681, 110468352, 110461974, 110454488, 110451710, 110432994, 110388374, 110336065, 110295522, 110265613, 110228872, 110180247, 110133493, 110096669, 110069740, 110055172, 110053742, 110062468, 110070252, 110069466, 110065067, 110060036, 110047674, 110023952, 109993434, 109957230, 109919608, 109889996, 109869003, 109843409, 109809244, 109780514, 109758604, 109740007, 109747839, 109796059, 109846723, 109867322]
2686.2A09867322k896j8525l0256l8719n0080n2905l7598l0315m1449n0879n0843n2416
2710.7A09410441o5911p7057p6806q9205j13022j25134j16706o2251k396q535m3643
2733.1A08629775o6996o3490k5976k0099p6902j44088j68395j33991q9217r8466j44029
2755.5A07598126j64044j60277j56832j49738j39821j40822j59132j89412j91176j20735
2775.9A06026137n1153o2203r9480j06931j19460j27923o9344K181O867k0349m030
2798.4A05374312M9115O0165J9753m1819j08659j28603j20461j63114k37883k97820
2818.8A04404986l62277m49824n43046o66488q55851j073563j280099j472485j628620
2837.1I6072733j700186j721621j782489j871001j922584j933604j934076j914763
$$ y = [109867322, 109864426, 109845901, 109815645, 109776926, 109726846, 109673941, 109636343, 109606028, 109564579, 109513700, 109462857, 109410441, 109344530, 109267473, 109190667, 109101462, 108988440, 108863306, 108746600, 108684349, 108681953, 108673418, 108629775, 108562779, 108499289, 108473313, 108453214, 108376312, 108232224, 108063829, 107929838, 107840621, 107742155, 107598126, 107434082, 107273805, 107116973, 106967235, 106827414, 106686592, 106527460, 106338048, 106146872, 106026137, 105974984, 105912781, 105813301, 105706370, 105586910, 105458987, 105389643, 105391824, 105398691, 105378342, 105374312, 105423427, 105483592, 105503345, 105461526, 105352867, 105224264, 105103803, 104940689, 104702806, 104404986, 104042709, 103592885, 103049839, 102383351, 101527500, 100453937, 99173838, 97701353, 96072733, 94372547, 92650926, 90868437, 88997436, 87074852, 85141248, 83207172, 81292409]
2853.4H1292409j857579j760942j602036j388263j157373r10593o39742l44849j6117
2871.8G1614915L34138O23017P47627P03538N55366L38149Q7071j47021l29149m41295
2892.2G4086356m66102l74615j93590L87J85645L61413M82106N16587M89593M38732
2912.6G5526512L83734K95532J28877j08653l79008o19274p41941o20067j68896N27149
2933G4223965J305294J995749K410727K442867K175683J771235J305652P87967K47944
2951.3H8667083k35951p18033j350141k138239k947235l535360l625209l055948j939076
2969.7F9121891o24323N52535J404041J911670K196205K405954K611857K789289K878845
2988H5247964K853644K750778K586937K306223J967364J645601J316416J051092Q62146
$$ y = [81292409, 79434830, 77673888, 76071852, 74683589, 73526216, 72615623, 71975881, 71631032, 71614915, 71949053, 72572070, 73319697, 74023235, 74578601, 74916750, 75003821, 74856800, 74527651, 74086356, 73620254, 73245639, 73052049, 73052436, 73238081, 73599494, 74081600, 74598187, 75087780, 75526512, 75910246, 76205778, 76334655, 76226002, 75846994, 75227720, 74485779, 73865712, 73696816, 74223965, 75529259, 77525008, 79935735, 82378602, 84554285, 86325520, 87631172, 88419139, 88667083, 88431132, 87713099, 86362958, 84224719, 81277484, 77742124, 74116915, 71060967, 69121891, 68497568, 69050103, 70454144, 72365814, 74562019, 76967973, 79579830, 82369119, 85247964, 88101608, 90852386, 93439323, 95745546, 97712910, 99358511, 100674927, 101726019, 102588165]
3006.4A02588165O40869M13310K87164K49159J99068R0360n8198k04169k21861q1038
3026.8A03902829K6822M5919P0799J39808J53458j6451j60920n8627J64807K92706
3047.2A04561150K52032K07770K17605J68514J34456J34480N7137l9434m6027R1338
3067.6A05739021K91443L57282K67935J32144Q1789J89495K92659K85506K57027K05219
3088A08099520J52004J70922J62518N7590m2271l0721M9174L3462q3148j11628j6570
3110.4A08440852j1229j24824j43195m9972N1010J27887J38664Q3781M7385Q3364J31249
3132.8A08774972J09816M5943N7757J56748J94013J26267M4715l7801q4508N794J32644
3155.3A09526360J25968L5608k5201l9207m1390n5671o5410o6781p7808r1791r9492
$$ y = [102588165, 103229034, 103642344, 103929508, 104178667, 104377735, 104468095, 104409897, 104205728, 103983867, 103902829, 103929651, 103975570, 104046369, 104186177, 104339635, 104323184, 104162264, 104103637, 104268444, 104561150, 104813182, 105020952, 105238557, 105407071, 105541527, 105676007, 105733144, 105693710, 105647683, 105739021, 106030464, 106387746, 106655681, 106787825, 106869614, 107059109, 107351768, 107637274, 107894301, 108099520, 108251524, 108422446, 108584964, 108642554, 108600283, 108569562, 108618736, 108652198, 108569050, 108457422, 108440852, 108429623, 108304799, 108161604, 108111632, 108162642, 108290529, 108429193, 108512974, 108560359, 108643723, 108774972, 108884788, 108930731, 108988488, 109145236, 109339249, 109465516, 109510231, 109472430, 109387922, 109393716, 109526360, 109652328, 109687936, 109662735, 109623528, 109582138, 109526467, 109461057, 109394276, 109316468, 109224677, 109125185]
3177.7A09125185r4700q0430p3684o9224n2000r429L8850O1858P1168Q2290P7665N2476
3202.2A09130025L1853K9099L5917J7023k6381l9732l7932m9544l3700j9109n4074
3224.6A08983445r4867j39224k13754k24757j04309m971m0960j27244k04277k47741
3245A07581341j92404q8048p4577j49464j78528j08028m6813n3036q7393j35505j90639
3267.5A06276906k27285j75476q0550m7970n7351q5342j17779j25027j07443j06048
3287.8A05146635j51527j61744p9524K7192R1111O5244k4009o9404j3351J03354J85025
3310.3A05119002K01177J84119J54209J19353P6008K0432M375Q4221J61434J41799
3330.7A06266129R3293M7612R501M4299J15621J46091J50144J05476K1744M7183J52755
$$ y = [109125185, 109030485, 108950055, 108876371, 108807147, 108755147, 108745718, 108784568, 108846426, 108917594, 108999884, 109077549, 109130025, 109161878, 109190977, 109226894, 109243917, 109217536, 109177804, 109139872, 109090328, 109056628, 109037519, 108983445, 108888578, 108749354, 108535600, 108310843, 108206534, 108201563, 108160603, 108033359, 107829082, 107581341, 107388937, 107300889, 107226312, 107076848, 106898320, 106790292, 106743479, 106690443, 106603050, 106467545, 106276906, 106049621, 105874145, 105793595, 105745625, 105688274, 105602932, 105485153, 105360126, 105252683, 105146635, 104995108, 104833364, 104753840, 104781032, 104872143, 104937387, 104913378, 104843974, 104830623, 104933977, 105119002, 105320179, 105504298, 105658507, 105777860, 105853868, 105874300, 105878675, 105962896, 106124330, 106266129, 106359422, 106407034, 106416535, 106460834, 106576455, 106722546, 106872690, 106978166, 106999910, 107047093, 107199848]
3353.1A07199848J54340P2408J9622L2162L9315l6418q0824Q11J11663J16718J6928
3375.5A07646573o8522q9335p4721q2564j21069j71161k29299j73902j1838L8171m7231
3398A06615102o6065R2923K37680J76763O1464M8292R4950J68836K09225J65248J71053
3420.4A07975471K50900K28226J07694N7447J06310R3341K2269J03128K63154K71559
3440.8A09479499J57547N0974M1866J18578J37507Q1444K6608m7243j00922k8933n567
3463.2A09911358j72901k37405l0160J68896J27315k6369j43158j43862p856K6476
3483.6A09472334p9405p5936l278l2509j02985j04832o4016o7806o4743L7980R0111
3506.1A09004915K8097j5545k1481R906N3823M0591k5737p7677k8133P0262J14643
$$ y = [107199848, 107354188, 107426596, 107446218, 107478380, 107517695, 107481277, 107400453, 107401264, 107512927, 107629645, 107646573, 107578051, 107488716, 107413995, 107331431, 107210362, 107039201, 106809902, 106636000, 106624162, 106662333, 106615102, 106549037, 106641960, 106879640, 107056403, 107117867, 107166159, 107261109, 107429945, 107639170, 107804418, 107975471, 108226371, 108454597, 108562291, 108619738, 108726048, 108819389, 108841658, 108944786, 109207940, 109479499, 109637046, 109688020, 109729886, 109848464, 109985971, 110067415, 110094023, 110046780, 109945858, 109916925, 109911358, 109738457, 109501052, 109470892, 109639788, 109767103, 109740734, 109597576, 109453714, 109445858, 109472334, 109392929, 109316993, 109313715, 109281206, 109178221, 109073389, 109009373, 108941567, 108876824, 108914804, 109004915, 109033012, 109017467, 108995986, 109005892, 109059715, 109100306, 109074569, 108996892, 108968759, 109039021, 109153664]
3528.5A09153664J10257M5085l8851j3315N0854l0064j39904o5100J20794J44375N1665
3551A09389460N7542P3767J3876m5490p5579j02842r1934N3084J71065J12343L4237
3573.4A09589529N162n889k6190p9787j74749j54376J16646K31588N4967K718L9053
3595.8A09598672r322J0216J03581N4884l9589R215O8712K5499j4496n2893j0550J40488
3620.3A09884417J35422l2079j60206m768K15494Q8025N436J9872J2541o998r1696
3642.7A10065460k48444l47805j57642K31683K01726p99m4691m2498j8466J0717j00589
3665.2A09548652k52628j84632m0507j18911J4901K57969J71936O0832m7827j99437
3685.6A09210348k49064M8256L36182K16103N5933k527k1863M4906Q5616m2713j63793
$$ y = [109153664, 109263921, 109309006, 109270155, 109256840, 109307694, 109277630, 109137726, 109072626, 109193420, 109337795, 109389460, 109447002, 109520769, 109534645, 109489155, 109413576, 109310734, 109218800, 109271884, 109442949, 109555292, 109589529, 109594691, 109588802, 109562612, 109482825, 109308076, 109153700, 109270346, 109501934, 109556901, 109559619, 109598672, 109589350, 109599566, 109703147, 109758031, 109718442, 109727657, 109796369, 109821868, 109807372, 109754479, 109743929, 109884417, 110019839, 109987760, 109827554, 109822786, 110038280, 110126305, 110131741, 110151613, 110164154, 110157156, 110065460, 109817016, 109469211, 109311569, 109543252, 109744978, 109744179, 109699488, 109656990, 109638524, 109649241, 109548652, 109296024, 109111392, 109070885, 108951974, 108966875, 109224844, 109396780, 109457612, 109409785, 109210348, 108961284, 109009540, 109345722, 109561825, 109617758, 109615231, 109593368, 109638274, 109723890, 109681177, 109517384]
3708A09517384r5654J73748K52258R6488j2564l7337Q273Q5116J41632O8427j03224
3730.4A10094547j93119o1738K01952K23732M5061l10J46890M6539j43671N6112K78628
3752.9A10694623J24359k2828K9683Q9085j550m4537k4199R203Q7714P0655m3821j28090
3777.3A10840297n5790N5527L0315K2304K8897j7679n2416q7452r1481p7618q0347
3799.8A10514557N3990J04368N3501J56629J18983q2409j82057r7275o5672r894K28524
3822.2A10793245J65558K7358K5952j4830p8547j52528j31917P2038J76823J34600
3842.6A11017752J10328L3522j19365k45738n0473L28517J66857m7767j07956p0119
3863A11015558K6512q154m5073L8958Q5104R9587r120j02627l1924k7585K8467R6381
$$ y = [109517384, 109421730, 109595478, 109847736, 109944224, 109931660, 109894323, 109902596, 109987712, 110129344, 110197771, 110094547, 109901428, 109839690, 110041642, 110265374, 110310435, 110310125, 110457015, 110503554, 110359883, 110415995, 110694623, 110818982, 110796154, 110825837, 110914922, 110913372, 110868835, 110844636, 110853839, 110941553, 111012208, 110968387, 110840297, 110784507, 110840034, 110870349, 110892653, 110921550, 110903871, 110851455, 110764003, 110672522, 110594904, 110514557, 110568547, 110672915, 110726416, 110883045, 111002028, 110919619, 110737562, 110640287, 110574615, 110564721, 110793245, 110958803, 110986161, 111012113, 110997283, 110918736, 110766208, 110634291, 110706329, 110883152, 111017752, 111128080, 111161602, 111042237, 110796499, 110746026, 111074543, 111241400, 111193633, 111085677, 111015558, 111042070, 111033916, 110988843, 111027801, 111112905, 111212492, 111203372, 111100745, 111068821, 111041236, 111069703, 111166084]
3887.5A11166084o0K7716R9492j8560j24956j02639k3401Q8752J71172J18876K6452
3909.9A11428928l1292p9668q1896J78M4275m614p713K7109j6952n3751o986K7287
3934.4A11244905J7571J08l4583l3259N48j3757j3172J7774J2553N72m709j6069j3030
3960.9A11165452k241k408j0860l4702n2345j9729J8084O104j8311l4082l9816j9538
3985.4A10955608L469N352q58r906k1541j9110
3997.6A10913014
$$ y = [111166084, 111166024, 111193740, 111293232, 111274672, 111149716, 111047077, 111023676, 111112428, 111283600, 111402476, 111428928, 111397636, 111317968, 111236072, 111236250, 111280525, 111275911, 111268198, 111295307, 111278355, 111224604, 111217618, 111244905, 111262476, 111262584, 111228001, 111194742, 111195290, 111181533, 111168361, 111186135, 111198688, 111199260, 111194551, 111178482, 111165452, 111163211, 111160803, 111149943, 111115241, 111062896, 111043167, 111061251, 111067355, 111049044, 111014962, 110975146, 110955608, 110959077, 110964429, 110963571, 110953665, 110932124, 110913014]
##END=$$ End of the data block
