##TITLE=Isocianate ISO ET  16A $$ Begin of the data block
##JCAMP-DX=5.00 $$ ACD/SpecManager v 10.08
##SPECTROMETER/DATA SYSTEM=Alpha
##DATE=25 Nov 2015 09:11:28
##DATA TYPE=INFRARED SPECTRUM
##DATA CLASS=XYDATA
##ORIGIN=
##OWNER=
##NPOINTS=1667
##FIRSTX=599.64648438
##LASTX=3997.64306641
##MAXX=3997.64306641
##MINX=599.64648438
##MAXY=1.05772471
##MINY=0.00919223
##XFACTOR=1.0000000000
##YFACTOR=0.000000010000000
##FIRSTY=0.85320848
##DELTAX=2.03961372
##XUNITS=1/CM
##YUNITS=ARBITRARY UNITS
##XYDATA=(X++(Y..Y))
599.6H5320848j07962k54625l26973l39258l97396m93020n32174n06794m66550l76039
$$ 85320848 85212886 84958261 84631288 84292030 83894634 83401614 82869440 82362646 81896096 81520057
620H1520057j31470K72035P09141J091182J319677J239109Q09001K73550j15704j90479
$$ 81520057 81388587 81660622 82369763 83460945 84780622 86019731 86828732 87102282 86986578 86796099
640.4H6796099K79540J027578J373601J226777R32628O42275M10843K65026J63556
$$ 86796099 87075639 88103217 89476818 90703595 91636223 92278498 92689341 92954367 93117923
658.8I3117923P8731L1633J9216L7187J19049J52528J20330Q7279J3083j03217k19983
$$ 93117923 93196654 93228287 93247503 93284690 93403739 93556267 93676597 93763876 93776959 93673742 93453759
681.2I3453759l02714l31408l22300k54476j21612J1826R0641J52981K37829K77215
$$ 93453759 93151045 92819637 92497337 92242861 92121249 92133075 92223716 92376697 92614526 92891741
701.6I2891741K51561K37763K89482L92073M57001M10265K78383J21320k0099j08898
$$ 92891741 93143302 93381065 93670547 94062620 94519621 94929886 95208269 95329589 95309490 95200592
722I5200592j25152r5075p3421p8267j02985j66630k89673m65441p05886j027727j375651
$$ 95200592 95075440 94980365 94906944 94828677 94725692 94559062 94269389 93803948 93098062 92070335 90694684
744.5I0694684j659268j804716j728224j326734n88686K37626P29293O98465L56257
$$ 90694684 89035416 87230700 85502476 84175742 83587056 83824682 84553975 85252440 85608697
762.8H5608697O5756N9920L13133N95969O45829L89719N1933j55717k90388m69935
$$ 85608697 85674453 85734373 86047506 86643475 87289304 87679023 87730956 87575239 87284851 86814916
783.2H6814916o16783n86271n77498j125979k584457m758174o743502o848198m103935
$$ 86814916 86198133 85611862 85034364 83908385 81323928 76565754 69822252 62974054 58870119
801.6E8870119n35941O08545r73206k825767l195858k161801n35861J008567K100969
$$ 58870119 58334178 58942723 57969517 55143750 51947892 49786091 49250230 50258797 52359766
819.9E2359766K623421K724951K711737K773577K864725K851808K665925K331620J886273
$$ 52359766 54983187 57708138 60419875 63193452 66058177 68909985 71575910 73907530 75793803
838.3G5793803J381528Q82971L18605m93973j512683k293044k309060j474810k90000
$$ 75793803 77175331 78058302 78376907 77882934 76370251 74077207 71768147 70293337 70003337
856.6G0003337N79393Q76498R15247J193088J887268K727276L302241L421825L162902
$$ 70003337 70582730 71459228 72374475 73567563 75454831 78182107 81484348 84906173 88069075
875H8069075K673602K074671J471192R28497M64267P9906k43587n60379r01270j275628
$$ 88069075 90742677 92817348 94288540 95217037 95681304 95761210 95517623 94957244 94055974 92780346
895.4I2780346j675570k023477k218121k178866j911562j574660j405412j519155j649135
$$ 92780346 91104776 89081299 86863178 84684312 82772750 81198090 79792678 78273523 76624388
913.7G6624388j361824o79183q1777J31088R8914P8911J68669L16483M71526O37901
$$ 76624388 75262564 74583381 74501604 74632692 74731606 74810517 74979186 75295669 75767195 76405096
934.1G6405096Q47834J156068J601154K136165K606952K830285K691060K233046J626450
$$ 76405096 77252930 78408998 80010152 82146317 84753269 87583554 90274614 92507660 94134110
952.5I4134110J033157N61363K69836J56176J51253J72013J79493J84608J89602J72222
$$ 94134110 95167267 95728630 95998466 96154642 96305895 96477908 96657401 96842009 97031611 97203833
972.9I7203833J12581K0105p6831j80560k90269m11021n55295p26110r37581j201457
$$ 97203833 97316414 97336519 97259688 97079128 96788859 96377838 95822543 95096433 94158852 92957395
993.3I2957395j518601j873785k198106k454740k747637l107119l377652l411710l423017
$$ 92957395 91438794 89565009 87366903 84912163 82164526 79057407 75679755 72268045 68845028
1011.6F8845028m364664n787766l745770K701574P361484O634033L819114J824176
$$ 68845028 64480364 58692598 54946828 57648402 65009886 71643919 75463033 77287209
1028G7287209N74273m67229j404583k151233k542377k511597k212005j889796j702773
$$ 77287209 77861482 77394253 75989670 73838437 71296060 68784463 66572458 64682662 62979889
1046.3F2979889j655924j687324j748628j801789j856988j971555k130139k271959
$$ 62979889 61323965 59636641 57888013 56086224 54229236 52257681 50127542 47855583
1062.6D7855583k365571k396301k385735k374745k365953k333939k261906k147791
$$ 47855583 45490012 43093711 40707976 38333231 35967278 33633339 31371433 29223642
1079B9223642j997862j832598j682728j568416j479137j400373j340341j294129j241210
$$ 29223642 27225780 25393182 23710454 22142038 20662901 19262528 17922187 16628058 15386848
1097.3A5386848j157175j025757q47717o23939l23135Q1373N36912R30829J201724
$$ 15386848 14229673 13203916 12356199 11732260 11409125 11490498 12027410 12958239 14159963
1115.7A4159963J386116J536252J665988J722665J630198J396034J130157R35718Q33711
$$ 14159963 15546079 17082331 18748319 20470984 22101182 23497216 24627373 25563091 26396802
1134B6396802P90957P73644P78470Q04722Q51816R20707J018712J157742J335237J522672
$$ 26396802 27187759 27961403 28739873 29544595 30396411 31317118 32335830 33493572 34828809 36351481
1154.4C6351481J692620J852509K011836K168125K300203K395540K474776K531028
$$ 36351481 38044101 39896610 41908446 44076571 46376774 48772314 51247090 53778118
1170.7E3778118K459705K111590J573252J312483J668518K356709K829980K839160
$$ 53778118 56237823 58349413 59922665 61235148 62903666 65260375 68090355 70929515
1187.1G0929515K455467J850111J186800N41108j97678j156134k104068k489221j969277
$$ 70929515 73384982 75235093 76421893 76963001 76765323 75609189 73505121 71015900 69046623
1205.4F9046623q83931j86760o14881j894260l155458l863960l918469l331995k192241
$$ 69046623 68162692 67975932 67361051 65466791 62311333 58447373 54528904 51196909 49004668
1223.8D9004668p20796P53787J928383K635479K876634K784961K552509K351243K230537
$$ 49004668 48283872 49037659 50966042 53601521 56478155 59263116 61815625 64166868 66397405
1242.1F6397405K102601J859349J490474J072282O93500M08512K16091Q8930K3424
$$ 66397405 68500006 70359355 71849829 72922111 73615611 74024123 74240214 74329144 74352568
1260.5G4352568J5921M7654R2393J10608R4354Q2451R5797J14489J05315M3720q7488
$$ 74352568 74368489 74416143 74508536 74619144 74713498 74795949 74891746 75006235 75111550 75155270 75067782
1282.9G5067782k97236o42866j246017k032006k558201k295661j274300l14385q2934
$$ 75067782 74770546 74127680 72881663 70849657 68291456 65995795 64721495 64407110 64324176
1301.3F4324176l44681n62430m93646j72972K33930O15877J008374J567363K245343
$$ 64324176 63979495 63417065 62923419 62750447 62984377 63600254 64608628 66175991 68421334
1319.6F8421334K640343K509743J904994R56261j10602j014269j594734j937121k203381
$$ 68421334 71061677 73571420 75476414 76432675 76322073 75307804 73713070 71775949 69572568
1338F9572568k167106j551115p64042j30290L86888P70717R42398Q39895L98767l65234
$$ 69572568 67405462 65854347 65090305 64960015 65346903 66117620 67060018 67899913 68298680 67933446
1358.4F7933446j467466k989644m334760n154264n715620n038905k948407L0187L035498
$$ 67933446 66465980 63476336 59141576 53987312 48271692 43232787 40284380 40314567 43350065
1376.7D3350065M851779N322418M704594L787285L242404K817487K220279J853615
$$ 43350065 48201844 53524262 58228856 62016141 65258545 68076032 70296311 72149926
1393.1G2149926J622385J177150O49834J24860n63753j547486k534151l269887l174221
$$ 72149926 73772311 74949461 75599295 75724155 75160402 73612916 71078765 67808878 64634657
1411.4F4634657j309079J603550M496056O255090M549008K067137M74751q43119k040440
$$ 64634657 63325578 64929128 69425184 75680274 80229282 82296419 82771170 81928051 79887611
1429.8G9887611k594483k278197k003259j697504j284188j337135j460379j380164
$$ 79887611 77293128 75014931 73011672 71314168 70029980 68692845 67232466 65852302
1446.1F5852302j185876p57628l01260j6487K91658P95966R99856J101661J604384
$$ 65852302 64666426 63908798 63607538 63591051 63882709 64678675 65678531 66780192 68384576
1464.5F8384576K073860J821136J328230Q12918N52237R49252J641393K094751J963967
$$ 68384576 70458436 72279572 73607802 74420720 74972957 75922209 77563602 79658353 81622320
1482.8H1622320J247859M19879l89307j043761j287097j912916l218430m225826m543328
$$ 81622320 82870179 83290058 82900751 81856990 80569893 78656977 75438547 71212721 66669393
1501.2F6669393m736400o307560r233311o088865k272209j145328j204380k053392
$$ 66669393 61932993 55625433 46392122 40303257 38031048 36885720 35681340 33627948
1517.5C3627948k696335l127790k273038o89946M82066J339400K159724L343135L360352
$$ 33627948 30931613 27803823 25530785 24840839 25322905 26662305 28822029 32165164 35525516
1535.8C5525516L140485M879358O020272N195093M842645M485601M346931L852439
$$ 35525516 38666001 43545359 49565631 54760724 59603369 64088970 68435901 72288340
1552.2G2288340L079176K428514K786470L537356K185703J425892Q34304n62871k541798
$$ 72288340 75367516 77796030 80582500 84119856 86305559 87731451 88565755 88002884 85461086
1570.5H5461086l660947m223782l455168M86559L314185L500152J598787q49205k554924
$$ 85461086 81800139 77576357 74121189 74607748 77921933 81422085 83020872 82171667 79616743
1588.9G9616743l358382l435945k958322k049547j237041j133722j797080k610362
$$ 79616743 76258361 72822416 69864094 67814547 66577506 65443784 63646704 61036342
1605.2F1036342k494692o09577K298164M328317N897766P084215N229968L269159K487666
$$ 61036342 58541650 57932073 60230237 64558554 70456320 77540535 82770503 86039662 88527328
1623.5H8527328J475531M77850j05846l06660l32898k80791K8401L27260M82541N79077
$$ 88527328 90002859 90480709 90374863 90068203 89735305 89454514 89482915 89810175 90292716 90871793
1643.9I0871793P60353R17285O32197M62979O79934N73045L51369K11525J09983K6381
$$ 90871793 91632146 92549431 93181628 93644607 94324541 94897586 95248955 95460480 95570463 95596844
1664.3I5596844j15597l26449m22430l23009l33077l70717l52913m32402o93834r91267
$$ 95596844 95481247 95154798 94732368 94409359 94076282 93705565 93352652 92920250 92226416 91235149
1684.7I1235149q24314p89112r76795j057756j460970j917570k282107l105617k956569
$$ 91235149 90410835 89621723 88644928 87587172 86126202 84208632 81926525 78820908 75864339
1703.1G5864339l256244m018932l903634l725987l652632l774941m170904l523567
$$ 75864339 72608095 68589163 64685529 60959542 57306910 53531969 49361065 45837498
1719.4D5837498k381388k025449j616996o39314N95066K143693M949537O759474O096631
$$ 45837498 43456110 41430661 39813665 39174351 39769417 41913110 46862647 53622121 59718752
1737.8E9718752O810087O992811N747676M642391L726190L127909K410328J532668
$$ 59718752 66528839 73521650 79269326 83911717 87637907 90765816 93176144 94708812
1754.1I4708812J054210Q27938N71388M33511K91353P0822j70803m67682q48597r74607
$$ 94708812 95763022 96590960 97162348 97595859 97887212 97958034 97787231 97319549 96470952 95496345
1774.5I5496345p54995l28099L78263R82743J167798R90266O44809M18728L97283L78824
$$ 95496345 94741350 94413251 94791514 95774257 96942055 97932321 98577130 98995858 99393141 99771965
1794.9I9771965K92944K38300K33853K46346K05815J43742J05441J10411J14966Q2433
$$ 99771965 100064909 100303209 100537062 100783408 100989223 101132965 101238406 101348817 101463783 101546216
1815.3A01546216N0819M1234K0278p808r42Q333K4116P5173Q3840M6253K9791J2338
$$ 101546216 101597035 101638269 101658547 101650739 101649797 101658130 101682246 101757419 101841259 101887512 101917303 101929641
1839.8A01929641k6667l6919Q094K9671K849k6476m5336n8400p4089q4841j12700j69242
$$ 101929641 101902974 101866055 101874149 101903820 101906669 101880193 101834857 101776457 101702368 101617527 101504827 101335585
1864.2A01335585k48945l13317k77329k20239k23219k13582j55097q8531l7014j3936
$$ 101335585 101086640 100773323 100495994 100275755 100052536 99838954 99683857 99595326 99558312 99544376
1884.6I9544376k8044p5328j06710j33628j82021j75869j17886m6134M9883J50245
$$ 99544376 99516332 99441004 99334294 99200666 99018645 98842776 98724890 98678756 98728639 98878884
1905I8878884K20442K84565L41886L49730L21818L08239L03912K74444K63095K62737
$$ 98878884 99099326 99383891 99725777 100075507 100397325 100705564 101009476 101283920 101547015 101809752
1925.4A01809752K32363J92475J66380J45269J28531J15216Q0347M3512N4764Q1778
$$ 101809752 102042115 102234590 102400970 102546239 102674770 102789986 102870333 102913845 102968609 103050387
1945.8A03050387O7663L9566K3937J7488P784o699j2958m518P128J4556L9434O7091
$$ 103050387 103118050 103157616 103181553 103199041 103206825 103200126 103187168 103182650 103189778 103204334 103243768 103310859
1970.3A03310859O9404O0105N3251M2343K9087K3723K5463J9312K420m220J2755L0410
$$ 103310859 103380263 103440368 103493619 103535962 103565049 103588772 103614235 103633547 103635967 103631747 103644502 103674912
1994.8A03674912K0588Q213N365j443q201r704p379n066k671o985r549l612m864o425
$$ 103674912 103695500 103703713 103709078 103707635 103699434 103689730 103682351 103677285 103674614 103667629 103658080 103654468 103649604 103643179
2023.3A03643179l111l922o688j6177k8360l2496l9148n9283q5211j02258j13940j36399
$$ 103643179 103640068 103636146 103629458 103613281 103584921 103552425 103513277 103453994 103368783 103266525 103152585 103016186
2047.8A03016186j74105k14839k45047k63929k85590l11399l26097l29947l15464k75635
$$ 103016186 102842081 102627242 102382195 102118266 101832676 101521277 101195180 100865233 100549769 100274134
2068.2A00274134k24567j61624q3792j0133M5115R2626J30325J39189J31333J27375
$$ 100274134 100049567 99887943 99804151 99794018 99839133 99931759 100062084 100201273 100332606 100459981
2088.6A00459981J20866J04296Q7202P0214M1545O628l4809q9491j47319j93798k20323
$$ 100459981 100580847 100685143 100772345 100842559 100884104 100890732 100855923 100766432 100619113 100425315 100204992
2111A00204992k41291k77555l31086m05824n10019o31541p45905q52460r61613j067108
$$ 100204992 99963701 99686146 99355060 98949236 98439217 97807676 97061771 96209311 95247698 94180590
2131.4I4180590j155830j214051j237762j233005j196128j122415j016230q86410p54065
$$ 94180590 93024760 91810709 90572947 89339942 88143814 87021399 86005169 85118759 84364694
2149.8H4364694o39963n63150n42915n79238o52844p35033q03095q43435q45975q16285
$$ 84364694 83724731 83161581 82618666 82039428 81386584 80651551 79848456 79005021 78159046 77342761
2170.2G7342761p81060p60060p60120p90644q58158r50956j048053j152783j261896
$$ 77342761 76561701 75801641 75041521 74250877 73392719 72441763 71393710 70240927 68979031
2188.5F8979031j352561j418674j464444j484770j480198j463681j452023j456022
$$ 68979031 67626470 66207796 64743352 63258582 61778384 60314703 58862680 57406658
2204.8E7406658j472491j499343j535535j585305j652270j742050j866406k031109
$$ 57406658 55934167 54434824 52899289 51313984 49661714 47919664 46053258 44022149
2221.2D4022149k237377k489596k780611l083774l373763l603306l710884l665415
$$ 44022149 41784772 39295176 36514565 33430791 30057028 26453722 22742838 19077423
2237.5A9077423l468363l126190k667494k156449j667350j254035r26207o82596n15499
$$ 19077423 15609060 12482870 9815376 7658927 5991577 4737542 3811335 3128739 2613240
2255.8B613240m07906l32385k68632k14861j70891j34366r4417n2579j7980J7097O8693
$$ 2613240 2205334 1872949 1604317 1389456 1218565 1084199 989782 937203 919223 936320 1005013
2278.3A005013J30940K04122L00372M32387O18278Q53013J122108J413878J727644
$$ 1005013 1135953 1340075 1640447 2072834 2691112 3544125 4666233 6080111 7807755
2296.6G807755K064196K412036K728320K969783L125366L183837L142657L020319K827874
$$ 7807755 9871951 12283987 15012307 17982090 21107456 24291293 27433950 30454269 33282143
2315C3282143K587071K361453K157351J942053J725042J541266J413909J328671J248654
$$ 33282143 35869214 38230667 40388018 42330071 44055113 45596379 47010288 48338959 49587613
2333.3D9587613J179272J143885J111007J084888J096195J106053J020175R40627J010722
$$ 49587613 50766885 51910770 53021777 54106665 55202860 56308913 57329088 58269715 59280437
2351.7E9280437J168722J291329J402074J524812J631147J721191J802552J873457
$$ 59280437 60449159 61740488 63142562 64667374 66298521 68019712 69822264 71695721
2368G1695721J907790J889330J849526J798564J729650J648533J562804J467973J370406
$$ 71695721 73603511 75492841 77342367 79140931 80870581 82519114 84081918 85549891 86920297
2386.4H6920297J277369J188034J099599J004183R11850Q27628P48736O75869O10780
$$ 86920297 88197666 89385700 90485299 91489482 92401332 93228960 93977696 94653565 95264345
2404.7I5264345N56195N14025M78857M44818M07040L65335L29816L01647K80583K68066
$$ 95264345 95820540 96334565 96813422 97258240 97665280 98030615 98360431 98662078 98942661 99210727
2425.1I9210727K60312K49284K38419K24626K11262K10095K03681J85454J72639J71864
$$ 99210727 99471039 99720323 99958742 100183368 100394630 100604725 100808406 100993860 101166499 101338363
2445.5A01338363J71137J60086J44159J36972J34265J24121J08421R7895R7525R2911
$$ 101338363 101509500 101669586 101813745 101950717 102084982 102209103 102317524 102415419 102512944 102605855
2465.9A02605855Q1039P1859P0751P3957P1133O3085N7638N3704M4679L0601K0337
$$ 102605855 102686894 102758753 102829504 102903461 102974594 103037679 103095317 103149021 103193700 103224301 103244638
2488.3A03244638K2543K9707K8562K1470K1064L0136M0484M0388L0756K6190K1696
$$ 103244638 103267181 103296888 103325450 103346920 103367984 103398120 103438604 103478992 103509748 103535938 103557634
2510.8A03557634J0467P987J5962J5605J5544K7562K9635J9479J4734J0526J705j526
$$ 103557634 103568101 103576088 103592050 103607655 103623199 103650761 103680396 103699875 103714609 103725135 103726840 103725314
2535.3A03725314k74p165j7571j8752j9872k2876j6081j2875k0361k4092k3663l3140
$$ 103725314 103725040 103717875 103700304 103681552 103661680 103638804 103622723 103609848 103589487 103565395 103541732 103508592
2559.7A03508592m9985o0630o5183p8655j04570j19126j19960j24669j26386j20115
$$ 103508592 103458607 103397977 103332794 103254139 103149569 103030443 102910483 102785814 102659428 102539313
2580.1A02539313j20020j24705j23739j19853j02711o0856r66O9261J27840J50895
$$ 102539313 102419293 102294588 102170849 102050996 101948285 101887429 101886463 101955724 102083564 102234459
2600.5A02234459J46067J28794J07312Q7380O7497M1938J2755o127k2173n3668q6892
$$ 102234459 102380526 102509320 102616632 102704012 102771509 102813447 102826202 102820075 102797902 102744234 102657342
2623A02657342r6858q4757p5066q3483r4378q4138o6518n2715k7680o80J3650J1217
$$ 102657342 102560484 102475727 102400661 102317178 102222800 102138662 102072144 102019429 101991749 101991069 102004719 102015936
2647.4A02015936O80l660p069k2209m5955o3312p7677q6534p7951o2644n2190m0328
$$ 102015936 102016616 102012956 102005887 101983678 101937723 101874411 101796734 101710200 101632249 101569605 101517415 101477087
2671.9A01477087k5750j4817l171K4151O0225O1548K7966k50j9848m3524p1430r4879
$$ 101477087 101451337 101436520 101433349 101457500 101517725 101579273 101607239 101606989 101587141 101543617 101472187 101377308
2696.4A01377308r8276q3112p3946p3421q0347r4652j01936j13762j36864j58179j85298
$$ 101377308 101279032 101195920 101121974 101048553 100968206 100873554 100771618 100657856 100520992 100362813 100177515
2718.8A00177515k08235k10572k00831j49656q1444o9218q9276j15001j20491q6755
$$ 100177515 99969280 99758708 99557877 99408221 99326777 99257559 99168283 99053282 98932791 98846036
2739.2I8846036r0653j58661k36905k81155k62451k28244k48808k95573l16048l16924
$$ 98846036 98755383 98596722 98359817 98078662 97816211 97587967 97339159 97043586 96727538 96410614
2759.6I6410614l09252k96826k86358k72471k68453k93547l01606k37137j67680j73425
$$ 96410614 96101362 95804536 95518178 95245707 94977254 94683707 94382101 94144964 93977284 93803859
2780I3803859j94687j75512j68937j68622j00559j1664J2684M7K3610P0631O5112J2344
$$ 93803859 93609172 93433660 93264723 93096101 92995542 92983878 92996562 92996609 93020219 93090850 93155962 93168306
2804.5I3168306n8871j49173k10839k56115l50619m70370n79399o98507q48424j030070
$$ 93168306 93109435 92960262 92749423 92493308 92142689 91672319 91092920 90394413 89545989 88515919
2824.9H8515919j260596j557118j894265k221883k496069k684921k760470k759010
$$ 88515919 87255323 85698205 83803940 81582057 79085988 76401067 73640597 70881587
2841.2G0881587k752804k751279k734179k700603k647769k558941k419621k215838
$$ 70881587 68128783 65377504 62643325 59942722 57294953 54736012 52316391 50100553
2857.5E0100553j959690j682774j373639j024655o66121l00347O7818L81735O01113
$$ 50100553 48140863 46458089 45084450 44059795 43393674 43093327 43161145 43542880 44143993
2875.9D4143993P21475P20942N91701L67350J04508j42864l43832m63185m70522l70312
$$ 44143993 44865468 45586410 46178111 46545461 46649969 46507105 46163273 45700088 45229566 44859254
2896.3D4859254j90347L7092K74771M85480O39200P21381P37550O92362N93692M41319
$$ 44859254 44668907 44705999 44980770 45466250 46105450 46826831 47564381 48256743 48850435 49291754
2916.7D9291754K11575q9219m14002p03743q48311p10091k32190N56162J544607K500686
$$ 49291754 49503329 49414110 49000108 48296365 47448054 46737963 46505773 47061935 48606542 51107228
2937E1107228L167283L417266L279507K868056K293736J623565Q84795Q1313q52007
$$ 51107228 54274511 57691777 60971284 63839340 66133076 67756641 68641436 68722749 67870742
2955.4F7870742j998663l296780m498899n232120n159581m206833k680692j046634
$$ 67870742 65872079 62575299 58076400 52844280 47684699 43477866 40797174 39750540
2971.7C9750540L41216J332289J993269K441400K780011L143513L563571L935463M154354
$$ 39750540 40091756 41424045 43417314 45858714 48638725 51782238 55345809 59281272 63435626
2990.1F3435626M188335M066151L771520L323251K820504K319884J900888J582372
$$ 63435626 67623961 71690112 75461632 78784883 81605387 83925271 85826159 87408531
3006.4H7408531J257646R14359O47223M54390K42877j8323k89356m95267m80253k27570
$$ 87408531 88666177 89580536 90227759 90682149 90925026 90906703 90617347 90122080 89641827 89414257
3026.8H9414257L8057K00361K71273K82913J99461m9388k13748o7192K40910M69452
$$ 89414257 89452314 89652675 89923948 90206861 90406322 90356934 90143186 90075994 90316904 90786356
3047.2I0786356N02103M68940M46522L44008K46805J99926J10209M1372Q5950K74211
$$ 90786356 91288459 91757399 92203921 92547929 92794734 92994660 93104869 93146241 93232191 93506402
3067.6I3506402N24431O36000N73927M49544M04316N05036N79983N28533M63503L90142
$$ 93506402 94030833 94666833 95240760 95690304 96094620 96599656 97179639 97708172 98171675 98561817
3088I8561817L07507K90590K53058J21331p409k7215L6168L2150p0750j13523m6766
$$ 98561817 98869324 99159914 99412972 99534303 99526894 99499679 99535847 99567997 99497247 99383724 99336958
3110.4I9336958m8524j46443j54894o7842K3704R5976J16199R9391J17755J92666K53790
$$ 99336958 99288434 99141991 98987097 98919255 98942959 99038935 99155134 99254525 99372280 99564946 99818736
3132.8I9818736K34646J72436J76096K53677K74170K02668J17337K4701m0579K5773
$$ 99818736 100053382 100225818 100401914 100655591 100929761 101132429 101249766 101274467 101233888 101259661
3153.2A01259661J38592J22118J5378n9878q3483r5117j15871j30427j42813j65641
$$ 101259661 101398253 101520371 101535749 101475871 101392388 101297271 101181400 101050973 100908160 100742519
3173.6A00742519j85263k04480k13027j94240j74176j44232q3297q988N7601J09458
$$ 100742519 100557256 100352776 100139749 99945509 99771333 99627101 99543804 99534816 99592417 99701875
3194I9701875J44005J49858J32126J08874Q9967P5603N5396J6856l0684n6303p3147
$$ 99701875 99845880 99995738 100127864 100236738 100326705 100402308 100457704 100474560 100443876 100387573 100314426
3216.5A00314426r0444p0750p0656j29187j71512k10810k90400l12245k12085j45542
$$ 100314426 100223982 100153232 100082576 99953389 99781877 99571067 99280667 98968422 98756337 98610795
3236.9I8610795k02024k77842l36653l78865l54427k89130k64489k83230k81244k32470
$$ 98610795 98408771 98130929 97794276 97415411 97060984 96771854 96507365 96224135 95942891 95710421
3257.3I5710421j90044j84089k01130k27123k60550l00664k85321k27851k08735k26790
$$ 95710421 95520377 95336288 95135158 94908035 94647485 94346821 94061500 93833649 93624914 93398124
3277.7I3398124k58195k82538k73085k26933j90848j92827j74594j02752k2829L4857
$$ 93398124 93139929 92857391 92584306 92357373 92166525 91973698 91799104 91696352 91673523 91708380
3298I1708380N1463K9158K8825Q7154J66285K13414K36297K47157K32052J99771J61827
$$ 91708380 91759843 91789001 91817826 91904980 92071265 92284679 92520976 92768133 93000185 93199956 93361783
3320.5I3361783J23143J17010J70308K13808J97387J74153J60146J47026J66649K04933
$$ 93361783 93484926 93601936 93772244 93986052 94183439 94357592 94517738 94664764 94831413 95036346
3340.9I5036346K29966K42055K05386J34938J38730K00105K04360J49525J00153R6435
$$ 95036346 95266312 95508367 95713753 95848691 95987421 96187526 96391886 96541411 96641564 96737999
3361.3I6737999Q7571J7202k8688N186N2017K1529q3310j73086k16007k35182k60037
$$ 96737999 96825570 96842772 96814084 96819270 96871287 96892816 96809506 96636420 96420413 96185231 95925194
3383.7I5925194k82848l04532l25090k47359q1825O640q685J1605J49209K75188K54846
$$ 95925194 95642346 95337814 95012724 94765365 94683540 94690180 94681495 94693100 94842309 95117497 95372343
3406.1I5372343J89018J81878K18129L00527L65549L60006M03267N01263M99851L97092
$$ 95372343 95561361 95743239 95961368 96261895 96627444 96987450 97390717 97891980 98391831 98788923
3426.5I8788923L20417L32021L12305K23422K65503M06027M03917K74241J60133J38522
$$ 98788923 99109340 99441361 99753666 99977088 100242591 100648618 101052535 101326776 101486909 101625431
3446.9A01625431J97887K17688J77562J34921M5896n0986j6832J824j58775k44510
$$ 101625431 101823318 102041006 102218568 102353489 102399385 102348399 102331567 102333391 102174616 101930106
3467.3A01930106n9021J54364J29342l8087j62172j58227m3535j7798r3257q8704n0652
$$ 101930106 101871085 102025449 102154791 102116704 101954532 101796305 101752770 101734972 101641715 101553011 101502359
3489.8A01502359p8428j17421j12152p4780n7924n9187l851N2440K6656j4115j3792
$$ 101502359 101423931 101306510 101194358 101119578 101061654 101002467 100998616 101051056 101077712 101063597 101049805
3512.2A01049805K4211O1417N7339J6654k4307P761R0480J22451J07503P3838K4283
$$ 101049805 101074016 101135433 101192772 101209426 101185119 101192880 101283360 101405811 101513314 101587152 101611435
3534.6A01611435K0922N7184K1911m1211q046R3162J16265N8639M5335N8651L4988
$$ 101611435 101632357 101689541 101711452 101670241 101662195 101755357 101871622 101930261 101975596 102034247 102069235
3557.1A02069235k802k9444l5274m0436k5725M3058P9441N0294J3590P2j2195l4166
$$ 102069235 102066433 102036989 102001715 101961279 101935554 101978612 102058053 102108347 102121937 102122009 102109814 102075648
3581.5A02075648o9832o8343N0890J35064Q1385M9173M1747J7834M8351J11115J01436
$$ 102075648 102005816 101937473 101988363 102123427 102204812 102253985 102295732 102313566 102361917 102473032 102574468
3604A02574468M6074L1126M3463K8193J8704K1482J8346N4395R6762O6507k0420o8832
$$ 102574468 102620542 102651668 102695131 102723324 102742028 102763510 102781856 102836251 102933013 102999520 102979100 102910268
3628.5A02910268M626M5764J0610j1432j9134l7324p5030j40131k30884k67315r3496
$$ 102910268 102914894 102960658 102971268 102959836 102940702 102903378 102828348 102688217 102457333 102190018 102096522
3650.9A02096522L3450n6505j80924j66071r8836r1183j41120k01225k22922j61362
$$ 102096522 102129972 102073467 101892543 101726472 101627636 101536453 101395333 101194108 100971186 100809824
3671.3A00809824r7548p8226J4091P9000O3360K7299l2223j02746l3796J50251J63794
$$ 100809824 100712276 100634050 100648141 100727141 100790501 100817800 100785577 100682831 100649035 100799286 100963080
3693.7A00963080Q7297N2607M1652M1365O7163O5005K9647K8265R6869J67429J68503
$$ 100963080 101050377 101102984 101144636 101186001 101253164 101318169 101347816 101376081 101472950 101640379 101808882
3716.2A01808882J25420Q2826R4653J50811J90187J75226J08909K3520Q750J24776
$$ 101808882 101934302 102017128 102111781 102262592 102452779 102628005 102736914 102760434 102769184 102893960
3736.5A02893960K19203K23708J91593J28651P4005O1285Q0586J47271J58548R8133
$$ 102893960 103113163 103336871 103528464 103657115 103731120 103792405 103872991 104020262 104178810 104276943
3756.9A04276943N2297N1964M1532J1993p63j0074n340K1934P308n1522o6757k432
$$ 104276943 104329240 104381204 104422736 104434729 104433966 104423892 104418552 104440486 104447794 104396272 104329515 104327083
3781.4A04327083J6605j4531j3733j5557k4307k5558m3583k9719J323j859L4511N4085
$$ 104327083 104343688 104329157 104315424 104299867 104275560 104250002 104206419 104176700 104178023 104176164 104210675 104264760
3805.9A04264760N4538Q8406P0250l362n0020j4675M3071J02341J30629J15276J02770
$$ 104264760 104319298 104407704 104477954 104474592 104424572 104409897 104452968 104555309 104685938 104801214 104903984
3828.3A04903984O6495j0300p7307p8249K1064J19996J26637R8288O3157L1960k206
$$ 104903984 104970479 104960179 104882872 104804623 104825687 104945683 105072320 105170608 105233765 105265725 105263519
3850.8A05263519m6873j8775N8174O4397K4950j1241J442L9661K4283k0623M899O2943
$$ 105263519 105216646 105197871 105256045 105320442 105345392 105334151 105335593 105375254 105399537 105378914 105383813 105446756
3875.2A05446756N5861j359j9490q357L922N0211N0676J6487K8419L3784l147l7801
$$ 105446756 105502617 105501258 105481768 105473411 105477333 105527544 105578220 105594707 105623126 105656910 105653763 105615962
3899.7A05615962l7992k480N3322P2265M7600K3794n567m4059k8563J0777m363k3950
$$ 105615962 105577970 105575490 105628812 105701077 105748677 105772471 105766904 105722845 105694282 105705059 105700696 105676746
3924.2A05676746q130j621k9242m7159k4069N25n698l9971n4336k1147j1051l4094
$$ 105676746 105668616 105666995 105637753 105590594 105566525 105567050 105561352 105521381 105467045 105445898 105434847 105400753
3948.7A05400753l9458k8157j6201k7573m4942k8622n102r477l7277n7209m3976k5916
$$ 105400753 105361295 105333138 105316937 105289364 105244422 105215800 105210698 105201221 105163944 105106735 105062759 105036843
3973.1A05036843l8922n3811m2904l9684n0867n0390m3821l0696j5951k2351l5072
$$ 105036843 104997921 104944110 104901206 104861522 104810655 104760265 104716444 104685748 104669797 104647446 104612374
3995.6A04612374l5083
$$ 104612374 104577291
3997.6A04577291
$$ 104577291
##END=$$ End of the data block
