##TITLE=Isocianate ISO 99 PB $$ Begin of the data block
##JCAMP-DX=5.00 $$ ACD/SpecManager v 10.08
##SPECTROMETER/DATA SYSTEM=Alpha
##DATE=25 Nov 2015 09:11:28
##DATA TYPE=INFRARED SPECTRUM
##DATA CLASS=XYDATA
##ORIGIN=
##OWNER=
##NPOINTS=1667
##FIRSTX=599.64648438
##LASTX=3997.64306641
##MAXX=3997.64306641
##MINX=599.64648438
##MAXY=1.09623599
##MINY=0.07119510
##XFACTOR=1.0000000000
##YFACTOR=0.000000010000000
##FIRSTY=0.96848369
##DELTAX=2.03961372
##XUNITS=1/CM
##YUNITS=ARBITRARY UNITS
##XYDATA=(X++(Y..Y))
599.6I6848369j66244k71666l46261l60203l85225m15587m30459m09734l00646j45191
$$ 96848369 96682125 96410459 96064198 95703995 95318770 94903183 94472724 94062990 93762344 93617153
620I3617153K8902K66481N24610P57545Q93772Q21072N57274K59643M2522J2118K64412
$$ 93617153 93646055 93912536 94437146 95194691 96088463 96909535 97466809 97726452 97768974 97781092 98045504
642.5I8045504O49875Q36766P73794O51681N10848L77631K99466K46274J98102J31047
$$ 98045504 98695379 99532145 100305939 100957620 101468468 101846099 102145565 102391839 102589941 102720988
662.9A02720988q8024l92592j34301L15618J39213r7430k00963k68388l12495l08585
$$ 102720988 102632964 102240372 102106071 102421689 102560902 102463472 102262509 101994121 101681626 101373041
683.3A01373041k73836k40672j43420k384R0336J30201J39916J49214J66392J53935
$$ 101373041 101099205 100858533 100715113 100712729 100803065 100933266 101073182 101222396 101388788 101542723
703.7A01542723J19150J35696J96874J93548J02163j7036j49011k27928j98913j44422
$$ 101542723 101661873 101797569 101994443 102187991 102290154 102273118 102124107 101896179 101697266 101552844
724.1A01552844r8205m2235P915M5657M0412p236q0311k42710n09942q08042j063162
$$ 101552844 101454639 101412404 101420319 101465976 101506388 101499152 101418841 101176131 100666189 99858147 98794985
746.5I8794985j187509j102800p62725j63328N08296Q98147Q68392O24818M35721M04501
$$ 98794985 97607476 96504676 95741951 95578623 96086919 96985066 97853458 98478276 98913997 99318498
766.9I9318498M61632M60649L10981O2359j56844k70784l02523l00974l15940m49264
$$ 99318498 99780130 100240779 100551760 100614119 100457275 100186491 99883968 99582994 99267054 98817790
787.3I8817790q20023j540244k775901m589189o267970o019968k883852R68600K279704
$$ 98817790 97997767 96457523 93681622 89092433 82824463 76804495 73920643 74889243 77168947
805.6G7168947P20036j391673k245611j668953l57378R24873J768673K157885K270913
$$ 77168947 77888983 76497310 74251699 72582746 72225368 73150241 74918914 77076799 79347712
824G9347712K307379K359182K406537K393246K220708J837999J336288Q63880M87816
$$ 79347712 81655091 84014273 86420810 88814056 91034764 92872763 94209051 95072931 95560747
842.4I5560747J32931l43067r72014j538098j658643j145005k85798L84927O19691
$$ 95560747 95693678 95350611 94378597 92840499 91181856 90036851 89751053 90135980 90755671
860.7I0755671O26391P51621J147491J653284J916354J764071J355923R30047O31988
$$ 90755671 91382062 92133683 93281174 94934458 96850812 98614883 99970806 100900853 101532841
879.1A01532841M74000L81517L14748K57171J90281J31870R7239N4049r060o6983j16325
$$ 101532841 102006841 102388358 102703106 102960277 103150558 103282428 103379667 103433716 103424656 103357673 103241348
901.5A03241348j75237k63632l93533n94342q88479j068240p54708M2063P77816R99540
$$ 103241348 103066111 102802479 102408946 101814604 100926125 99857885 99103177 99145240 99923056 100922596
921.9A00922596P95317M99344K93040J72830Q6474Q667p1740j44446j82462j72377
$$ 100922596 101717913 102217257 102510297 102683127 102769601 102778268 102706528 102562082 102379620 102207243
942.3A02207243j23715n6481N471L6097J9669l9124j14870j53589j19484k7871R7346
$$ 102207243 102083528 102027047 102032518 102068615 102088284 102049160 101934290 101780701 101661217 101633346 101730692
964.7A01730692K14065K88116L12853L10171K98345K65431K02334J08004L290r1219
$$ 101730692 101944757 102232873 102545726 102855897 103154242 103419673 103622007 103730011 103733301 103642082
985.1A03642082j58620j93762k05958k08116k00188j80948j55020j28114j35422k15339
$$ 103642082 103483462 103289700 103083742 102875626 102675438 102494490 102339470 102211356 102075934 101860595
1005.5A01860595m19915p64537j359331k967430n209505m157221J300227N089224L968459
$$ 101860595 101440680 100676143 99316812 96349382 91139877 86982656 88282883 93372107 97340566
1023.9I7340566J456773K16669j30236l18563m95923o06411n87863m74870l65448k76941
$$ 97340566 98797339 99014008 98883772 98565209 98069286 97462875 96875012 96400142 96034694 95757753
1044.3I5757753k19310k20322k83140l47048l79575l81726l43203l50386m78554n64170
$$ 95757753 95538443 95318121 95034981 94687933 94308358 93926632 93583429 93233043 92754489 92190319
1064.7I2190319m33343k48850k34312l03012l04776k39045j32036M930J37972K14196
$$ 92190319 91756976 91508126 91273814 90970802 90666026 90426981 90294945 90299875 90437847 90652043
1085.1I0652043K03752Q2374k08080p44534j494163k268320k839309l080273l016686
$$ 90652043 90855795 90938169 90730089 89985555 88491392 86223072 83383763 80303490 77286804
1103.4G7286804k633632j702475j20395J552099K461808K375287J759041J113015N65028
$$ 77286804 74653172 72950697 72830302 74382401 76844209 79219496 80978537 82091552 82656580
1121.8H2656580N615o27798j262671j803434k204620k458263k552426k439397k088869
$$ 82656580 82662195 82034397 80771726 78968292 76763672 74305409 71752983 69313586 67224717
1140.1F7224717j565951r76372m14258M8327L92980O21819P44397P98988Q22652Q31770
$$ 67224717 65658766 64682394 64268136 64316463 64709443 65331262 66075659 66874647 67697299 68529069
1160.5F8529069Q39091Q33040Q03650P69049P29388O51204M92567K83402J98758L72207
$$ 68529069 69368160 70201200 71004850 71773899 72503287 73154491 73647058 73930460 74129218 74501425
1180.9G4501425O55043P96521P49141O25610N05877M14771L34167J84053o8539l02774
$$ 74501425 75156468 75952989 76702130 77327740 77833617 78248388 78582555 78766608 78698069 78395295
1201.3G8395295l38220j06258K78342N33831M52602J57523n6773m4954J30612L40277
$$ 78395295 78057075 77950817 78229159 78762990 79215592 79373115 79316342 79271388 79402000 79742277
1221.7G9742277N12784O19990O34271N61857M37737L02595J95336J34390J31703K10738
$$ 79742277 80255061 80875051 81509322 82071179 82508916 82811511 83006847 83141237 83272940 83483678
1242.1H3483678L07095L29906L19749L40176L80784M16094M38750M45527M47636M35371
$$ 83483678 83790773 84120679 84440428 84780604 85161388 85577482 86016232 86461759 86909395 87344766
1262.5H7344766L74150K53230R5892l8129r3561o2150J4222O9725O3467K4641N7655
$$ 87344766 87718916 87972146 88068038 88029909 87936348 87874198 87888420 87958145 88021612 88046253 88103908
1285H8103908K61188N28061N73254L31229J82700M80598Q64458P55072K48754k21527
$$ 88103908 88365096 88893157 89466411 89797640 89980340 90460938 91325396 92080468 92329222 92107695
1305.4I2107695m71377n28783m51219k36726Q0795M62544Q81946J141274J114863Q91644
$$ 92107695 91636318 91107535 90656316 90419590 90500385 90962929 91844875 92986149 94101012 94992656
1325.8I4992656N62852K12133q3470l12686m61930m55147k10977P564o5851k28334
$$ 94992656 95555508 95767641 95684171 95371485 94909555 94454408 94243431 94250995 94185144 93956810
1346.2I3956810k76696k19292j50305j04731q5593j80351l95000n05561m47482n36549
$$ 93956810 93680114 93460822 93310517 93205786 93120193 92939842 92544842 92039281 91591799 91055250
1366.6I1055250p32654q01385q20076o83475l41725q6391J62941M59403P24405J120818
$$ 91055250 90322596 89521211 88701135 88017660 87675935 87589544 87752485 88211888 88936293 90057111
1386.9I0057111J417243J108068O65033N56237N57953M77809L03954n9337m84979r91118
$$ 90057111 91474354 92582422 93247455 93803692 94361645 94839454 95143408 95084071 94599092 93607974
1407.3I3607974j789731k524358k374422j206804N74065K373302K352607J397770P11328
$$ 93607974 91818243 89293885 86919463 85712659 86286724 88660026 91012633 92410403 93121731
1425.7I3121731q2385q80188j288444j256460r14806n8114N19311O20258O36989N77682
$$ 93121731 93039346 92159158 90870714 89614254 88699448 88641334 89160645 89780903 90417892 90995574
1446.1I0995574N42498M24039J39791j62977q6409Q83228J366001J146382J251554
$$ 90995574 91538072 91962111 92101902 91938925 91852516 92735744 94101745 95248127 96499681
1464.5I6499681J440192R91505L47489J03045L63981M52984K98822J07479j0491k11262
$$ 96499681 97939873 98931378 99278867 99381912 99745893 100198877 100497699 100605178 100594687 100383425
1484.9A00383425n42850o70605l90423l37130r19222j617629j912188k178294k765727
$$ 100383425 99840575 99169970 98779547 98442417 97523195 95905566 93993378 91815084 89049357
1503.2H9049357m366988o495303m216283k132863k221054l250331m495877m740816
$$ 89049357 84682369 78187066 73970783 71837920 69616866 66366535 61870658 57129842
1519.5E7129842m596829k876759m60613J344210K487868L589189N456609N248284M219145
$$ 57129842 52533013 49656254 49195641 50539851 53027719 56616908 62073517 67321801 71540946
1537.9G1540946N843395O575173M652429L520250K573496J985609J523906R68481M00108
$$ 71540946 77384341 83959514 88611943 92132193 94705689 96691298 98215204 99183685 99583793
1556.2I9583793K78985J142574Q69488J10746m55761j322747k406293k886271l184897
$$ 99583793 99862778 101005352 101874840 101985586 101529825 100207078 97800785 94914514 91729617
1574.6I1729617k233028R75287L083253L503084K560282J127326L1459o85882j119876
$$ 91729617 89496589 90471876 93555129 97058213 99618495 100745821 100777280 100091398 98971522
1593I8971522j325822j394659j588369k120781k921372l531933l016389p30210K175796
$$ 98971522 97645700 96251041 94662672 92541891 89620519 86088586 83072197 82341987 84517783
1611.3H4517783L619039M092032M320132K936107J560074J152945R01663N81956M22871
$$ 84517783 88136822 92228854 96548986 99485093 101045167 102198112 103099775 103681731 104104602
1629.7A04104602J53447k70379l38519K41196L68870P2849k88821n37657j61899N7042
$$ 104104602 104258049 103987670 103649151 103890347 104259217 104332066 104043245 103505588 103343689 103400731
1650.1A03400731l24213L635O35982L43907m6659j68395k4306j31822m58825l67284
$$ 103400731 103076518 103080153 103716135 104060042 104013383 103844988 103820682 103688860 103230035 102862751
1670.5A02862751j05690j71638j96075k43116n32961q75294p27296j76048k63947n34773
$$ 102862751 102757061 102585423 102389348 102146232 101613271 100737977 100010681 99834633 99570686 99035913
1690.9I9035913p51221j204074j392317j258230j297670j245058j621574k081549k203775
$$ 99035913 98284692 97080618 95688301 94430071 93132401 91887343 90265769 88184220 85980445
1709.2H5980445k458674k786713l150958l530985l127861k877695l674602m567367
$$ 85980445 83521771 80735058 77584100 74053115 70925254 68047559 64372957 59805590
1725.5E9805590m964554n106432m662132m196560k684641p09871O65301K090672L398374
$$ 59805590 54841036 49734604 45072472 40875912 38191271 37481400 38146701 40237373 43635747
1743.9D3635747M595697N911836P702958Q344913O841004N793994N114139L818243
$$ 43635747 48231444 54143280 61846238 70191151 77032155 82826149 87940288 91758531
1760.2I1758531L008402K165949J245451O68389K48038P3666J64389J85067K47019
$$ 91758531 94766933 96932882 98178333 98846722 99094760 99168426 99332815 99517882 99764901
1778.6I9764901N52529P79880P63714N95653K94387M9103K23565M40156L20244J64735
$$ 99764901 100317430 101097310 101861024 102456677 102751064 102800167 103023732 103463888 103784132 103948867
1799A03948867J88125L30114K93410J28567J7261Q3971J85168J46377O5339N1808J717
$$ 103948867 104136992 104467106 104760516 104889083 104906344 104990315 105175483 105321860 105387199 105439007 105440724
1821.4A05440724r3174p1597m0317P940J99353K22099O3539J6355j0943j50395j73783
$$ 105440724 105347550 105275953 105235636 105243576 105442929 105665028 105728567 105744922 105733979 105583584 105409801
1843.8A05409801O3503J88577J30117N6100o998l9589n6696m3798m8422j43433l07822
$$ 105409801 105473304 105661881 105791998 105848098 105841100 105801511 105744815 105701017 105652595 105509162 105201340
1866.3A05201340k87438J3638J26946M577q1574p5412n1737m2486n6827j11556j58537
$$ 105201340 104913902 104927540 105054486 105059063 104977489 104902077 104850340 104807854 104751027 104639471 104480934
1888.7A04480934r2006o5398j28758j08146p1907o7974l2758K6047O7401J48189K60246
$$ 104480934 104388928 104323530 104194772 104086626 104014719 103946745 103913987 103940034 104007435 104155624 104415870
1911.1A04415870K73788J74963J25909J86753J91701K08056K59125K08139J27256R9230
$$ 104415870 104689658 104864621 104990530 105177283 105368984 105577040 105836165 106044304 106171560 106270790
1931.5A06270790R6035R4497O5840j9026n8508M6885J36518J07777O1977L3403J4293
$$ 106270790 106366825 106461322 106527162 106508136 106449628 106496513 106633031 106740808 106802785 106836188 106850481
1954A06850481L016j192Q46r89l0565m2975L5214R9075P0965L4607K8193K6071K5928
$$ 106850481 106853497 106852305 106853151 106852162 106821597 106778622 106813836 106912911 106983876 107018483 107046676 107072747 107098675
1980.5A07098675K8872K2090k802l9982m3929L7026J02461N8853J5915K1291K2304
$$ 107098675 107127547 107149637 107146835 107106853 107062924 107099950 107202411 107261264 107277179 107298470 107320774
2002.9A07320774J3411R250J1468J2529k086l3152k6095K1815L0709P081l267r453
$$ 107320774 107334185 107343435 107354903 107367432 107365346 107332194 107306099 107327914 107358623 107365704 107362437 107352984
2027.4A07352984j5891k1028k7430l0649m2808p1692q7417q3625q7833j02568j22178
$$ 107352984 107337093 107316065 107288635 107257986 107215178 107143486 107056069 106972444 106884611 106782043 106659865
2049.8A06659865j43933j63364j78075j95968k18594k34628k35129k05099j64318j36578
$$ 106659865 106515932 106352568 106174493 105978525 105759931 105525303 105290174 105085075 104920757 104784179
2070.2A04784179r1625l0112J1075L6454O8891R6035R4020P9215P8118Q8191Q2969
$$ 104784179 104692554 104662442 104673517 104709971 104778862 104874897 104968917 105048132 105126250 105214441 105297410
2092.7A05297410N8651L9328L0100J9252j442l0804o9702j11556j41167j64724k03240
$$ 105297410 105356061 105395389 105425489 105444741 105443299 105412495 105342793 105231237 105090070 104925346 104722106
2115.1A04722106k50422l01195l67629m44067n18059n82886o44112p14433p85363q31604
$$ 104722106 104471684 104170489 103802860 103358793 102840734 102257848 101613736 100899303 100113940 99282336
2135.5I9282336q54987q60303q36444p88105p22807o40119n59461n00184m61775m56625
$$ 99282336 98427349 97567046 96730602 95942497 95219690 94579571 94020110 93519926 93058151 92601526
2155.9I2601526m87197n41359o06614o56331o68049o47217o10917n72718n46664n42676
$$ 92601526 92114329 91572970 90966356 90310025 89641976 88994759 88383842 87811124 87264460 86721784
2176.3H6721784n63634o17563p05272p99376q93968r91828j078856j153707j210517
$$ 86721784 86158150 85540587 84835315 84035939 83141971 82150143 81071287 79917580 78707063
2194.6G8707063j240641j254934j262325j266038j279676j304370j337380j382154
$$ 78707063 77466422 76211488 74949163 73683125 72403449 71099079 69761699 68379545
2211F8379545j442975j524466j641708j820368k072358k393222k777922l214884l664815
$$ 68379545 66936570 65412104 63770396 61950028 59877670 57484448 54706526 51491642 47826827
2229.3D7826827m069797m366812m502675m435539m159379l702842l125140k519837
$$ 47826827 43757030 39390218 34887543 30452004 26292625 22589783 19464643 16944806
2245.6A6944806j962676j497917j145050r06005p61531o83800o35469n80978n08667
$$ 16944806 14982130 13484213 12339163 11433158 10671627 9987827 9352358 8771380 8262713
2264H262713m21316l24061k21498j28203m8125K7851J14978K13978L25150M55356O11848
$$ 8262713 7841397 7517336 7295838 7167635 7119510 7147361 7262339 7476317 7801467 8256823 8868671
2286.4H868671Q09296J047360J316681J612394J944388K299576K652937K972496L221654
$$ 8868671 9677967 10725327 12042008 13654402 15598790 17898366 20551303 23523799 26745453
2304.8B6745453L385494L452703L422445L295270L060063K745518K447808K205646
$$ 26745453 30130947 33583650 37006095 40301365 43361428 46106946 48554754 50760400
2321.1E0760400J988936J767301J564116J443600J404023J362962J299667J271701
$$ 50760400 52749336 54516637 56080753 57524353 58928376 60291338 61591005 62862706
2337.4F2862706J258117J247049J306533J423186J270760Q94284P10046Q10564R75799
$$ 62862706 64120823 65367872 66674405 68097591 69368351 70262635 70972681 71783245 72759044
2355.8G2759044J098669J229089J367790J489144J590067J676476J717145J700473
$$ 72759044 73857713 75086802 76454592 77943736 79533803 81210279 82927424 84627897
2372.1H4627897J665979J640517J609832J538038J424128J292383J158107J031357
$$ 84627897 86293876 87934393 89544225 91082263 92506391 93798774 94956881 95988238
2388.4I5988238R22114Q35603P63351O94292O25551N65505N09131M56023M21775L99339
$$ 95988238 96910352 97745955 98509306 99203598 99829149 100394654 100903785 101359808 101781583 102180922
2408.8A02180922L74389L53622L32654L00467K67958K38026K14266K05231K01774J88529
$$ 102180922 102555311 102908933 103241587 103542054 103810012 104048038 104262304 104467535 104669309 104857838
2429.2A04857838J75297J70553J66237J56630J39987J28627J24740J23823J24550J17826
$$ 104857838 105033135 105203688 105369925 105526555 105666542 105795169 105919909 106043732 106168282 106286108
2449.6A06286108J07325J01161R5474R3353R3651Q8716Q2755P2681O2526N4574M5097
$$ 106286108 106393433 106494594 106590068 106683421 106777072 106865788 106948543 107021224 107083750 107138324 107183421
2472A07183421M6789N5290N3131M7207M4787L4332K0194J5366J9932K8229L0160J7679
$$ 107183421 107230210 107285500 107338631 107385838 107430625 107464957 107485151 107500517 107520449 107548678 107578838 107596517
2496.5A07596517P093J5115K3985K1231J2744O163K468l446j275Q500O067K623R239
$$ 107596517 107603610 107618725 107642710 107663941 107676685 107682848 107685316 107681870 107680595 107689095 107695162 107697785 107707024
2523A07707024J1956J6284K0922J2040K825R000J7715J2576K313k337q428o389J1921
$$ 107707024 107718980 107735264 107756186 107768226 107771051 107780051 107797766 107810342 107812655 107810318 107801890 107795501 107807422
2549.5A07807422J5378j276j0955p713M29K897k945p546j0132j4842j5831j6880k5797
$$ 107807422 107822800 107821524 107810569 107802856 107803285 107806182 107803237 107795691 107785559 107770717 107754886 107738006 107712209
2576A07712209l4034l6025m4525o0189o6471o4504n6982l7670j1730K7382P4756R1291
$$ 107712209 107678175 107642150 107597625 107537436 107470965 107406461 107349479 107311809 107300079 107327461 107402217 107493508
2600.5A07493508P9810P0847O5100N8472M8268L3104K1470K2733K6941J6475K646M483
$$ 107493508 107573318 107644165 107709265 107767737 107816005 107849109 107870579 107893312 107920253 107936728 107939374 107943857
2625A07943857J9765L0815K0755O318P343N865l767K15J3136J1600k158p546K03Q308
$$ 107943857 107963622 107994437 108015192 108021510 108028853 108034718 108030951 108031166 108044302 108055902 108053744 108046198 108046401 108054709
2653.5A08054709L601o855r119j1409j2374n984n174o354L767R191l027r621J0646
$$ 108054709 108058310 108051455 108042336 108030927 108018553 108012569 108007395 108001041 108004808 108013999 108010972 108001351 108011997
2680.1A08011997M2879M9341K5880K706l504J788L254j859m876n198p963r393j2494
$$ 108011997 108054876 108104217 108130097 108132803 108129299 108131087 108134341 108132482 108127606 108122408 108114445 108105052 108092558
2706.6A08092558j6510j1265n722j789L720o557k7323l1340j5688J7393M7755M9258
$$ 108092558 108076048 108064783 108059061 108057272 108060992 108054435 108027112 107995772 107980084 107997477 108045232 108094490
2731.1A08094490L1435K623k408L3962M5276J0037k5546l0327N543M9615N4205L1423
$$ 108094490 108125925 108128548 108126140 108160102 108205378 108215415 108189869 108159542 108165085 108214700 108268905 108300328
2755.5A08300328J8215R859P820J8478K1660J3256q82k6798m0245L814N6243M0734
$$ 108300328 108318543 108328402 108336222 108354700 108376360 108389616 108388734 108361936 108321691 108325505 108381748 108422482
2780A08422482k158j4138k7192n3620l7038N531L588l5619l4893J3793K5141o747m1783
$$ 108422482 108420324 108406186 108378994 108325374 108288336 108293867 108297455 108261836 108226943 108240736 108265877 108259130 108217347
2806.5A08217347p8273p0942k4819k2662n8984q4079j03187j25051j34253j50276j99210
$$ 108217347 108139074 108068132 108043313 108020651 107961667 107877588 107774401 107649350 107515097 107364821 107165611
2828.9A07165611k59662l11148l47745l49820k57385j07717m8042r2065j35481j27793
$$ 107165611 106905949 106594801 106247056 105897236 105639851 105532134 105484092 105392027 105256546 105128753
2849.3A05128753j27315j71590j99294j92893j63102j11806p9668p3838p2980j07360
$$ 105128753 105001438 104829848 104630554 104437661 104274559 104162753 104083085 104009247 103936267 103828907
2869.7A03828907j56462j09637j1897k5976j16467j66464j85824k05135k26486k54631
$$ 103828907 103672445 103562808 103550911 103524935 103408468 103242004 103056180 102851045 102624559 102369928
2890.1A02369928k98380l49546l69632l65186l55434l07560k54250k58559k99430l23176
$$ 102369928 102071548 101722002 101352370 100987184 100631750 100324190 100069940 99811381 99511951 99188775
2910.5I9188775k86824j96880j12414o4415l5185j3667k56r543j9580J8162M1061n72
$$ 99188775 98901951 98705071 98592657 98528242 98493057 98479390 98479134 98469591 98450011 98468173 98509234 98508662
2935I8508662n0032r7484j78241k46275k50685k35593k40165k44981j93501r4640j2189
$$ 98508662 98458630 98361146 98182905 97936630 97685945 97450352 97210187 96965206 96771705 96677065 96664876
2957.4I6664876O1655J43266K11197K45434K50053K45947K39098K41536K45315J99753
$$ 96664876 96726531 96869797 97080994 97326428 97576481 97822428 98061526 98303062 98548377 98748130
2977.8I8748130J42204J68503K47323K98852L33375L59672L39746K72346J82354J25039
$$ 98748130 98890334 99058837 99306160 99605012 99938387 100298059 100637805 100910151 101092505 101217544
2998.2A01217544J12188Q5831R7656J65367J56426P3207M5752P4554O1345k2054j35183
$$ 101217544 101329732 101415563 101513219 101678586 101835012 101908219 101953971 102028525 102089870 102067816 101932633
3020.7A01932633k28560j95992k5404J07575J44792J65057K05922J80256j8608j86253
$$ 101932633 101704073 101508081 101482677 101590252 101735044 101900101 102106023 102286279 102267671 102081418
3041.1A02081418j04094J21403K70987K53808K35594K73430K33746J80101J50204N7208
$$ 102081418 101977324 102098727 102369714 102623522 102859116 103132546 103366292 103546393 103696597 103753805
3061.5A03753805l5584l6967R6071K87926L45612K64597J49703R7036J79386K67792
$$ 103753805 103718221 103681254 103777325 104065251 104410863 104675460 104825163 104922199 105101585 105369377
3081.9A05369377K64824K49815K24065J85335J85215J71507J01471K5964K2804R2447
$$ 105369377 105634201 105884016 106108081 106293416 106478631 106650138 106751609 106777573 106800377 106892824
3102.2A06892824J04416J8060j6391N2619N2523m8137p0464N340Q5414J36769J28162
$$ 106892824 106997240 107015300 106998909 107051528 107104051 107055914 106985450 106990790 107076204 107212973 107341135
3124.7A07341135O5791K3604M0686P5364O2477N556J6141J25718J89840J44339O5243
$$ 107341135 107406926 107430530 107471216 107546580 107609057 107614613 107630754 107756472 107946312 108090651 108155894
3147.1A08155894j8465n6219L7896J62936J59680P2158J4817L922K707J096K980r5
$$ 108155894 108137429 108081210 108119106 108282042 108441722 108513880 108528697 108532619 108535326 108536422 108539402 108539307
3171.6A08539307n400j5557k4271p594J0181K515m804N341K9373M7326M7362M5633
$$ 108539307 108533907 108518350 108494079 108486485 108496666 108499181 108494377 108499718 108529091 108576417 108623779 108669412
3196.1A08669412M9329N0032L9280L3736M1246M4584L7396J5748P081J2791O962K7347
$$ 108669412 108718741 108768773 108808053 108841789 108883035 108927619 108965015 108980763 108987844 109000635 109007597 109034944
3220.5A09034944M5275O950l6239o7544j17469j15717q046P5423M9210q512m8828o9129
$$ 109034944 109080219 109087169 109050930 108983386 108865917 108750200 108742154 108817577 108866787 108858275 108809447 108740318
3245A08740318l1007L9316L4976l9447o5064m971L9554K0933j0491l3641p2884j18387
$$ 108740318 108709311 108748627 108783603 108744156 108679092 108674121 108713675 108734608 108724117 108690476 108617592 108499205
3269.5A08499205q0776Q464M8399N4621L2855j3495l8958l5476n6112j24133j40869
$$ 108499205 108418429 108426893 108475292 108529913 108562768 108549273 108510315 108474839 108418727 108294594 108153725
3291.9A08153725o9905q630J2207j4472j01924j66703j32632l8779K2877K0825j2242
$$ 108153725 108083820 108075190 108087397 108072925 107971001 107804298 107671666 107632887 107655764 107676589 107664347
3314.4A07664347m4537o6268q8680j34766j63973j00123k7693n4252j21045j78790
$$ 107664347 107619810 107553542 107464862 107330096 107166123 107066000 107038307 106984055 106863010 106684220
3334.8A06684220k14815j81806j23966j09434r6989j06263j63436j38474l2269K324
$$ 106684220 106469405 106287599 106163633 106054199 105957210 105850947 105687511 105549037 105516768 105519092
3355.2A05519092m0615p4040m8006k4414q7369j33776o0070M3190M0388n4300j27184
$$ 105519092 105478477 105404437 105356431 105332017 105244648 105110872 105050802 105093992 105134380 105080080 104952896
3377.6A04952896j46306j43695j51455j60897j74320k11417j61207q47Q6117M8697
$$ 104952896 104806590 104662895 104511440 104350543 104176223 103964806 103803599 103802752 103888869 103937566
3398A03937566K9075J40894K62582K36523J71769J77646K17449K76304L00359K32554
$$ 103937566 103966641 104107535 104370117 104606640 104778409 104956055 105173504 105449808 105750167 105982721
3418.4A05982721K06244K77781K77305J72043J09422J43611J36471O7973J28746K73824
$$ 105982721 106188965 106466746 106744051 106916094 107025516 107169127 107305598 107373571 107502317 107776141
3438.8A07776141K78783J56808L9828L2615J33372J60897R6440M9305j3876p0751N961
$$ 107776141 108054924 108211732 108251560 108284175 108417547 108578444 108674884 108724189 108710313 108639562 108645523
3461.2A08645523N3763j13690j96648O0869L50344L11994Q6999j01697j20556R8300
$$ 108645523 108699286 108585596 108388948 108449817 108800161 109112155 109199154 109097457 108976901 109075201
3481.6A09075201J73878p117k7728P8583K0790j19126j51133p3004o3646j06692M0162
$$ 109075201 109249079 109241962 109214234 109292817 109313607 109194481 109043348 108970344 108906698 108800006 108840168
3504A08840168J63209M9376m6789m9317k3544K0313J2899q9658k03514j45959K1350
$$ 108840168 109003377 109052753 109005964 108956647 108933103 108953416 108966315 108876657 108673143 108527184 108548534
3526.5A08548534R7454J00147M2236p3910p7903J5259n8866k38204k13563O0594J94502
$$ 108548534 108645988 108746135 108788371 108714461 108636558 108651817 108592951 108354747 108141184 108201778 108396280
3548.9A08396280O3169J9669P1371R119q9716j27244j84465k75290r7036K75969K92325
$$ 108396280 108459449 108479118 108550489 108559608 108469892 108342648 108158183 107882893 107785857 108061826 108354151
3571.3A08354151R5618j6963m3941n8758j00780k40445l58748r7680K49600J27423
$$ 108354151 108449769 108432806 108388865 108330107 108229327 107988882 107630134 107532454 107782054 107909477
3591.7A07909477n6434m5776l3272j1623Q4961L9208j47927j74594m9794m9412q4066
$$ 107909477 107853043 107807267 107773995 107762372 107847333 107886541 107738614 107564020 107514226 107464814 107380748
3614.2A07380748j01257j08671Q1885K05958K813l19242l28922J34587K52890J14382
$$ 107380748 107279491 107170820 107252705 107458663 107461476 107142234 106813312 106947899 107200789 107315171
3634.6A07315171N5897L58o5768j73581m06086o65617m96531K40934M17435P4268p2396
$$ 107315171 107371068 107371426 107305658 107132077 106725991 106060374 105563843 105804777 106222212 106296480 106224084
3657A06224084J1647J9538l3033j74761m00674m48644k22600k02655j34624L03436
$$ 106224084 106235731 106255269 106222236 106047475 105646801 105198157 104975557 104772902 104638278 104941714
3677.4A04941714L81839J84655j4531k49362m43852j98961L26288L78597J73795K7824
$$ 104941714 105323553 105508208 105493677 105244315 104800463 104601502 104927790 105306387 105480182 105508006
3697.8A05508006n1284L922J32072L8242j91128k26462J48618M27652K51245P224j04666
$$ 105508006 105456722 105460644 105592716 105630958 105439830 105213368 105361986 105789638 106040883 106048107 105943441
3720.2A05943441p5376M3917J75881J66870o1369l36731k65598K53975M78399K25246
$$ 105943441 105868065 105911982 106087863 106254733 106193364 105856633 105591035 105845010 106323409 106548655
3740.6A06548655m3082j7941O7317r0289K5284M30072L78728J11508O3861J72424R6428
$$ 106548655 106505573 106487632 106554949 106464660 106489944 106920016 107298744 107410252 107474113 107646537 107742965
3763.1A07742965l6156l5739K0456J36269J76715L6323j28543r4438O3324M8137K3532
$$ 107742965 107706809 107671070 107691526 107827795 108004510 108040833 107912290 107817852 107881176 107929313 107952845
3785.5A07952845Q3470O0034j9431j24478k00474j67430j45781o282J81877J38963
$$ 107952845 108036315 108096349 108076918 107952440 107751966 107584536 107438755 107432473 107614350 107753313
3805.9A07753313J93548K28846J4090k29060k51389j42479o8998K25246L23081J46532
$$ 107753313 107946861 108175707 108189797 107960737 107709348 107566869 107497871 107723117 108046198 108192730
3826.3A08192730P4768P653j09195k10166k44713n2738K27272L14832K86495J48583
$$ 108192730 108267498 108275151 108165956 107955790 107711077 107658339 107885611 108200443 108486938 108635521
3846.7A08635521j07825l92640l70883K35760M20427J68455p2634j63305j0693L7658
$$ 108635521 108527696 108135056 107764173 107999933 108420360 108588815 108516181 108352876 108342183 108379841
3867.1A08379841q8871o056J71841K18188O5995j45853p7462L6955P1907J48713L4368
$$ 108379841 108290970 108284914 108456755 108674943 108740938 108595085 108517623 108554578 108626485 108775198 108809566
3889.5A08809566k2554J21522O2811j66845k68507j49989J08659L49450L38173J60635
$$ 108809566 108787012 108908534 108971345 108804500 108535993 108386004 108494663 108844113 109182286 109342921
3909.9A09342921J1647j12713j71733m6277R1195M8757Q607O1083K0253o1190J1397
$$ 109342921 109354568 109241855 109070122 109023845 109115040 109163797 109172404 109233487 109253740 109192550 109203947
3932.3A09203947J21688J00887J5807o2322n7900J8310R609n186O2096P9525L8647
$$ 109203947 109325635 109426522 109442329 109380007 109322107 109340417 109350026 109344840 109406936 109486461 109525108
3954.8A09525108J1218n162p844K7883N4658J7738l8338m8017m721L4118K4640K158
$$ 109525108 109536326 109531164 109523320 109551203 109605861 109623599 109585261 109537244 109532523 109566641 109591281 109593439
3979.3A09593439j1301k4903j7011m613j0109J704K0278J4472J669
$$ 109593439 109582138 109557235 109540224 109535611 109525502 109527206 109547484 109561956 109563625
3997.6A09563625
$$ 109563625
##END=$$ End of the data block
