##TITLE=Isocianate ISO 1 $$ Begin of the data block
##JCAMP-DX=5.00 $$ ACD/SpecManager v 10.08
##SPECTROMETER/DATA SYSTEM=Alpha
##DATE=25 Nov 2015 09:11:28
##DATA TYPE=INFRARED SPECTRUM
##DATA CLASS=XYDATA
##ORIGIN=
##OWNER=
##NPOINTS=1667
##FIRSTX=599.64648438
##LASTX=3997.64306641
##MAXX=3997.64306641
##MINX=599.64648438
##MAXY=1.12138736
##MINY=0.33259758
##XFACTOR=1.0000000000
##YFACTOR=0.000000010000000
##FIRSTY=0.95643538
##DELTAX=2.03961372
##XUNITS=1/CM
##YUNITS=ARBITRARY UNITS
##XYDATA=(X++(Y..Y))
599.6I5643538o9839j56015k23899k66134l00789l11345l05551k93613k40183j46109
620I3330061M304K39509M84610O64276P49939O89876M59970J69372l3003l4451K24143
642.5I6948606N78648P20274O32835N11664M06915L26418K66314K02048J49739J01232
662.9A00844693k5177j97780o1691J93429R7418o4027j60945k00116k15984k35849
683.3I9973971k17879j70189j14578k5827O8313J04177J06966J21117J25855J06681
703.7A00078607Q9466J13368J70899J83189J02067k0862j23560j75286j66166j27005
724.1A00124717r6905q3387p0906n8848n7208p0435j15687k28119m06283o06149p86931
746.5I7543859q82458q26776n83464j39320L68088O74719O62071M48411K57534K28334
$$ y = [95643538, 95573699, 95417684, 95193785, 94927651, 94626862, 94315517, 94009966, 93716353, 93476170, 93330061, 93334365, 93573874, 94058484, 94722760, 95472699, 96162575, 96622545, 96791917, 96758914, 96724463, 96948606, 97527254, 98247528, 98880363, 99392027, 99798942, 100125360, 100391674, 100593722, 100743461, 100844693, 100819516, 100621736, 100560045, 100753474, 100850892, 100786865, 100625920, 100425804, 100209820, 99973971, 99756092, 99585903, 99471325, 99445498, 99513811, 99617988, 99724954, 99846071, 99971926, 100078607, 100168073, 100281441, 100452340, 100635529, 100737596, 100716734, 100593174, 100417888, 100251722, 100124717, 100027812, 99944425, 99873519, 99814671, 99757463, 99687028, 99571341, 99343222, 98936939, 98330790, 97543859, 96661401, 95834625, 95251161, 95111841, 95479929, 96154648, 96816719, 97265130, 97522664, 97750998]
766.9I7750998L26544M17912L73685J66196r0754k69086l57455l87537l56889k97308
787.3I7276306l34430o77651j542085k938676m288971m300267k205086N83148J658225
805.6H3230513N68235j056468j800478j477182n78612L84063J114851J506782J619845
824H3511549J619208J632279J675403J696569J623428J409608J073903P15190M13984
842.4I5371121J27894k21491o51145j075703j252872r82248m06295J04701L22342L46291
862.8I1682595M52375P84857J230746J523215J491832J215530Q70460N85598M15432
881.1A00252640L23367K72644K53391K34926J96385J34445N0580m1819j29485k13849
901.5A01333225k93732l71087m60696n85830p63255q63964o44922q7893M76563P13986
$$ y = [97750998, 98077542, 98495454, 98869139, 99035335, 98944581, 98675495, 98318040, 97930503, 97573614, 97276306, 96941876, 96264225, 94722140, 91783464, 87494493, 83194226, 80989140, 81572288, 83230513, 83798748, 82742280, 80941802, 79464620, 78886008, 79270071, 80384922, 81891704, 83511549, 85130757, 86763036, 88438439, 90135008, 91758436, 93168044, 94241947, 94957137, 95371121, 95499015, 95277524, 94626379, 93550676, 92297804, 91315556, 90909261, 91013962, 91336304, 91682595, 92134970, 92919827, 94150573, 95673788, 97165620, 98381150, 99251610, 99837208, 100252640, 100576007, 100848651, 101102042, 101336968, 101533353, 101667798, 101718378, 101676559, 101547074, 101333225, 101039493, 100668406, 100207710, 99621880, 98858625, 97994661, 97349739, 97261846, 97738409, 98452395]
921.9I8452395O23691M16303K42275J26588M0442l9005j17791j71494j79035j53136
942.3I9241233j09136n6386j2052M768n585k5338m1008k6703L3838J11198J86569K64817
966.8I9566215L28148L52007L51965L50344L37530L03566K44868J58203N5682l8576
987.2A02009952j12569j62590j91355k03979k01618j87755j83618k17473l02423m65118
1007.6I9781454p22164j179421k309096l662348k677965J017445L427404K660400R83352
1025.9I7319061N7995k69985l99232m77308n25362n08409m27878l48497l12096l15427
1046.3I3792862l40611l76099m15689m68481n50908o70683q10581r14914r20874q34828
1066.7H7489194p54118p63101q20887q15612o79415m27866j09881K02912M14019M88401
$$ y = [98452395, 99076086, 99492389, 99734664, 99861252, 99901694, 99862689, 99744898, 99573404, 99394369, 99241233, 99132097, 99075711, 99063659, 99068427, 99062842, 99037504, 98996496, 98969793, 99003631, 99114829, 99301398, 99566215, 99894363, 100246370, 100598335, 100948679, 101286209, 101589775, 101834643, 101992846, 102048528, 102009952, 101897383, 101734793, 101543438, 101339459, 101137841, 100950086, 100766468, 100548995, 100246572, 99781454, 99059290, 97879869, 95570773, 91908425, 89230460, 90247905, 93675309, 96335709, 97319061, 97377056, 97107071, 96707839, 96230531, 95705169, 95196760, 94768882, 94420385, 94108289, 93792862, 93452251, 93076152, 92660463, 92191982, 91641074, 90970391, 90159810, 89244896, 88324022, 87489194, 86735076, 85971975, 85151088, 84335476, 83656061, 83228195, 83118314, 83321226, 83735245, 84223646]
1087.1H4223646M20511J91742k06339p46203j305419j714957j893353j871646j675898
1105.5G5422084j209837m08971M27872Q08084N96255Q0055m19271p65073r67205j071143
1125.9G2492850j091367j017273q54551o47289m21625j56570J60492N07938Q50767
1144.2F9823372J138342J324159J368743J246387R76956O16335K37930q5431k99877
1162.6G6346916l97390l98332l18271j82003m3326M3207P8887J44827L13521N31536
1183G6119572O93762P63685P71230P43020O86759N97828M23408J28036j89042l44616
1203.4H0393642k47967j2243P8964j49649n36859p91115p73060n07027j03217L10200
1223.8G7661669O31249P91478P84338O48695M51309K76839J85359J92040K62570L30681
$$ y = [84223646, 84644157, 84835899, 84629560, 83883357, 82577938, 80862981, 78969628, 77097982, 75422084, 74212247, 73803276, 74231148, 75039232, 75635487, 75715542, 75296271, 74531198, 73563993, 72492850, 71401483, 70384210, 69529659, 68882370, 68460745, 68304175, 68464667, 68972605, 69823372, 70961714, 72285873, 73654616, 74901003, 75877959, 76494294, 76732224, 76646793, 76346916, 75949526, 75551194, 75232923, 75050920, 75007594, 75050801, 75129688, 75274515, 75588036, 76119572, 76813334, 77577019, 78348249, 79091269, 79778028, 80375856, 80799264, 80927300, 80738258, 80393642, 80145675, 80133432, 80212396, 80062747, 79525888, 78734773, 77961713, 77454686, 77351469, 77661669, 78292918, 79084396, 79868734, 80517429, 80968738, 81245577, 81430936, 81622976, 81885546, 82216227]
1244.2H2216227L39258K78944J92368J34086J41418K15542L12150L98421M59254M78566
1264.6H5166234M65494M26781L71766L27021K86770K05296N7704j23298k64925k75880
1285H6642963j00649J76478L63368L87805M27801O48266Q28743O53088K26050j26552
1305.4I0127361k33215j11056J11556L34526N39010P82717J088011J287049J249546
1323.7I5175505J014429O56128K74253l8576k58452l90512m25005l15481j81061k09975
1344.1I5301253k92468k52355q5210J05780K34747K71010J75780m6628k41143k89881
1364.5I4880885l98505o03717o83642o80101n40882k04706L1715J94794L82459N02462
1384.9I2880762N87892O33758M72051K67142L21645N80120P55465O42383J68365m75764
$$ y = [82216227, 82555485, 82834429, 83026797, 83160883, 83302301, 83517843, 83829993, 84228414, 84687668, 85166234, 85631728, 86058509, 86430275, 86757296, 87044066, 87249362, 87307066, 87183768, 86918843, 86642963, 86542314, 86718792, 87082160, 87469965, 87897766, 88546032, 89374775, 90027863, 90253913, 90127361, 89894146, 89783090, 89894646, 90229172, 90768182, 91550899, 92638910, 93925959, 95175505, 96189934, 96846062, 97120315, 97081739, 96823287, 96432775, 96007770, 95692289, 95511228, 95301253, 95008785, 94756430, 94671220, 94777000, 95011747, 95282757, 95458537, 95411909, 95170766, 94880885, 94482380, 93878663, 93195021, 92514920, 91974038, 91769332, 91801047, 91995841, 92378300, 92880762, 93468654, 94102412, 94574463, 94841605, 95163250, 95743370, 96498835, 97141218, 97309583, 96833819]
1405.3I6833819j142287j885158k379996j917445o51723Q44258K214706K210790J428699
1423.7I5555663P37411o3855q50838j203608j112247r67991m36807J42324K57373K23177
1444.1I2280602J17118n7745j96928k74742l23581l00360K76619Q78590R23544J112080
1464.5I4435197J452071J279813Q35091O30646P07901O60592M80414K66146J10615
1482.8A00858486o1560k78306l55291j77175j53935n74422j076984j214779j227730
1501.2I5738304j488972k630419m436123l183722j969827k131992k706373l272736
1517.5G3918140l235287l278481k071727l76773P04730J529080K088665K939028L110343
1535.8G5327718K754915L526318M178190L485012K872658K222282J780778J393485
$$ y = [96833819, 95691532, 93806374, 91426378, 89508933, 88857210, 89701468, 91916174, 94126964, 95555663, 96293074, 96229219, 95378381, 94174773, 93062526, 92094535, 91657728, 91800052, 92057425, 92280602, 92397720, 92339975, 92143047, 91868305, 91544724, 91244364, 91520983, 92399573, 93323117, 94435197, 95887268, 97167081, 98002172, 98632818, 99340719, 100001311, 100481725, 100747871, 100858486, 100796926, 100518620, 100163329, 99986154, 99832219, 99257797, 98180813, 96966034, 95738304, 94249332, 91618913, 87182790, 83999068, 82029241, 79897249, 77190876, 73918140, 70682853, 67404372, 65332645, 64955872, 65660602, 67189682, 69278347, 72217375, 75327718, 78082633, 81608951, 85787141, 89272153, 92144811, 94367093, 96147871, 97541356]
1552.2I7541356R39804N02384N16027J302326J023448M66251K6679p22909j616704
1570.5I9978662k004725k282894j667142P48694K265859K371985J505911L83544m52173
1588.9A00847721j015752j356113j419449j194316r74763j082235j500124j880020
1605.2I0424949j596499k02244J631254K553397K830863K984631K122999J194334Q42142
1623.5A02785826N71930K42829P5055m6206k54941k38693K40744L98814K43211J9979
1643.9A04038548q8369J78229J91582q3125K35677N62286K83015O819o9464K7431p4018
1666.4A05208611l17347k51841p4625j36876j73354k24471m52912p51460p06625k41899
1686.8A01877201k42019m01199n17964q68917j048934j069826j266843j177836j556599
$$ y = [97541356, 98481160, 98983544, 99499571, 100801897, 101825345, 102291596, 102318275, 101595366, 99978662, 97973937, 95691043, 94023901, 94772595, 97038454, 99410439, 100916350, 101299894, 100847721, 99831969, 98475856, 97056407, 95862091, 94887328, 93805093, 92304969, 90424949, 88828450, 88626206, 90257460, 92810857, 95641720, 98626351, 100749350, 101943684, 102785826, 103357756, 103600585, 103675640, 103629434, 103374493, 103135800, 103376544, 103775358, 104018569, 104038548, 103950179, 104128408, 104319990, 104236865, 104472542, 105034828, 105317843, 105324662, 105255198, 105282629, 105208611, 104891264, 104639423, 104564798, 104427922, 104254568, 104030097, 103577185, 102825725, 102119100, 101877201, 101635182, 101233983, 100716019, 99847102, 98798168, 97728342, 96461499, 95283663, 93727064]
1705.1I3727064k073485k117383k268708k588928l217279m216248l828180k967382
1721.5G0449471l380447l745282l403962k916401k257377j861036n51027R62740J836312
1739.8E5132991K807057L767443M555982N254722O097638O131363M845721L858620
1756.1I2451537L188747K318513J827526J369173Q56959N10562K73955K21598L07476
1774.5A03326046K68162K18439L28266M41015M46093L64626J92845M3630J74117L25752
1794.9A06128991K40051J37473J62613K49553K11012J04439M9413J12485J73188J34527
1815.3A07703745P6425N9438J6546l7694j3721j561M0805J75238J68884N6159L1281
1837.7A08275545P343q9550q1873Q6975J43421R1183M6349J1026r727k3556j5092k0611
$$ y = [93727064, 91653579, 89536196, 87267488, 84678560, 81461281, 77245033, 73416853, 70449471, 67069024, 63323742, 59919780, 57003379, 54746002, 52884966, 52333939, 53296679, 55132991, 57940048, 61707491, 66263473, 71518195, 77615833, 83747196, 88592917, 92451537, 95640284, 97958797, 99786323, 101155496, 102012455, 102523017, 102796972, 103018570, 103326046, 103594208, 103812647, 104140913, 104581928, 105028021, 105392647, 105585492, 105629122, 105803239, 106128991, 106369042, 106506515, 106669128, 106918681, 107129693, 107234132, 107283545, 107396030, 107569218, 107703745, 107780170, 107839608, 107856154, 107818460, 107804739, 107803178, 107843983, 108019221, 108188105, 108244264, 108275545, 108282888, 108193338, 108111465, 108198440, 108341861, 108433044, 108479393, 108490419, 108480692, 108457136, 108442044, 108421433]
1862.2A08421433q8775j99807j66249M9782J04928N388n3251m9627m5275n3764o9391
1884.6A07855392j06788j40774r9016p8654j11842r2304o9332o3467l3081P260K7359
1907.1A07094753P8976J62959J73581J07956R1099J39869J37114J47677J80173J43075
1927.5A08457232Q6998O4767O3693O4874M4644j0943l2747L8445R3388P1967M1079
1949.9A08983397K0957Q667L517R41k932q416k4844k3591L0029N7912K7120P915J4282
1976.4A09094954J4758R870P141M935n639l1209l4952J6928N2977K8562J0205J0824
2000.9A09179354P307L553K432L910P236Q70k1374k1232M411Q321l827r143j2124k0051
2029.4A09129643l1352l7634l7432m3988o1178o7186o1870o7258q2278r8026j15562
$$ y = [108421433, 108332658, 108132851, 107966602, 108016384, 108121312, 108126700, 108073449, 108023822, 107978547, 107924783, 107855392, 107748604, 107607830, 107508814, 107430160, 107318318, 107226014, 107156682, 107093215, 107060134, 107067394, 107094753, 107173729, 107336688, 107510269, 107618225, 107709324, 107849193, 107986307, 108133984, 108314157, 108457232, 108544230, 108608997, 108672690, 108737564, 108782208, 108771265, 108738518, 108776963, 108870351, 108942318, 108983397, 109004354, 109013021, 109016538, 109017479, 109014547, 109006131, 108981287, 108957696, 108987725, 109045637, 109072757, 109080672, 109094954, 109109712, 109119582, 109126723, 109131658, 109126019, 109094810, 109059858, 109076786, 109129763, 109158325, 109168530, 109179354, 109186661, 109190214, 109192646, 109196556, 109203792, 109204662, 109183288, 109162056, 109166467, 109174788, 109170961, 109161818, 109149694, 109129643, 109098291, 109060657, 109023225, 108979237, 108918059, 108850873, 108789003, 108721745, 108639467, 108541441, 108425879]
2051.9A08425879j27196j29008j43027j69194j84453j79887j51360j15597r3412o5518
2072.3A07067227k4068P200L0482N8186P4554O7460N5397N6755O5410O0606M6969L6311
2096.8A07602489K5320J8311O234j7833m3929p1871j01602j26505j52493j80900k13218
2119.2A06744003k60710l18885l74806m22180m62341n08762n64468o00767o11972o11377
2139.6A02007735n93102n56708n04660m41116l81214l36057l06838l00426l24708l70741
2160I7892165m14717m44722m55958m42552m14205l89493l76153l69560l77000m17119
2180.4I3790686m82786n49912o16914o81150p40236p94399q28600q40819q45241q48508
2200.8H6562121q50332q58849q74150q89516r08923r38427r82494j051986j158297
$$ y = [108425879, 108298683, 108169675, 108026648, 107857454, 107673001, 107493114, 107341754, 107226157, 107132745, 107067227, 107043159, 107050359, 107080841, 107139027, 107213581, 107281041, 107336438, 107393193, 107458603, 107519209, 107566178, 107602489, 107627809, 107646120, 107652354, 107634521, 107590592, 107518721, 107417119, 107290614, 107138121, 106957221, 106744003, 106483293, 106164408, 105789602, 105367422, 104905081, 104396319, 103831851, 103231084, 102619112, 102007735, 101414633, 100857925, 100353265, 99912149, 99530935, 99194878, 98888040, 98587614, 98262906, 97892165, 97477448, 97032726, 96576768, 96134216, 95720011, 95330518, 94954365, 94584805, 94207805, 93790686, 93307900, 92757988, 92141074, 91459924, 90719688, 89925289, 89096689, 88255870, 87410629, 86562121, 85711789, 84852940, 83978790, 83089274, 82180351, 81241924, 80259430, 79207444, 78049147]
2219.1G8049147j309776j511496j763469k053118k357739k658314k924275l120697
2235.4F0350263l215504l191459l046494k786085k443144k064118j700020j399183
2251.8D0504256j179952j027280r34171q80787q23009p36448o16861m75153l28398
2270.1C3502197j89209n3230Q7911K42302M17313O09982Q11791J021666J244017J473251
2290.5C9167991J699713J913023K113250K293903K452403K582720K654028K649540
2306.8E7526571K582228K462983K296221K101636J882052J647133J430148J266176
2323.1G3195148J154327J038587R17375Q65644Q68506Q53121Q28445P91853P51913
2341.5H1264919P44194Q28427R12386Q14015O24883N16802N38737O34259P61824Q96633
$$ y = [78049147, 76739371, 75227875, 73464406, 71411288, 69053549, 66395235, 63470960, 60350263, 57134759, 53943300, 50896806, 48110721, 45667577, 43603459, 41903439, 40504256, 39324304, 38297024, 37362853, 36482066, 35659057, 34922609, 34305748, 33830595, 33502197, 33312988, 33259758, 33347669, 33589971, 34007284, 34617266, 35429057, 36450723, 37694740, 39167991, 40867704, 42780727, 44893977, 47187880, 49640283, 52223003, 54877031, 57526571, 60108799, 62571782, 64868003, 66969639, 68851691, 70498824, 71928972, 73195148, 74349475, 75388062, 76305437, 77171081, 78039587, 78892708, 79721153, 80513006, 81264919, 82009113, 82837540, 83749926, 84563941, 85188824, 85705626, 86244363, 86878622, 87640446, 88537079]
2361.9H8537079R93097J038271J086009J132613J134694J112461J101172J085496J042205
2380.2I8263097R70304Q79896P92503P19166O55210N97894N45609M93979M43209L99100
2400.6A04759967L59440L30019L12638K92135K71916K60902K41148K11704J90103J73652
2421A07403624J64414J59192J48308J37222J35576J34743J28281J24991J17588J02949
2441.4A08756888R2208R1958R9779R9384Q9395Q4699Q0812P5900P2944O7163O5899
2463.9A09677029O4194N3716M4977M4847M7099M5848M2200M0102M1139L6419K4176
2486.3A10161746J7154K1159K6024K0432J0968J2493K3245K7395K3532J7821J3102
2508.7A10375071P879N269Q738O092J431J0192K2066J9526J1408J1802J3542Q118O783
$$ y = [88537079, 89530176, 90568447, 91654456, 92787069, 93921763, 95034224, 96135396, 97220892, 98263097, 99233401, 100113297, 100905800, 101624966, 102280176, 102878070, 103423679, 103917658, 104360867, 104759967, 105119407, 105449426, 105762064, 106054199, 106326115, 106587017, 106828165, 107039869, 107229972, 107403624, 107568038, 107727230, 107875538, 108012760, 108148336, 108283079, 108411360, 108536351, 108653939, 108756888, 108849096, 108941054, 109040833, 109140217, 109229612, 109314311, 109395123, 109471023, 109543967, 109611130, 109677029, 109741223, 109794939, 109839916, 109884763, 109931862, 109977710, 110019910, 110060012, 110101151, 110137570, 110161746, 110178900, 110200059, 110226083, 110246515, 110257483, 110269976, 110293221, 110320616, 110344148, 110361969, 110375071, 110382950, 110388219, 110396957, 110403049, 110404480, 110414672, 110436738, 110456264, 110467672, 110479474, 110493016, 110501134, 110507917]
2535.3A10507917J7691J9145K587p236m149M53R096J0383k312q953m184K503M244L350
2563.8A10550535K074n090j3078j6319k1553k9028k8384k4652l1543m3785n0187n3752
2588.3A10235238n2226l6287q619K5988N5838O6197O4671N8317M6479L7432L0661J9300
2612.8A10542989J1754J6475J9407P272o521p439o67N054J538j0240j2994q571n353
2639.3A10552704M89Q94j132k325j1396j7023j0765m339n055j2898k1303j6892n853
2665.8A10445106m816j0633j0181r632j9395k3663R65L5572L4285N209j1027j2123
2690.3A10419667j2827j5950k0683j9682j7559k8587l8528l9828l5977k4343j9204
2712.7A10146499k1649j7202k3305m0400m0698l0410j1075J2350J7166N996j5139j7357
$$ y = [110507917, 110525608, 110544753, 110547340, 110540104, 110535955, 110536408, 110545504, 110555887, 110553575, 110544622, 110540438, 110542941, 110547185, 110550535, 110552609, 110547519, 110534441, 110518122, 110496569, 110467541, 110439157, 110414505, 110382962, 110339177, 110288990, 110235238, 110183012, 110146725, 110138106, 110164094, 110219932, 110286129, 110350800, 110409117, 110455596, 110493028, 110523689, 110542989, 110554743, 110571218, 110590625, 110597897, 110591376, 110583937, 110583270, 110588324, 110589862, 110579622, 110566628, 110558057, 110552704, 110553193, 110554087, 110552955, 110550630, 110539234, 110522211, 110511446, 110507107, 110502052, 110489154, 110467851, 110450959, 110445106, 110440290, 110429657, 110419476, 110409844, 110390449, 110366786, 110367751, 110403323, 110437608, 110442817, 110431790, 110419667, 110406840, 110390890, 110370207, 110350525, 110332966, 110304379, 110265851, 110226023, 110190046, 110165703, 110146499, 110124850, 110107648, 110084343, 110043943, 110003245, 109972835, 109961760, 109974110, 109991276, 109997272, 109982133, 109964776]
2737.2A09964776J3757K1040j1194l8325m0543j5593J4210J7667K336m959J07P046
2761.6A09930325J1754R501m30j0347l0923m6289j1372K9432J0693k6345l4702n3954
2786.1A09777343q0526n6874j9694k7692n6028m2725j156R29k7644o2394j02437j05762
2810.6A09195340q1396r5058j39320j73366j96898k14314k10488k00939k18404k52473
2831A07412684k81048l04150l25811l05891k53725k72489l68416m50671m92990n39744
2851.4A03817749o04713o54662o72555o40785n71084n13542m56107l71509k90668j98299
2871.8I8843825l1877J54978K39981K23356J81967J32781O5178j5491r4706j66941
2892.2I9533051k37280k67047k47520k38013k40338k29925k24757k39152k60722k55621
$$ y = [109964776, 109978533, 109999573, 109988379, 109950054, 109909511, 109893918, 109908128, 109925795, 109928131, 109923172, 109923279, 109930325, 109942079, 109951580, 109951150, 109940803, 109909880, 109863591, 109852219, 109881651, 109892344, 109865999, 109831297, 109777343, 109696817, 109639943, 109620249, 109592557, 109536529, 109493804, 109492648, 109493577, 109465933, 109403539, 109301102, 109195340, 109113944, 109018886, 108879566, 108706200, 108509302, 108294988, 108084500, 107883561, 107665157, 107412684, 107131636, 106827486, 106501675, 106195784, 105942059, 105669570, 105301154, 104850483, 104357493, 103817749, 103213036, 102558374, 101885819, 101245034, 100673950, 100160408, 99704301, 99332792, 99042124, 98843825, 98811948, 98966926, 99206907, 99430263, 99612230, 99745011, 99810189, 99794698, 99699992, 99533051, 99295771, 99028724, 98781204, 98543191, 98302853, 98072928, 97848171, 97609019, 97348297, 97092676]
2912.6I7092676k02894j41072j15121j21039j44660j66500j84458j86980j39243q2606
2933I5608103o7925p2330r1005j47807k10184k35892k23469j91301j50067o1846O3014
2955.4I4219291J61064K23857K64990K95443L33941L96400M78405N57983O32209O83778
2975.8I8247361O61755N96273N92327O46436O62494O20162N52666M91369M51946L90006
2996.2A03912795L19719K75910K28274K13003K31588J95288J11759O6638O7389N1487
3016.6A05673850r513r8265j74617j55390l3307O4147R5916J10852J33217J11222k8741
3039A05689371j35374n8318J09160K14708K05624J91689K01702J55187J16896J11246
3059.4A06801891N7018j2624j7834P9608K15066K57086K06447J31834J03342J72830
$$ y = [97092676, 96889782, 96748710, 96633589, 96512550, 96367890, 96201390, 96016932, 95829952, 95690709, 95608103, 95540178, 95467848, 95376843, 95229036, 95018852, 94782960, 94559491, 94368190, 94218123, 94156277, 94219291, 94380355, 94604212, 94869202, 95164645, 95498586, 95894986, 96373391, 96931374, 97563583, 98247361, 98909116, 99505389, 100097716, 100744152, 101406646, 102026808, 102579474, 103070843, 103522789, 103912795, 104232514, 104508424, 104736698, 104949701, 105181289, 105376577, 105488336, 105554974, 105622363, 105673850, 105664337, 105566072, 105391455, 105236065, 105202758, 105266905, 105362821, 105473673, 105606890, 105718112, 105689371, 105553997, 105495679, 105604839, 105819547, 106025171, 106216860, 106418562, 106573749, 106690645, 106801891, 106858909, 106846285, 106828451, 106908059, 107123125, 107380211, 107586658, 107718492, 107821834, 107994664]
3079.8A07994664K43544K40314K17235J82009J54436J69611J53661P5852Q250J3649
3100.2A09453225P6378Q4853N126k9397L0660K9421o3574p5460L589O7544J07348J08873
3124.7A09798586N6160J8728M7564R0480P9310K4319K5916J09935J56462J17635N6446
3147.1A10581541k515l3820L0077J28173J25802M8923o08k098M149K134J657p522k1601
3173.6A10854292k6679l4464l2627j5164j3637j4484P27J5509K1804K6059L3760M9293
3198.1A10864389N2464K8694J6451K9027M1664K9790o783k0587j4401j7059O271K8550
3222.6A11038470Q23l5668p0583j24526j26863k7692M7946J8370m3190r5546j27625
3245A10453916r7013k1660k420n8437q3410k6596K0158m41m5418p8857j08743j35672
$$ y = [107994664, 108238208, 108478522, 108695757, 108877766, 109032202, 109201813, 109355474, 109431326, 109439576, 109453225, 109529603, 109614456, 109619582, 109590185, 109620845, 109650266, 109586692, 109511232, 109514821, 109582365, 109689713, 109798586, 109854746, 109873474, 109921038, 110011518, 110090828, 110115147, 110141063, 110250998, 110407460, 110525095, 110581541, 110579026, 110545206, 110575283, 110703456, 110829258, 110878181, 110877573, 110875475, 110879624, 110881758, 110883415, 110875893, 110854292, 110827613, 110793149, 110760522, 110745358, 110731721, 110717237, 110717964, 110733473, 110755277, 110781336, 110815096, 110864389, 110916853, 110945547, 110961998, 110991025, 111032689, 111062479, 111055696, 111035109, 111020708, 111003649, 111009920, 111038470, 111039293, 111003625, 110933042, 110808516, 110681653, 110653961, 110701907, 110720277, 110677087, 110581541, 110453916, 110356903, 110335243, 110332823, 110274386, 110190976, 110164380, 110184538, 110184097, 110138679, 110059822, 109951079, 109815407]
3269.5A09815407r5415j6594J9324J5151k8276p6080q3708p2003r3424j56665j69861
3291.9A09057856j05310m2498o926l4452j25110j68550j14977k6047J5759J0455m292
3314.4A08455908k5057m9019p2170j06740j28960p1132M029j3387p9120j33776j59621
3336.8A07620955j15622m7350k8693k1255k7907p3135n0402N0199R1732O1858M0054
3359.2A07500434N2774N2440r274m3571L0291J24061J14333J9193n2094p4459p7033
3381.7A07637095q6784j00005j17540j62733j27816J8370R0611L5608L898J09351K37048
3404.1A07537103K26438J54829J39618J74474K27392K34687J74368J68216K33340K14506
3424.5A09484971J03414N0020R5653R8253M2426R4402K11299K14779J19007L1852L0935
$$ y = [109815407, 109719992, 109703398, 109722722, 109737873, 109709597, 109633517, 109549809, 109477806, 109384382, 109227717, 109057856, 108952546, 108910048, 108903122, 108868670, 108743560, 108575010, 108460033, 108433986, 108449745, 108460200, 108455908, 108430851, 108381832, 108309662, 108202922, 108073962, 108002830, 108006859, 107993472, 107914352, 107780576, 107620955, 107505333, 107457983, 107429290, 107408035, 107380128, 107306993, 107256591, 107306790, 107398522, 107460380, 107500434, 107553208, 107605648, 107596374, 107552803, 107583094, 107707155, 107821488, 107840681, 107788587, 107714128, 107637095, 107550311, 107450306, 107332766, 107170033, 107042217, 107060587, 107151198, 107186806, 107190704, 107300055, 107537103, 107763541, 107918370, 108057988, 108232462, 108459854, 108694541, 108868909, 109037125, 109270465, 109484971, 109588385, 109638405, 109734058, 109832311, 109874737, 109969139, 110180438, 110395217, 110514224, 110546076, 110577011]
3446.9A10577011J05989J34707R8395O0403K504m4048K5058P0631o9880j48690M2927
3469.4A10855007K56956K26426N9831p6032q0883P2908J07360l1221l9649M1533M244
3491.8A11396480q8227j08779o7496o5005p3707K7144R8848L8720k1744m5538j8227
3514.2A11072469L0613J692q6760j43015q2672L8195R0992P6067J4937o1965m3356
3536.7A10907197J5879o5720j81067j13190Q8990J41966M6170L9959O6877R954n5969
3559.1A10901046r4068j43242j52171K8038K22934J72281N1510l850k2257n1617j05489
3581.5A10803115k01976k18594L0291J94073L6979m8948k1326m3071j5819O8367J5378
3604A10598469j01280q0431j1420m5669r2340j04356l9291J04213J01471o0690k04467
$$ y = [110577011, 110683000, 110817707, 110916102, 110976505, 110979009, 110934961, 110960019, 111030650, 110960770, 110812080, 110855007, 111111963, 111338389, 111398220, 111322188, 111241305, 111314213, 111421573, 111390352, 111350703, 111392236, 111396480, 111308253, 111199474, 111131978, 111066973, 110993266, 111020410, 111119258, 111157978, 111136234, 111090696, 111072469, 111103082, 111104774, 111018014, 110874999, 110792327, 110830522, 110921514, 110997581, 111012518, 110950553, 110907197, 110923076, 110857356, 110676289, 110563099, 110652089, 110794055, 110840225, 110880184, 110947061, 110957015, 110901046, 110806978, 110663736, 110511565, 110539603, 110762537, 110934818, 110986328, 110982478, 110960221, 110908604, 110803115, 110601139, 110382545, 110412836, 110606909, 110643888, 110594940, 110573614, 110530543, 110514724, 110583091, 110598469, 110497189, 110416758, 110405338, 110359669, 110267329, 110162973, 110123682, 110227895, 110329366, 110268676, 110064209]
3626.4A10064209r7096J55806J19174M4465L2293m315n3918j50001l16799m40001k38312
3648.8A09115505K28107K60222M3988m6217l3987k014N269j11640k82550k71678r7179
3671.3A08807826r8503o294K50626K23732R6190l0732j90354k84588n3787K87103K50411
3693.7A09251630Q1289m136k8420K2602P3981k1171j46365j02377J51765K61152J32716
3716.2A09672666j562o1512k2185O7878J33312Q0895r0814k32327j02377K35892K67613
3738.6A09947479O3395k598J15799N1570r7370Q8048L33274K00986K9612N5993J24371
3761A10910559M2045l7766k1898M6336J20998R4473k0301j13094m9031P1132M6849
3783.5A11090302K3890M4036J0371m6682j02341j23346j09625q5938M1306J09374Q5748
$$ y = [110064209, 109967113, 110122919, 110242093, 110286558, 110318851, 110314536, 110260618, 110110617, 109793818, 109353817, 109115505, 109343612, 109603834, 109647822, 109601605, 109567618, 109565604, 109570873, 109459233, 109176683, 108905005, 108807826, 108709323, 108703029, 108953655, 109177387, 109273577, 109242845, 109052491, 108767903, 108714116, 109001219, 109251630, 109332919, 109328783, 109300363, 109322965, 109396946, 109375775, 109229410, 109127033, 109278798, 109539950, 109672666, 109671104, 109609592, 109587407, 109655285, 109788597, 109869492, 109778678, 109546351, 109443974, 109679866, 109947479, 110010874, 110008276, 110124075, 110175645, 110078275, 110166323, 110499597, 110700583, 110730195, 110786188, 110910559, 110952604, 110914838, 110892940, 110939276, 111060274, 111154747, 111134446, 111021352, 110972321, 111043453, 111090302, 111114192, 111158228, 111168599, 111121917, 111019576, 110896230, 110786605, 110700667, 110741973, 110851347, 110937095]
3805.9A10937095J61636J26898n1379j66178j29092j01077k4200K21527K13182Q1169
3826.3A11269581L4476j4651q5020j79363j54280P3731K15375J91498J43671K0146
3846.7A11515164j67787k74729l0995L34037J83534l064q9883r4593n96M435k2197
3869.1A11353326M6289J10495J20628N400r1946n5647l2377N9664J16444J2803K9933
3891.6A11675012Q3912m0949j52862j12033Q428J33968K04050J41335M1795k0206o9905
3914A11892545o9308K4211O7830O509K420M0007p177m1711J3065M6051L3832J8894
3938.5A12027168k5952m5979j0132M339K7156N6863K5677p915q643q810Q333L7885
3962.9A12079990M0781J7965j6010m2545l3677K837J9860P260j6224l0124j1206Q547
$$ y = [110937095, 111098731, 111225629, 111174250, 111008072, 110878980, 110777903, 110753703, 110975230, 111188412, 111269581, 111304057, 111289406, 111204386, 111025023, 110870743, 110944474, 111159849, 111351347, 111495018, 111515164, 111347377, 111072648, 111041653, 111375690, 111559224, 111556160, 111466277, 111371684, 111371088, 111375523, 111353326, 111399615, 111510110, 111630738, 111636138, 111544192, 111488545, 111456168, 111515832, 111632276, 111645079, 111675012, 111758924, 111717975, 111565113, 111453080, 111461508, 111595476, 111799526, 111940861, 111982656, 111962450, 111892545, 111823237, 111847448, 111915278, 111921787, 111924207, 111964214, 111957037, 111915326, 111928391, 111974442, 112008274, 112027168, 112001216, 111955237, 111945105, 111949444, 111976600, 112033463, 112059140, 112051225, 112042582, 112033772, 112042105, 112079990, 112120771, 112138736, 112122726, 112080181, 112046504, 112049341, 112069201, 112076461, 112060237, 112030113, 112018907, 112027454]
3987.4A12027454N734L612j31m542l051
3997.6A12029076
$$ y = [112027454, 112033188, 112036800, 112036669, 112032127, 112029076]
##END=$$ End of the data block
