##TITLE=Isocianate ISO 01 $$ Begin of the data block
##JCAMP-DX=5.00 $$ ACD/SpecManager v 10.08
##SPECTROMETER/DATA SYSTEM=Alpha
##DATE=25 Nov 2015 09:11:28
##DATA TYPE=INFRARED SPECTRUM
##DATA CLASS=XYDATA
##ORIGIN=
##OWNER=
##NPOINTS=1667
##FIRSTX=599.64648438
##LASTX=3997.64306641
##MAXX=3997.64306641
##MINX=599.64648438
##MAXY=1.10349500
##MINY=0.02939405
##XFACTOR=1.0000000000
##YFACTOR=0.000000010000000
##FIRSTY=0.97685957
##DELTAX=2.03961372
##XUNITS=1/CM
##YUNITS=ARBITRARY UNITS
##XYDATA=(X++(Y..Y))
599.6I7685957j69170k35981l14825l70872m26692m70418m88889m69196l57509j71470
620I4210935L9166L02893N99950Q63779J010400R37504O21312K45154m65k6524K79647
642.5I9083751P64507J003325R13644P19810N36024M13692L42060K77757K15709J34254
662.9A04404533o2251l66414k14541K38931J08183j66369k86102l29125l81648m14563
683.3A02530634l74817l01898k06006q0931M0543J08958J16753J19817J31011J16790
703.7A02200854Q9049J01102J59847J73998P8237p2300k20418l04270k93004k46120
724.1A01666975j89853j36709r9683o9916o0952p4148j16992k57313n31435q80981
744.5I9248993j208096j396585j347148j006174l64435L97879Q95023R19998O57850
$$ y = [97685957, 97516787, 97280806, 96965981, 96595109, 96168417, 95697999, 95209110, 94739914, 94382405, 94210935, 94250101, 94552994, 95152944, 96016723, 97027123, 97964627, 98585939, 98831093, 98830628, 98804104, 99083751, 99848258, 100851583, 101765227, 102485037, 103021061, 103434753, 103776813, 104054570, 104270279, 104404533, 104342282, 103975868, 103761327, 104000258, 104108441, 103942072, 103655970, 103326845, 102945197, 102530634, 102155817, 101853919, 101647913, 101566982, 101607525, 101716483, 101833236, 101953053, 102084064, 102200854, 102289903, 102391005, 102550852, 102724850, 102803087, 102730787, 102510369, 102206099, 101913095, 101666975, 101477122, 101340413, 101240730, 101170814, 101109862, 101035714, 100918722, 100661409, 100129974, 99248993, 98040897, 96644312, 95297164, 94290990, 93926555, 94324434, 95219457, 96139455, 96797305]
762.8I6797305M28820M09657N65439O79726N62352K43270j02806l29179m02510l79950
783.2I8472124l51298m22686p05772j340944k560711m464918o341589o339210l275275
801.6G2669721Q18896K431118R03362j421886k506125k055633p62499O12957J617074
819.9G2306985K124130K273858K312255K372140K425235K398253K236801J901209J406932
838.3I1757798Q85570M61954R7835l44145r30685j521677j759875j386392o08140P7057
858.7H6729300L92413M58884O06162J042622J624662K001929J952595J561093J064598
877I7434258O85794N06645M16684L59726L21168K49153K05839K01750J24514p916j17802
899.5A00379813k09189k98345m11606n61541p68059j047099j198852q79413p5281P27582
$$ y = [96797305, 97226125, 97635782, 98201221, 98880947, 99443299, 99686569, 99583763, 99254584, 98852074, 98472124, 98120826, 97698140, 96992368, 95651424, 93090713, 88625795, 82284206, 75944996, 72669721, 73488617, 75919735, 76823097, 75401211, 72895086, 70839453, 70076954, 70689911, 72306985, 74431115, 76704973, 79017228, 81389368, 83814603, 86212856, 88449657, 90350866, 91757798, 92643368, 93105322, 93203157, 92859012, 91928327, 90406650, 88646775, 87260383, 86652243, 86729300, 87121713, 87580597, 88186759, 89229381, 90854043, 92855972, 94808567, 96369660, 97434258, 98120052, 98626697, 99043381, 99403107, 99724275, 99973428, 100179267, 100381017, 100505531, 100497615, 100379813, 100170624, 99872279, 99460673, 98899132, 98131073, 97083974, 95885122, 95005709, 94930428, 95658010]
919.9I5658010J054967R10335N95552L34108J55175K1642q6999j94311k85762l28577
940.3I7834140l20274k74825k05654j28954p7141o8306q7035j10090r1666j997J20521
962.7I6588719K37733L39669M14425M47577M56983M52835M21303L65889K80208J62422
983.1A00167763K5380j08528k14565k85310l28171l37863l22950l07339l05379l37994
1003.5I7645044m37474o68669j046818j688314l271991n262267m009676J217872M709100
1021.8H7186807L530777J014113j50275l85004o26928r11075j012939q85701o81651
1040.2H7078124n84060n51408n21010n01359n07951n31906n95724o71417o84178q01175
1060.6H1127936j141477j328599j008255o14983p04824r87143j009446p58308l24697
$$ y = [95658010, 96712977, 97623312, 98218864, 98552972, 98708147, 98729789, 98642790, 98448479, 98162717, 97834140, 97513866, 97239041, 97033387, 96904433, 96827292, 96758986, 96671951, 96561861, 96470195, 96468198, 96588719, 96826452, 97166121, 97580546, 98028123, 98485106, 98937941, 99359244, 99725133, 100005341, 100167763, 100193143, 100084615, 99870050, 99584740, 99256569, 98918706, 98595756, 98288417, 97983038, 97645044, 97207570, 96538901, 95492083, 93803769, 90531778, 85269511, 81259835, 82477707, 87186807, 90717584, 91731697, 91581422, 91196418, 90569490, 89658415, 88645476, 87759775, 87078124, 86494064, 85942656, 85421646, 84920287, 84412336, 83880430, 83284706, 82613289, 81929111, 81127936, 79986459, 78657860, 77649605, 77034622, 76329798, 75342655, 74333209, 73574901, 73250204]
1079G3250204K20383P41767J076252J167756J064658P57033J22559p91848j711315
1097.3G5897449k394891k728766k745431k480770j780533n62185P03531J268190R12744
1115.7F6089338P3141p40302j323598j698566j907319j948809j824636j573044j259177
1134E3887028r11737n10758l2878N05000J049781J524770J848036J948005J779855
1152.4F1087102J373636Q31765K76375j93530n17869o86669p06846n95897m11201k20233
1172.8F0236633p6515M512J16516L63558O73974R05281J014638J039374J012724R52101
1193.2F6242796Q42160O03652J97441k43825m75633l58987l8392R5410k01637p13652
1213.6F5949333j027501r49496n40733L2317N94461J007879J185292J116365Q62128
$$ y = [73250204, 73470587, 74212354, 75288606, 76456362, 77521020, 78278053, 78400612, 77608764, 75897449, 73502558, 70773792, 68028361, 65547591, 63767058, 63204873, 63908404, 65176594, 66089338, 66162479, 65422177, 64098579, 62400013, 60492694, 58543885, 56719249, 55146205, 53887028, 52975291, 52464533, 52431655, 52936655, 53986436, 55511206, 57359242, 59307247, 61087102, 62460738, 63292503, 63568878, 63375348, 62857479, 62170810, 61463964, 60868067, 60456866, 60236633, 60160118, 60164630, 60281146, 60644704, 61318678, 62223959, 63238597, 64277971, 65290695, 66242796, 67084956, 67688608, 67886049, 67642224, 67166591, 66807604, 66769212, 66864622, 66662985, 65949333, 64921832, 63972336, 63431603, 63463920, 64058381, 65066260, 66251552, 67367917, 68230045]
1231.9F8230045N33771K61253J02640P9947K34479M08346M00567K97772K39456K38115
1252.3G1026391K91240M10223N62382P09235Q17270Q61102Q53097P97600P11006O13951
1272.7G7653497M98790L38560J12260j48618l44641l40026o3592L39639N74410N45204
1293.1G9165483N46890Q63361J166481R43393L25715k05606m05616k84046J5510L50082
1313.5H2481647O52533R90290J408660J682860J635438J329690Q64542L57365o1398
1331.9I1341627l45105m99922n16427l56465k06125k88445m36080m12070j97381O5792
1352.3H8149399K46924L03852J98466n1069k41006k55966l52991n63621o80161p89082
1372.7H5964745q18127n92047l61431j01256K65384N62214P68537P88981M31281J40810
$$ y = [68230045, 68763816, 69025069, 69127709, 69207656, 69442135, 69850481, 70251048, 70548820, 70788276, 71026391, 71317631, 71727854, 72290236, 72999471, 73816741, 74677843, 75530940, 76328540, 77039546, 77653497, 78152287, 78490847, 78603107, 78454489, 78109848, 77769822, 77706230, 78045869, 78620279, 79165483, 79712373, 80575734, 81742215, 82685608, 83011323, 82805717, 82400101, 82116055, 82131565, 82481647, 83134180, 84124470, 85533130, 87215990, 88851428, 90181118, 91045660, 91403025, 91341627, 90996522, 90496600, 89980173, 89623708, 89417583, 89129138, 88693058, 88280988, 88083607, 88149399, 88396323, 88700175, 88898641, 88847572, 88606566, 88350600, 87997609, 87433988, 86753827, 85964745, 85146618, 84554571, 84193140, 84091884, 84357268, 84919482, 85688019, 86477000, 86908281, 87049091]
1393.1H7049091M58079R86219J105964Q27652K11853n83637j471483k530975l299796
1411.4H2752967k772004j056218J081437L047359L066820K026200J092625k4569j130921
1429.8H8083696j672166j566947j327204n89234K05052M28545M49783L40629Q9091
1448.1H4441245j85472l54326l89618k25514N64301J226497J295793J624733K074355
1466.5I0071994J783979J170868Q74930R35495Q44294N92381L02654J08856q1318l41612
1486.9I6262521m53532k42686j97000p39568j433933j671940j701331k011735l463363
1505.2H4347433n948979m521096l043073l427452m374748n292571n125362m959529
1521.6D7654623l233892p12973R87682K184102L226149M765433M821718M251879N779076
$$ y = [87049091, 87507170, 88493389, 89599353, 90427005, 90638858, 90055221, 88583738, 86052763, 82752967, 79980963, 78924745, 80006182, 83053541, 86120361, 88146561, 89239186, 89214617, 88083696, 86411530, 84844583, 83517379, 82928145, 83133197, 83561742, 84011525, 84352154, 84441245, 84255773, 83901447, 83511829, 83286315, 83850616, 85077113, 86372906, 87997639, 90071994, 91855973, 93026841, 93901771, 94837266, 95681560, 96273941, 96576595, 96685451, 96604133, 96262521, 95808989, 95566303, 95369303, 94629735, 93195802, 91523862, 89822531, 87810796, 84347433, 78398454, 73877358, 70834285, 67406833, 63032085, 57739514, 52614152, 47654623, 44420731, 43707758, 44695440, 46879542, 50105691, 54871124, 59692842, 63944721, 69723797]
1539.9F9723797O592613N160255M216694L304369K701950K143258J491534Q52108O42938
1558.3I6829516J332575J009798K86794l03436j289540k535802l008426l335225k518618
1576.6H6467636R44721L325367L697354K572614R66221k85959j138908j647401j818365
1595I3083280j683527j554996j809472k484947l135836k774882o56671K221400L765201
1613.4H4969550M267335M446072L146171J853496J396543J057613O78921M83644K49314
1631.7A02548659j28615k38705K87211M64535K29144r1648l46541k6250J91712k00689
1652.1A02688813o604O34253M09424K3949j38080j5199p0858m07541l86107j12748
1672.5A02619302k04420k91920k88927n23830r71758j099682m42457l41445n61899
$$ y = [69723797, 76316410, 81476665, 85693359, 88997728, 91699678, 93842936, 95334470, 96186578, 96829516, 98162091, 99171889, 99458683, 99155247, 97865707, 95329905, 92321479, 88986254, 86467636, 87412357, 90737724, 94435078, 97007692, 97973913, 97687954, 96549046, 94901645, 93083280, 91399753, 89844757, 88035285, 85550338, 82414502, 79639620, 78982949, 81204349, 84969550, 89236885, 93682957, 96829128, 98682624, 100079167, 101136780, 101815701, 102299345, 102548659, 102420044, 102181339, 102468550, 102933085, 103162229, 103070581, 102724040, 102697790, 102889502, 102688813, 102682209, 103316462, 103725886, 103749835, 103611755, 103596556, 103525698, 103118157, 102732050, 102619302, 102414882, 102122962, 101834035, 101310205, 100338447, 99238765, 98796308, 98454863, 97892964]
1690.9I7892964o69962j134408j411557j450133j793635j655203k146340k929580l036231
1709.2H1665915l243583l674239m474682n887139n680334m699445n356213o023270
1725.5D2627010n626312m954446l885465k981612j357191N57058K110773L739819N240560
1743.9C5470194O635671P976336R461629R482563P458776O011861N045391L696674
1760.2I1239095K895105K157032J386255Q70705M92334L38733M29607M33188L94774
1778.6A00636828N41604O87193O88565N76055L62790J31988K39528M62985L91531K38382
1799A04957449K31076L47745L20459J86336Q6212J37710K28298K01285J20640R9635
1819.4A06916845N9903l1925k5797M661L3439J95169K44558J03462M7755L3653q6665
$$ y = [97892964, 97223002, 96088594, 94677037, 93226904, 91433269, 89778066, 87631726, 84702146, 81665915, 78422332, 74748093, 70273411, 64386272, 58705938, 54006493, 48650280, 42627010, 37000698, 32046252, 28160787, 25179175, 23821984, 24379042, 26489815, 30229634, 35470194, 42105865, 50082201, 59543830, 69026393, 76485169, 82497030, 87542421, 91239095, 94134200, 96291232, 97677487, 98548192, 99040526, 99379259, 99808866, 100242054, 100636828, 101178432, 101865625, 102554190, 103130245, 103493035, 103625023, 103864551, 104327536, 104719067, 104957449, 105188525, 105536270, 105856729, 106043065, 106129277, 106266987, 106495285, 106696570, 106817210, 106916845, 106976748, 106944823, 106919026, 106923687, 106957126, 107152295, 107396853, 107500315, 107548070, 107581723, 107495058]
1841.8A07495058j44661N3930J94371J39952O3836L744k7514m4799l4737l9029j08517
1864.2A07551634k46310k57444o545J12867O378q5378q9979p6234p3886r8681j58263
1886.7A06578159k24030j76811j31929j91164j76549j23441j04964o6757m745K8849
1907.1A05406618R4068K11096K53570J85847J37318J85596J94407J97279K39611K07317
1927.5A07312727J31619R0671P7843Q4329P6473O294n0891K4021J14882R8217N8925
1949.9A08025110L3176J3673l004j7476k2030j7726k8468l7491J7858O9975N3251K5118
1974.4A08111966J4949P653M148n00q977k4152m9782n6219K814O2382L7587M696L231
2000.9A08109796J729R65J43m041p069j7607m3059l5250N067N996k0182l4535m2367
$$ y = [107495058, 107350397, 107404327, 107598698, 107738650, 107802486, 107806230, 107778716, 107733917, 107699180, 107660151, 107551634, 107305324, 107047880, 107041335, 107154202, 107160580, 107075202, 106985223, 106908989, 106835103, 106736422, 106578159, 106354129, 106177318, 106045389, 105854225, 105677676, 105554235, 105449271, 105382514, 105377769, 105406618, 105500686, 105711782, 105965352, 106151199, 106288517, 106474113, 106668520, 106865799, 107105410, 107312727, 107444346, 107535017, 107612860, 107697189, 107773662, 107779956, 107729065, 107753086, 107867968, 107966185, 108025110, 108058286, 108071959, 108068955, 108051479, 108029449, 108011723, 107983255, 107945764, 107963622, 108033597, 108086848, 108111966, 108126915, 108134568, 108138716, 108138216, 108129239, 108105087, 108055305, 107999086, 108001900, 108064282, 108101869, 108106565, 108109796, 108111525, 108112490, 108112633, 108108592, 108101523, 108083916, 108040857, 108005607, 108010674, 108016670, 107996488, 107961953, 107919586]
2027.4A07919586m2641m5372n9163p0691q3161j06763j18828j15907j28150j48654
2047.8A07000256j63341j79732k00760k24543k52282k72954k77996k72441k45798k03657
2068.2A04706752j63054j13630n5838p081L0017O4552Q8715Q8775P9131P4614P5519
2090.6A04868472O8330M8829L2901K3282J3006m471l3796p7068j25993j67393k01679
2113.1A04444420k44081k96127l52383m17566m94183n75411o50811p15685p80177q55798
2133.5I9062198r15443r36920r27722q96913q48437p76404o82920n93436n28443m86075
2153.9I1469485m76712n09590n71710o39808o88869p02024o83087o41072n92839n65434
2174.3H5398340n60605n77438o32113p25872q31729r34553j033431j124215j202423
$$ y = [107919586, 107876945, 107831573, 107772410, 107701719, 107618558, 107511795, 107392967, 107277060, 107148910, 107000256, 106836915, 106657183, 106456423, 106231880, 105979598, 105706644, 105428648, 105156207, 104910409, 104706752, 104543698, 104430068, 104374230, 104367149, 104397166, 104461718, 104550433, 104639208, 104718339, 104792953, 104868472, 104936802, 104985631, 105018532, 105041814, 105054820, 105050349, 105016553, 104939485, 104813492, 104646099, 104444420, 104200339, 103904212, 103551829, 103134263, 102640080, 102064669, 101413858, 100698173, 99917996, 99062198, 98146755, 97209835, 96282113, 95385200, 94536763, 93760359, 93077439, 92484003, 91955560, 91469485, 90992773, 90483183, 89911473, 89271665, 88582796, 87880772, 87197685, 86556613, 85963774, 85398340, 84837735, 84260297, 83628184, 82902312, 82070583, 81136030, 80102599, 78978384, 77775961]
2192.6G7775961j255512j280117j293278j304900j310558j314705j328051j354611
2208.9F7334229j387394j437258j516533j623798j777953k003485k309888k697343
2225.2E2580577l140679l599504m038581m397297m614466m639647m441167m036748
2241.6A9672488l477696k835618k205805j671222j260497r80933q07999p04533o37400
2259.9E090785n69034m86164l96514l04394k09829j28655n6790K1246J03431J86623
2280.3C250705K90305M27996N98328Q18480J098598J430980J802198K204036K612992
2298.7A4534618L002362L339471L586474L720485L730034L627670L435186L172049
2315D2148349K854472K525166K229392J987350J777238J576817J419026J351940J342094
$$ y = [77775961, 76520449, 75240332, 73947054, 72642154, 71331596, 70016891, 68688840, 67334229, 65946835, 64509577, 62993044, 61369246, 59591293, 57587808, 55277920, 52580577, 49439898, 45840394, 41801813, 37404516, 32790050, 28150403, 23709236, 19672488, 16194792, 13359174, 11153369, 9482147, 8221650, 7240717, 6432718, 5728185, 5090785, 4521751, 4035587, 3639073, 3334679, 3124850, 2996195, 2939405, 2960651, 3064082, 3250705, 3541010, 3969006, 4567334, 5385814, 6484412, 7915392, 9717590, 11921626, 14534618, 17536980, 20876451, 24462925, 28183410, 31913444, 35541114, 38976300, 42148349, 45002821, 47527987, 49757379, 51744729, 53521967, 55098784, 56517810, 57869750, 59211844]
2333.3E9211844J306313J258964J213085J161725J149910J253444J324022J173556
2349.7F9052863R42862Q25751Q63725R80014J138854J316833J457441J536834J609111
2368G9724288J674783J680553J660496J654560J628929J557505J451880J329547J200288
2386.4I3562829J075030R69803Q82548Q01689P27826O61498N99164N39875M90922M56023
2406.8A00767207M28426M03858L84700L58641L21782K90620K67625K49708K36606K26569
2427.2A03935742K12098K03311K02167J94836J86467J72865J53256J44410J51133J59061
2447.6A05715346J52290J32704J17254J15371J17493J12343J04475J01912R4997P7725
2467.9A06841910O5052O9523P7129P2169O2096N6791N7364N2619L8719K8503K9063
$$ y = [59211844, 60518157, 61777121, 62990206, 64151931, 65301841, 66555285, 67879307, 69052863, 69995725, 70821476, 71685201, 72665215, 73804069, 75120902, 76578343, 78115177, 79724288, 81399071, 83079624, 84740120, 86394680, 88023609, 89581114, 91032994, 92362541, 93562829, 94637859, 95607662, 96490210, 97291899, 98019725, 98681223, 99280387, 99820262, 100311184, 100767207, 101195633, 101599491, 101984191, 102342832, 102664614, 102955234, 103222859, 103472567, 103709173, 103935742, 104147840, 104351151, 104553318, 104748154, 104934621, 105107486, 105260742, 105405152, 105556285, 105715346, 105867636, 106000340, 106117594, 106232965, 106350458, 106462801, 106567276, 106669188, 106764185, 106841910, 106906962, 106976485, 107053614, 107125783, 107187879, 107244670, 107302034, 107354653, 107393372, 107421875, 107450938]
2490.4A07450938L5155L3200K4283K4128L0410L1829K6202J7905J5116J1790P355R525
2514.9A07717836Q142P772K0743K7919J9335J4389J3077J1635J2982J1468J4949J7523
2539.3A07897770M280p212q381q046o80K325n007o127l600m530p141m983K229k467
2567.9A07848430j8454k3413k3508l7133n0438n2523n8628p0488p5698q0430p7689
2590.3A07280028m9269j2935K8396P6223R3448Q5818P8714O4803N4168M8208L2068
2612.8A07779670J4531J1480J3030J287j0121m470J0204J6439M959j1766j7380j7917
2637.2A07789946k2018j4317K348M566q941k1851k3472j7393j4257j8216k0241j9503
2661.7A07616651j9669j6094j5306k1935j9598q487q107j4996o211J9288K7788J3590
$$ y = [107450938, 107486093, 107519293, 107543576, 107567704, 107598114, 107629943, 107656145, 107674050, 107689166, 107700956, 107708311, 107717836, 107725978, 107733750, 107754493, 107782412, 107801747, 107816136, 107829213, 107840848, 107853830, 107865298, 107880247, 107897770, 107902050, 107894838, 107886457, 107878411, 107877731, 107880056, 107875049, 107868922, 107865322, 107860792, 107853651, 107848668, 107850897, 107848430, 107829976, 107806563, 107783055, 107745922, 107695484, 107642961, 107584333, 107513845, 107438147, 107357717, 107280028, 107230759, 107217824, 107246220, 107322443, 107415891, 107501709, 107580423, 107645226, 107699394, 107747602, 107779670, 107794201, 107805681, 107818711, 107819998, 107809877, 107805407, 107815611, 107832050, 107837009, 107825243, 107807863, 107789946, 107767928, 107753611, 107755959, 107760525, 107751584, 107729733, 107706261, 107688868, 107674611, 107656395, 107636154, 107616651, 107596982, 107580888, 107565582, 107543647, 107524049, 107515562, 107507455, 107492459, 107486248, 107505536, 107533324, 107546914]
2686.2A07546914k611j6916k4354k8181l8124l9958k6453k6178m4406n5170m8065l3414
2710.7A07163084k9433l0256k1934k7883m8471n0306l3605o998J3709J1647j597k0433
2735.1A06917524j6904K1017K8586p593l5143l5572n806L3200L7444J6570J0824J6689
2759.6A06980836J9563K0671K1922J6821k552l2806m7755j2481K7763J2184k0135l2127
2784.1A06951904o8295j11568q2826k7705l3664p1490o2037j9764j8561n5004r4032
2806.5A06306958j28710j33991j20199j42062j92988k35593k64120k79105k71666k63369
2826.9A04275155k79641l03435l25048l53873l71719l24583k53772k70939l70467m77421
2847.3A00944257n62382o56825p67172q43101q73489q58956q05414p44241o57779n32145
$$ y = [107546914, 107544303, 107527387, 107503033, 107474852, 107436728, 107396770, 107370317, 107344139, 107299733, 107244563, 107196498, 107163084, 107133651, 107103395, 107081461, 107053578, 107005107, 106954801, 106921196, 106914198, 106927907, 106939554, 106937957, 106917524, 106900620, 106921637, 106950223, 106942630, 106907487, 106871915, 106866109, 106899309, 106936753, 106953323, 106964147, 106980836, 107000399, 107021070, 107042992, 107059813, 107057261, 107024455, 106976700, 106964219, 106991982, 107004166, 106984031, 106951904, 106883609, 106772041, 106689215, 106661510, 106627846, 106556356, 106494319, 106474555, 106455994, 106400990, 106306958, 106178248, 106044257, 105924058, 105781996, 105589008, 105353415, 105089295, 104810190, 104538524, 104275155, 103995514, 103692079, 103367031, 103013158, 102641439, 102316856, 102063084, 101792145, 101421678, 100944257, 100381875, 99725050, 98957878, 98114777, 97241288, 96382332, 95576918, 94832677, 94174898, 93642753]
2867.7I3642753m20546l13658j32572N6022J20521R4854P2641O6453M6474j7727j21593
2890.1I3093622k26486l08603l77023m67253m88520l51154k44260k76047l37673l63618
2910.5H9652985l18074k24912j65504j53983j39844j10543j01930j30844j54650j50317
2930.9H8002384j84089k64418l33488l94976m72540n23353m96012m27878l59624k52354
2951.3H4293652q2374J04272K74712M24820N43368O12426O34545O62571P18850P70635
2971.7H8957477Q10414Q20267P50095O35964N76073N67793N57256N98258P28655P69216
2992.1I5771468O25610M71640M12178L89462L64811L87060M42517M18204L23510K61116
3012.5I9867576K41155J94263R0850l6157j32024r8884N9307J84011K29621K52223
$$ y = [93642753, 93222207, 92908549, 92775977, 92831999, 92952520, 93047374, 93120015, 93186468, 93232942, 93215215, 93093622, 92867136, 92558533, 92181510, 91714257, 91225737, 90874583, 90630323, 90354276, 90016603, 89652985, 89334911, 89109999, 88944495, 88790512, 88650668, 88540125, 88438195, 88307351, 88152701, 88002384, 87818295, 87553877, 87220389, 86825413, 86352873, 85829520, 85333508, 84905630, 84546006, 84293652, 84211278, 84315550, 84590262, 85015082, 85558450, 86170876, 86805421, 87467992, 88186842, 88957477, 89767891, 90588158, 91338253, 91974217, 92550290, 93118083, 93675339, 94273597, 95002252, 95771468, 96397078, 96868718, 97280896, 97670358, 98035169, 98422229, 98864746, 99282950, 99606460, 99867576, 100108731, 100302994, 100393844, 100357687, 100225663, 100126779, 100186086, 100370097, 100599718, 100851941]
3032.9A00851941K76709K26021K384j72246p0143J73641L23140L07799K90203L11661
3053.3A02521110K56586J96015J63138P2277j8716j5783J24311L24619L91579L10409
3073.7A04325545J94108J50502K40350L31843L29005L04461K63464K15483K15685J95230
3094.1A06765676J15096M5717M5252R8479J01518K6143r084M4262M7267l8099n2512
3116.5A07189715K1934Q7965J25670J18661O8212M1437O7818J03533R7251N2977O6197
3139A08041370J59347K04134J57642R2686J7583k7227N7923J71292J54936P2062J8442
3161.4A09120190M8L338M470k551q380j8359l3128l6442j8549q559k6632k8729J609
3187.9A08948326K8241M2200N0998N3346O0332O7162N7042M5085M3440M8720M5550
$$ y = [100851941, 101128650, 101354671, 101357055, 101184809, 101114666, 101288307, 101611447, 101919246, 102209449, 102521110, 102777696, 102973711, 103136849, 103209126, 103190410, 103174627, 103298938, 103623557, 104015136, 104325545, 104519653, 104670155, 104910505, 105242348, 105571353, 105875814, 106139278, 106354761, 106570446, 106765676, 106880772, 106926489, 106971741, 107070220, 107171738, 107197881, 107188797, 107233059, 107280326, 107242227, 107189715, 107211649, 107299614, 107425284, 107543945, 107612157, 107653594, 107721412, 107824945, 107922196, 107975173, 108041370, 108200717, 108404851, 108562493, 108655179, 108672762, 108645535, 108703458, 108874750, 109029686, 109101748, 109120190, 109120238, 109123576, 109128046, 109125495, 109117115, 109098756, 109065628, 109029186, 109010637, 109002078, 108975446, 108946717, 108948326, 108976567, 109018767, 109069765, 109123111, 109183443, 109250605, 109307647, 109352732, 109396172, 109444892, 109490442]
3210.3A09490442J9431Q905J5009R18R155J9646k0290n6302p4852j13559j16217k3019
3234.8A09159267N2762K6727k7573p7439j16920q3983p51J1694n4931q6725l9208J824
3259.3A08764744j5140m7350p0274j08432j49107j09864k8455N674J908l5513p6770
3281.7A08131421q4746q4996j20676j86420j96933j34123p7629n0926p7033j63436
3302.1A06954503k17247j81436r8825m0877l7408o4432q6606j03438j30403j73855
3322.5A05819976k02775j49989p6830q8346j51348k13957k43032k01368j39130j09636
3342.9A04243565q2529q3458j28115r2280K6072P6067N0104K9301M5669N1463j3566
3365.4A04122293n5993J3769J09530R8657l278q5211j17028j22213j36173j51217j69992
$$ y = [109490442, 109509873, 109518778, 109533787, 109534705, 109543860, 109563506, 109543216, 109486914, 109412062, 109298503, 109182286, 109159267, 109212029, 109238756, 109211183, 109133744, 109016824, 108932841, 108932090, 108943784, 108888853, 108802128, 108762920, 108764744, 108749604, 108702254, 108631980, 108523548, 108374441, 108264577, 108236122, 108241796, 108243704, 108208191, 108131421, 108046675, 107961679, 107841003, 107654583, 107457650, 107323527, 107245898, 107194972, 107117939, 106954503, 106737256, 106555820, 106456995, 106416118, 106378710, 106314278, 106227672, 106124234, 105993831, 105819976, 105617201, 105467212, 105390382, 105302036, 105150688, 104936731, 104693699, 104492331, 104353201, 104243565, 104161036, 104077578, 103949463, 103857183, 103883255, 103959322, 104009426, 104038727, 104084396, 104135859, 104122293, 104066300, 104080069, 104189599, 104288256, 104284978, 104199767, 104082739, 103960526, 103824353, 103673136, 103503144]
3387.8A03503144k13433j57701J7499J02926M9817L2449J63257L07763K94220K17080
3408.2A04317021K11001K54786L18575L38053K62332K45297L27993L10206J78993J01900
3428.6A06866157J36328J41644Q1241J48511K99871L04604J77503N2797M8650J60431
3449A08417737J89639J31285R7871K6798m3070M0984Q5592r9456j80412R1982L84879
3471.4A09143829L40176J02174j01924j21581J01721J69885j4818l6406N9175J336
3491.8A09643567j16122j32775p4041q6010j26815K0862J46699M0591o0487o3884k2710
3514.2A09168875K8944J0109r1111j81890j26755K0385R8705R8216K6429p7259o0559
3536.7A08914089K4951o0702k19535j68777P7868J72746O2871M6289R4306L9327n0568
$$ y = [103503144, 103289711, 103132010, 103149509, 103252435, 103302252, 103334701, 103497958, 103805721, 104099941, 104317021, 104528022, 104782808, 105101383, 105439436, 105701768, 105947065, 106275058, 106585264, 106764257, 106866157, 107002485, 107144129, 107225370, 107373881, 107673752, 107978356, 108155859, 108208656, 108257306, 108417737, 108607376, 108738661, 108836532, 108863330, 108820260, 108861244, 108946836, 108847380, 108666968, 108758950, 109143829, 109484005, 109586179, 109484255, 109362674, 109464395, 109634280, 109619462, 109583056, 109642231, 109643567, 109527445, 109394670, 109320629, 109234619, 109107804, 109128666, 109275365, 109315956, 109255469, 109191585, 109168875, 109197819, 109207928, 109116817, 108934927, 108808172, 108828557, 108927262, 109025478, 109051907, 108974648, 108914089, 108939040, 108878338, 108658803, 108490026, 108567894, 108740640, 108803511, 108849800, 108944106, 108983433, 108932865]
3559.1A08932865r6321j51611k24125o3062K51412K59972R3246l803k4033m1532r4152
3581.5A08838856k25377l14605n7626K28751Q3721p7451n2845m0150j4234P8238K6667
3604A08473945j37461j45244m8423o4242q1241j03092j21379N9402J64986k4522l13115
3626.4A07659614l15833J05715K05505P4935J2993m6169j03879j86599l86333o44338
3646.8A06375611n45597J33407L35002N60j66774p5626k1720j7262j15871l42011m09687
3669.2A05150032j66929j68180j52624L22032M24433J95753N973j89591l85880j85680
3689.6A04849339L29351M14336K42304J07468J6617O4302J95527J10781j16098j89709
3710A06024218J23834L98672K72655N9700o3562m6516O5518J88827J89197k0492k81536
$$ y = [108932865, 108836544, 108684933, 108460808, 108397746, 108649158, 108909130, 109002376, 108998573, 108974540, 108933008, 108838856, 108613479, 108298874, 108241248, 108469999, 108553720, 108476269, 108423424, 108383274, 108369040, 108447278, 108473945, 108336484, 108191240, 108142817, 108078575, 107997334, 107894242, 107772863, 107832265, 107997251, 107972729, 107659614, 107343781, 107449496, 107655001, 107729936, 107742929, 107696760, 107592881, 107406282, 107019949, 106375611, 105830014, 105963421, 106298423, 106298983, 106132209, 106056583, 106034863, 106017601, 105901730, 105559719, 105150032, 104983103, 104814923, 104662299, 104984331, 105408764, 105604517, 105610490, 105420899, 105035019, 104849339, 105178690, 105593026, 105835330, 105942798, 105959415, 106023717, 106219244, 106330025, 106213927, 106024218, 106148052, 106546724, 106819379, 106879079, 106815517, 106769001, 106834519, 107023346, 107212543, 107192051, 106910515]
3732.5A06910515k32375K39480M71651K50411j5938q225P4291p8261K5713M03297L42906
3754.9A08383465Q6307O0642J76323R4807l1591m1783J336J24359J67811K8324j33694
3777.3A08916306q9216P6604N0593P98N0807M9639l993r3174j61827j44422j43886
3799.8A08508229r000J56987R6929J57761K13111K8133j87874j98233j21176o9940
3820.2A08574927K14839K98393J47819Q8167J3042r8026k13218k41518j1873K29669
3840.6A09002221K64883K42495J37270q1933l41260l14439K15042L44992J35457o0999
3861A09543729j40000j2028K0695n7948J8204J32417J91856P0536j18482q2457l2485
3883.4A09534037L2568J46675L0339j4734J26087O0058j46246k14720j05869R6726
$$ y = [106910515, 106678140, 106917620, 107389271, 107639682, 107623744, 107615519, 107689810, 107611549, 107637262, 108040559, 108383465, 108469772, 108530414, 108706737, 108801544, 108769953, 108728170, 108729506, 108853865, 109021676, 109050000, 108916306, 108827090, 108903694, 108954287, 108955085, 109005892, 109055531, 109051538, 108958364, 108796537, 108652115, 108508229, 108499229, 108656216, 108753145, 108910906, 109124017, 109152150, 108964276, 108766043, 108644867, 108574927, 108789766, 109088159, 109235978, 109324145, 109337187, 109239161, 109025943, 108784425, 108772552, 109002221, 109267104, 109509599, 109646869, 109564936, 109223676, 108909237, 109124279, 109469271, 109604728, 109543729, 109403729, 109391701, 109412396, 109354448, 109372652, 109505069, 109696925, 109767461, 109648979, 109566522, 109534037, 109566605, 109713280, 109743619, 109728885, 109854972, 109915030, 109768784, 109554064, 109448195, 109544921]
3903.8A09544921K87676K68304J21617J0992r2555j43420k3294R2042L6609J335N1856
3926.2A10156083N376p3242n36J03438Q1265Q154n5206n3990M554K241k766M6885O3002
3952.7A10285258L9161J3053j6391k5773J1348L4559Q285k4056l9804l1460j5628j0872
3977.2A10227680l147m971j0931K26j0753k9778j3447k682o378r012
3997.6A10136807
$$ y = [109544921, 109832597, 110100901, 110222518, 110233510, 110140955, 109997535, 109974241, 110066283, 110102892, 110104227, 110156083, 110161459, 110088217, 110087681, 110191119, 110272384, 110280538, 110225332, 110171342, 110175896, 110178137, 110175371, 110222256, 110285258, 110324419, 110337472, 110321081, 110295308, 110306656, 110341215, 110349500, 110325444, 110285640, 110254180, 110238552, 110227680, 110224533, 110219562, 110208631, 110208857, 110198104, 110168326, 110154879, 110152197, 110145819, 110136807]
##END=$$ End of the data block
