##TITLE=$$ Begin of the data block
##JCAMP-DX=5.00 $$ ACD/SpecManager v 10.08
##SPECTROMETER/DATA SYSTEM=Varian
##DATE=16 Apr 2013 14:10:28
##DATA TYPE=INFRARED SPECTRUM
##DATA CLASS=XYDATA
##ORIGIN=
##OWNER=
##NPOINTS=3735
##FIRSTX=399.26403809
##LASTX=4000.35498047
##MAXX=4000.35498047
##MINX=399.26403809
##MAXY=788.51666260
##MINY=0.00000100
##XFACTOR=1.0000000000
##YFACTOR=0.000001000000000
##FIRSTY=60.69778442
##DELTAX=0.96440572
##XUNITS=1/CM
##YUNITS=TRANSMITTANCE
##XYDATA=(X++(Y..Y))
399.3F0697784o0697783%TK60508330J05616761%Wl66125091%TK449906L4857699l7307605
414.7A%L49740813K12505646k97922852k13327827n0995780%O648688o648688%K4552279
425.3B4552280k4552279%UK32722411j54739525%ZO3918083o1175781l9465225M7089897
442.7H8349861P00166802%o96962204l6029435%Tn5525023%TK69135405k69135405
453.3A%WM68486937%TO062775N9156891k92942123j54292031j7469085J2136650j8036225
467.7F3103790k9215095l3888694J11194129J52688103j06743988j1232956J21798690
474.5B67703979Q5999726k76817368m953888K6817421K034905N0584869k0521194J4504455
482.2A45352905j1190078n7899399j910065L2891243J00348076m3130615m8306847
$$ plain form
399.3 60697784 1 1 1 260508331 366125092 366125092 366125092 366125092 366125092 366125092 1 1 1 2449907 37307606 1
414.7 1 1 349740814 562246460 264323608 50995781 1 1 6648689 1 1 24552280
425.3 24552280 1 1 1 1 232722412 77982887 77982887 77982887 77982887 77982887 77982887 77982887 77982887 77982887 141900970 80725189 41259964 88349861
442.7 88349861 788516663 788516663 91554459 55525024 55525024 55525024 1 1 1 269135406 1
453.3 1 1 1 1 1 1 468486938 468486938 468486938 474549713 533706604 240764481 86472450 69003365 81140015 63103790
467.7 63103790 33888695 1 111194130 263882233 157138245 145905289 267703979
474.5 267703979 353703705 76886337 71932449 98749870 100784775 151369644 130848450 145352905
482.2 145352905 134162827 76263428 74353363 107244606 207592682 164462067 116155220
489A16155220k6043480j2813347k6420662l624939P5616822j0391152m3343872j3913349
496.7E5221241J5010456M1941948K4039413J4324708m286759j4181610k9854469n501793
504.4I6713135n042542o494484J3324028M345597n23224r793480N080940j629761j4839821
513.1H1140388J098763L590408J1216835j2297828q993142J3739914J7688591Q582390
520.8A15766319j4015915r753898p761238P28248O423447k776947N08774m481552K065673
529.5H6702911Q613678N567383j78535k335442L813454J144989l543663o841194j827507
538.1I1116074M012069P542595M755547m331085L7117n317780j0434944L873077J0077416
546.8A01330086j489228l097000N886818L058815n120765j490052N35660k977943k657761
$$ plain form
489 116155220 90111740 77298393 50877731 47252792 122869614 112478462 69134590 55221241
496.7 55221241 70231697 112173645 136213058 150537766 146251007 132069397 102214928 96713135
504.4 96713135 91670593 85176109 98500137 102845734 102322510 92529030 97609970 95980209 81140388
513.1 81140388 82239151 85829559 97046394 84748566 75755424 89495338 107183929 115766319
520.8 115766319 101750404 91996506 84235268 84963516 91386963 88610016 89118790 84637238 86702911
529.5 86702911 95316589 100883972 100705437 98369995 102183449 103328438 99784775 92943581 91116074
538.1 91116074 95128143 102670738 107426285 103095200 103132317 97814537 87379593 91252670 101330086
546.8 101330086 99840858 96743858 102630676 105689491 100568726 99078674 99614334 96636391 93978630
555.5I3978630l138435m14376N216744j50841k519859L641319M783524k098107K8931
564.2I9327530N035011L722092r12796q825249o548683L327728R373047l724914n883797
572.9I4889969J419731l74504P201096L050514j455849o84166o169594L412140L916603
581.5A05205940m162140o592231j076394O902871j028229n652336j083374K617233
589.3I5131340k6237J003181O135338L488533n142601q782303k42386O298645O338646
597.9A04202156k120758n189583J896683J423248j4770J237961R44824m966004l253784
606.6I4159973M133072R52995O44463K450645j123069m739296j246369L647461K306221
615.3A01186096k447937m153496q0978K612114N750900K036339m068375l237358k267517
$$ plain form
555.5 93978630 90840195 90425819 95642563 95491722 92971863 96613182 101396706 99298599 99327530
564.2 99327530 104362541 108084633 107171837 98346588 91797905 95125633 104498680 100773766 94889969
572.9 94889969 96309700 95935196 103136292 106186806 104730957 104046791 97877197 101289337 105205940
581.5 105205940 101043800 94451569 93375175 100278046 99249817 93597481 92514107 95131340
589.3 95131340 95105103 96108284 102243622 105732155 100589554 91807251 91564865 97863510 104202156
597.9 104202156 102081398 96891815 98788498 100211746 100196976 101434937 102379761 97413757 94159973
606.6 94159973 98293045 99246040 99890503 102341148 101218079 96478783 95232414 98879875 101186096
615.3 101186096 98738159 94584663 94503685 97115799 102866699 104903038 100834663 97597305 95329788
624I5329788J524010J886261k93167l230461m99474K813835L8063P29760j880806M36782
633.6I6854591K202660j110832j34171j709472J262870J546074j558174o55548K713936
642.3I9411934M912262q56545k953605K82684K537361j222359l721672K20643N61317
651I9172020p42600k325378j325142J463959L167900J502907j520195j482392k834144
659.7I5076935O5864K482949j778389l674172R0493L097755K994530P574913L291732
668.3A09222610j0288528k410606j594406k96624R19571L683487J945351j781578k775513
677I6623764k651009J194832K333817J823578P26722j371597k032524k72202J754158
685.7I8129539j427818q70331J865288J439415O60599k162384j082695N24391m93355
$$ plain form
624 95329788 96853798 98740059 98446892 95216431 94716957 97530792 97568855 98298615 96417809 96854591
633.6 96854591 99057251 97946419 97812248 96102776 97365646 98911720 97353546 96697998 99411934
642.3 99411934 104324196 103467651 100514046 100796730 103334091 102111732 98390060 98610703 99172020
651 99172020 98429420 96104042 94778900 96242859 99410759 100913666 99393471 97911079 95076935
659.7 95076935 95142799 97625748 95847359 92173187 92263680 95361435 98355965 105930878 109222610
668.3 109222610 98934082 96523476 94929070 94632446 95552017 99235504 101180855 99399277 96623764
677 96623764 93972755 95167587 97501404 99324982 100051704 98680107 96647583 96375381 98129539
685.7 98129539 96701721 95831390 97696678 99136093 99796692 97634308 96551613 97076004 96582649
694.4I6582649m19533j237045j548920J05362L292397K619690j612763k982650j046974
703.1I3752213K977981K532463o74675j353973n16144J076042m03457q47840O94412
711.7I7237022R8229k320740j161026L519028K479973k28852j469368j828590Q36731
720.4I7162407J646782n0621n81284J487839Q0315k968720j328125M14383J158028
729.1I7021004P64847k18873j800033n08385K317040K82241r01054M56528J72157k29500
738.7I7355972Q91686j284584k740509j22376J068009K246627R53995P4051J39305
747.4I8582176p12623M27528k88841M31244O94313j069123j116333K68021J375481
756.1I8591843j22597m85031o66962K07375M62524j748703q13599P99134Q14956n5259
$$ plain form
694.4 96582649 96163116 94926071 93377151 93482513 96774910 99394600 97781837 94799187 93752213
703.1 93752213 96730194 99262657 98587982 97234009 96717865 97793907 97390450 96542610 97237022
711.7 97237022 97335251 95014511 93853485 97372513 99852486 99623634 98154266 96325676 97162407
720.4 97162407 98809189 98758568 98177284 99665123 99745438 96776718 95448593 95862976 97021004
729.1 97021004 97785851 97566978 95766945 95258560 97575600 97857841 96956787 97413315 97585472 97355972
738.7 97355972 98247658 96963074 94222565 94100189 95168198 97414825 98368820 98442871 98582176
747.4 98582176 97869553 98297081 98008240 98439484 99133797 98064674 96948341 97216362 98591843
756.1 98591843 98469246 97984215 97317253 97524628 97987152 96238449 95424850 96223984 97038940 96983681
765.7I6983681o12534j480072j74728J786155K23771L08319J28250n1270q21922j772781
775.4I4516869J95160n83527o58798Q59810J14418K17872J000824P81479L43956k065353
785I4722710l511193R0538J030861o70891n11093r66354p5668J464531k76818k216858
794.7H9079765m69436J6014j782395j491020Q68973J586815p20215n6923J957222J522972
804.3I0511772L54347l9848O54236N78796l69659j134789l44940j38153M35059J359016
814I1865837P3738K23946O38313M33113L20114k61665o05248m73899m21692M6234J116470
824.6I2955261O13251J401428P22748q72391Q58582N44227j194397j598030K69387
833.3I3700066J937072J971863m06120k140251Q64303J425400K78915q42842n52040
$$ plain form
765.7 96983681 96371147 94891075 94716347 96502502 96726273 97034592 97162842 97111572 96289650 94516869
775.4 94516869 94712029 94128502 93469704 94329514 94443932 94661804 95662628 96444107 96788063 94722710
785 94722710 91211517 91302055 92332916 91662025 91150932 90184578 90108910 91573441 91296623 89079765
794.7 89079765 88610329 88626343 86843948 85352928 86221901 87808716 87088501 87031578 88988800 90511772
804.3 90511772 90866119 90826271 91480507 92059303 91689644 90554855 90209915 90071762 90506821 91865837
814 91865837 91939575 92163521 92801834 93234947 93555061 93293396 92688148 92214249 91792557 91838791 92955261
824.6 92955261 93568512 94969940 95692688 94820297 95678879 96223106 95028709 93430679 93700066
833.3 93700066 95637138 97609001 97202881 95062630 95926933 97352333 97631248 96788406 96236366
841.9I6236366J147553K20237m24041n94055q38677j044151J634933J368965j007370
850.6I6699760P07940K63687J167144j295082l129226J538116K662300l26072l013092
859.3I5275475r64631Q93288J627792K72896j505493Q24875P7057L42888K10067k16888
868.9I6837326P62230q77922J38077K36900q27034L00484J393440j132797k156533
877.6I4674171P39212N73769J485573Q14621j039528M26285M51240k30034n45242k28805
887.3I7121262M19174R99420L46001N13549k01873k471993l43216Q41461R19617J305473
896.9I9448875p24609r52209L04290M30085L24012k86400j927803j104995J274078
905.6I6785324J996666P00745p99607o2645M48243L06083l91288q62122p21504p20772
$$ plain form
841.9 96236366 97383919 97604156 97180115 96586060 95747383 94703232 96338165 97707130 96699760
850.6 96699760 97407700 97671387 98838531 97543449 94414223 95952339 98614639 98288567 95275475
859.3 95275475 94310844 95204132 96831924 97104820 95599327 96424202 96501259 96844147 97054214 96837326
868.9 96837326 97599556 96721634 96859711 97096611 96269577 96570061 97963501 96830704 94674171
877.6 94674171 95413383 95987152 97472725 98287346 97247818 97674103 98125343 97895309 97350067 97121262
887.3 97121262 97540436 98539856 98885857 99399406 99197533 96725540 96382324 97223785 98143402 99448875
896.9 99448875 98724266 97772057 98076347 98506432 98830444 98544044 96616241 95511246 96785324
905.6 96785324 98781990 99482735 98683128 98620483 99068726 99374809 98983521 98121399 97399895 96679123
915.2I6679123n31952j62460J887230J746498J9920l57407n66955O53641O01532p29416
924.9I9239754p78366R2537n59586o30363J455184J017609m02687j014999m76769N68306
934.5I8510620J66626n85915m42260N15861J40785j45469J36368j47568l01140k88727
944.2I7559181L14232K88185j69281j62765O55044O47766q42720r28489J01570K45750
953.8I7708473n08842J07948Q94234P46727J38305m12330J32698j12412J26259j52733
963.4I8668327j014122j59103M24873O44715K40814o13487j328370o0287J475578R1042
973.1I8369980l51990J5854j55945o8100l80707o12533K8984O55861L40881o05202
982.7I7237083j227424L56041P47719L59932N38467j285454n15304L76968l31444P7316
$$ plain form
915.2 96679123 96147171 95984711 97871941 99618439 99638359 99280952 98713997 99367638 99969170 99239754
924.9 99239754 98461388 98553925 97994339 97363976 98819160 99836769 99434082 98419083 97942314 98510620
934.5 98510620 98677246 98091331 97649071 98164932 98305717 98160248 98296616 98149048 97847908 97559181
944.2 97559181 97873413 98161598 97992317 97829552 98484596 99132362 98289642 97361153 97462723 97708473
953.8 97708473 97199631 97307579 98201813 98948540 99086845 98674515 98807213 98694801 98821060 98668327
963.4 98668327 97654205 97495102 97919975 98564690 98805504 98192017 96863647 96803360 98278938 98369980
973.1 98369980 98017990 98033844 97877899 97809799 97429092 96816559 96845543 97501404 97842285 97237083
982.7 97237083 96009659 96365700 97113419 97473351 98011818 96726364 96211060 96588028 96256584 96333900
992.4I6333900j80542K19536k74543j244111n39207O05629Q50059P4288n8663j023620
1002I4762726j152214K86720j70158q38501o39870J40114P81769k73461q72543o32019
1011.7I1392563l79738K37053k78748j061248K09793J318702l02055p39670K93877
1020.3I0690529l75603M04549O34147r83017q80683j43166R68414O14800o48468n65109
1030H9716393p2144O86127K73513K1676K44224L69492J070442l77190j438072K12708
1039.6I0707169J558380J655822m11117j480057L11951N02205l90740o39938k67357
1048.3I1546318J38763l7460M21280N83939M37355P0327l9588n95360p53357R60853
1058I2733070M44367J79611k58102j023606N34699M0657L64654l81134j690567Q06763
$$ plain form
992.4 96333900 96153358 96372894 96098351 94854240 94315033 94920662 95770721 95845009 95786346 94762726
1002 94762726 93610512 93897232 93727074 92888573 92248703 92388817 93170586 92897125 92024582 91392563
1011.7 91392563 91012825 91249878 90971130 89909882 90119675 91438377 91136322 90396652 90690529
1020.3 90690529 90314926 90719475 91353622 90370605 89489922 89346756 90315170 90929970 90281502 89716393
1030 89716393 89644249 90330376 90603889 90625565 90869789 91239281 92309723 91932533 90494461 90707169
1039.6 90707169 92265549 93921371 93510254 92030197 92342148 92844353 92453613 91813675 91546318
1048.3 91546318 91685081 91647621 92068901 92652840 93090195 93160522 93120934 92525574 91772217 92733070
1058 92733070 93177437 93357048 93098946 92075340 92610039 92650696 93015350 92634216 90943649 91750412
1067.6I1750412J106430r0477k426O9023l08388k88444j79505j94908O53336K9068
1077.2I2544121j003624m86542J051163J747963N40176m86282j317009j276657J40823
1085.9I1454132P96150o95518j409706k42272N86617R90425p83859j313401R43215
1094.6I0325783J286880Q43468k46643p46414M36172J48049k98119k09457j82862M38843
1104.2I1795700R52828L76068o55457k4368J78100q1436O29807j97571k67517O35414
1113.9I3341568N18585L30048N0987P8255j29639l88351k69745P88399J049499j27396
1123.5I5242210k20153l85666M3731N38742M41788J39504o46103j64727K45774L35457
1133.2I5570557J67701K82135M94828L29422L30856m51958M03961R9671j266586k52198
$$ plain form
1067.6 91750412 92856842 92766365 92763939 92832962 92524574 92236130 92056625 91861717 92515053 92544121
1077.2 92544121 91540497 91053955 92105118 93853081 94393257 93906975 92589966 91313309 91454132
1085.9 91454132 92250282 91554764 90145058 89902786 90489403 91479828 90695969 89382568 90325783
1094.6 90325783 91612663 92456131 92209488 91463074 91899246 92047295 91749176 91539719 91356857 91795700
1104.2 91795700 92748528 93124596 92469139 92444771 92622871 92541435 93171242 92973671 92706154 93341568
1113.9 93341568 93860153 94190201 94241188 94319443 94189804 93801453 93531708 94320107 95369606 95242210
1123.5 95242210 95022057 94636391 94680122 95218864 95660652 95800156 95154053 94989326 95235100 95570557
1133.2 95570557 95738258 96020393 96515221 96844643 97175499 96723541 97127502 97227173 95960587 95708389
1142.8I5708389P06337P67159k98157l75015J3031K1454n0148l10936Q7822k74544
1152.5I5995392k62322L0251R89761J026551m69094J53130P03163L46428l20404m7211
1162.1I8145645R7054m99359m26896p12379L66119P47177j03782n03914K33498R25033
1171.8I8268196k03697K16400l93097q20450M44657K55928M88907j96885q43978Q2481
1181.4I7298462R48593L73283r70001q31848J91467J395943R03496m05564o91810n28954
1191I7683067j97418m4884M07463L06481n3909K82615M77730k78999n10880L00392
1200.7I8371658K88925J58074n2780l55973l41964K19009P78130o8383k65563k26601
1210.3I8504532p55364K17225J016708J47118n00931o75965j72905N92392J41411n5672
$$ plain form
1142.8 95708389 96414726 97181885 96883728 96508713 96521744 96543198 96493050 96182114 96269936 95995392
1152.5 95995392 95733070 95763321 96753082 97779633 97310539 97463669 98166832 98513260 98192856 98145645
1162.1 98145645 98242699 97743340 97316444 96604065 96970184 97717361 97613579 97109665 97343163 98268196
1171.8 98268196 98064499 98280899 97887802 97067352 97512009 97767937 98256844 98059959 97215981 97298462
1181.4 97298462 98247055 98620338 97650337 96818489 97009956 98405899 99309395 98903831 98212021 97683067
1191 97683067 97485649 97440765 97848228 98154709 98100800 98383415 98861145 98582146 98071266 98371658
1200.7 98371658 98660583 98818657 98765877 98409904 98067940 98286949 99065079 98996696 98731133 98504532
1210.3 98504532 97749168 97966393 98983101 99130219 98629288 97953323 97780418 98372810 98514221 98458549
1220I8458549l29505k16835L66355o4743j72798l07777J13922J73759M3976N03968
1229.6I8568871j98189k35543j69334J32134K34191l17840K00012k41653j86531L18298
1239.3I8104416j32538m3854j92070l75541k5757R1888l00499l07953j38832K0546
1248.9I6699806o2095o08254m11011p02613p57378j14166p15477q60825m27605m79614
1258.5I1560768o32904o25313n5336L72216Q08914O43104K27989P23557Q76556O54168
1268.2I4553719N58418K61780K88543J80344K26120N92163K08702k5741K50633J57081
1277.8I7251762q4480J81213J96030J26793K36092j11489K6490N9036J86157K31293
1287.5I8298897k85973o1699K2171K28058J85074k01294l06503l00263M91539N24536
$$ plain form
1220 98458549 98129044 97912209 98278564 98213821 98041023 97733246 97847168 98020927 98064903 98568871
1229.6 98568871 98370682 98135139 97965805 98097939 98332130 98014290 98214302 97972649 97786118 98104416
1239.3 98104416 97971878 97928024 97735954 97360413 97334656 97426544 97126045 96818092 96679260 96699806
1248.9 96699806 96637711 96029457 95618446 94915833 94158455 94044289 93328812 92467987 92040382 91560768
1258.5 91560768 90927864 90302551 90247215 90619431 91428345 92071449 92299438 93022995 93899551 94553719
1268.2 94553719 95112137 95373917 95662460 95842804 96068924 96661087 96869789 96844048 97094681 97251762
1277.8 97251762 97167282 97348495 97544525 97671318 97907410 97795921 97822411 97881447 98067604 98298897
1287.5 98298897 98012924 97951225 97973396 98201454 98386528 98185234 97878731 97578468 98070007 98594543
1297.1I8594543J1902j75346k27066K92625L08365q9165j88949n814P1350K6230q5502
1307.7I8533173j54320K39570K84195k3239J3771J46851j31332k96296M8912K51839
1317.4I8913124j29463m95354j18316L64212M15886P7636M3938m4060j81679K32590
1327I9078514j9493P9750K47459k78625k41966q2215J73935P5936q6792l8353L1486
1337.6I8939636K91886R5214r7984n14786m78386N0003K81182K73102L349R7359K37342
1348.2I9177917J42823m7547l19069l39157m8301L95050J15112k28470K9167Q3275
1357.9I8960800J06453M700k58209p0748K28157k43332m29451j86004k15088j29837
1367.5I7767441L52485J14129k34681N41047O29150k3628l04497l72505j02280J09909
$$ plain form
1297.1 98594543 98606445 98431099 98204033 98496658 98805023 98715858 98526909 98521095 98592445 98618675 98533173
1307.7 98533173 98378853 98618423 98902618 98879379 98893150 99040001 98908669 98612373 98661285 98913124
1317.4 98913124 98783661 98288307 98169991 98534203 98950089 99027725 99071663 99027603 98845924 99078514
1327 99078514 99059021 99138771 99386230 99107605 98865639 98783424 98957359 99033295 98946503 98908150 98939636
1337.6 98939636 99231522 99326736 99228752 98713966 98235580 98285583 98566765 98839867 98843216 98940575 99177917
1348.2 99177917 99320740 99273193 98954124 98614967 98566666 98961716 99076828 98848358 98877525 98960800
1357.9 98960800 99067253 99071953 98813744 98742996 98971153 98727821 98298370 98112366 97897278 97767441
1367.5 97767441 98119926 98234055 97999374 98540421 99169571 99145943 98841446 98468941 98366661 98476570
1377.2I8476570p6332k54845J07743K91923J37474q5495j87278P8605j14227m03961
1386.8I7970177j19026L05656L31947k3048m50432o6574O73683n1308r96337J72180
1396.4I7746918J72714q972M12880J99295j27594q4183J71455K95517l23440r00299
1406.1I7554291o2454Q84231N55153n18051m52408K79434K98119k08077j87896J75430
1415.7I8317772J91315r545n05111J19178O40885m8912k63153n82695N9402L00888
1425.4I8220024j06773k19956m7043O79200M59343J20819K8534n87921l47596J09680
1435I8308311P2808m28086K69875J47728O622K60277n6785j40511r2804o7657l41210
1445.6I7938568l13751N78262K74712l66623j99341J66687O47698J82899j10222j11473
$$ plain form
1377.2 98476570 98400238 98145393 98253136 98545059 98682533 98597038 98409760 98488365 98374138 97970177
1386.8 97970177 97851151 98156807 98488754 98465706 98015274 97948700 98622383 98571075 97574738 97746918
1396.4 97746918 97919632 97910660 98323540 98522835 98395241 98311058 98482513 98778030 98454590 97554291
1406.1 97554291 97491837 98376068 98931221 98413170 97960762 98240196 98538315 98330238 98142342 98317772
1415.7 98317772 98509087 98499542 97994431 98113609 98754494 98705582 98442429 97859734 97919136 98220024
1425.4 98220024 98113251 97893295 97846252 98525452 98984795 99105614 99134148 98546227 98198631 98308311
1435 98308311 98381119 97953033 98222908 98370636 98377258 98637535 98580750 98440239 98347435 98279778 97938568
1445.6 97938568 97624817 98203079 98477791 98111168 97911827 98078514 98726212 98909111 98798889 98687416
1455.3I8687416q23280r58809O33156M79309K29782n6099r2537k36511l69774K10709
1464.9I7703362Q3442r590J57631k1172L45223L78227m68437j334869L20358Q51234
1474.6I8005409K33414l03627O8382N80361J35620j16967J82915j83151k94159R4025
1484.2I8402222K29988o4018k61269R5367J88156n9272N90149L21258l89526k94182
1493.8I8758873j39603r7892P53814K81723m11979m5845M18006Q4534m4700j68229
1503.5I9388702j58218N28458J209503n93338j257843o11763L3821M89166N79437j37710
1513.1I9470215k98294N5435O51909R25873r56154n54535M4472m47403k90718O45103
1522.8I9245903j54633j31706M2626P9261L98316K86651l7582j39000j10100L2303
$$ plain form
1455.3 98687416 97864136 96905327 97538483 98017792 98247574 98191475 98098938 97862427 97492653 97703362
1464.9 97703362 97786804 97777214 97934845 97913673 98258896 98637123 98168686 96833817 97154175 98005409
1474.6 98005409 98238823 97935196 98003578 98583939 98719559 98602592 98785507 98602356 98308197 98402222
1484.2 98402222 98632210 98568192 98306923 98402290 98590446 98531174 99121323 99442581 99053055 98758873
1493.8 98758873 98619270 98521378 99275192 99556915 99144936 99099091 99517097 99601631 99556931 99388702
1503.5 99388702 99230484 99758942 100968445 100375107 99117264 98505501 98539322 99028488 99607925 99470215
1513.1 99470215 99171921 99227356 99879265 100805138 99848984 99294449 99338921 98891518 98600800 99245903
1522.8 99245903 99091270 98959564 99002190 99081451 99479767 99766418 99728836 99589836 99479736 99512039
1532.4I9512039R7878L64052j63094m63760k34398L66943J490936j632896j428085
1541.1I7909615J5205J006287O13700k67677l95294J43990Q3663Q851K51785O59759
1550.7A00029884l0227l15583k31514q1398K58484l30734j212822j617233J158912
1559.4I7627769K133156L85941J87324l83270p35519k18720J91864O0509j13632n2536
1569.1I9082886j12534J62285J17271j42791J94069L19641m85871p82028O12145M04083
1578.7I9369156L01071m1359l94318q5182P0137o5834j20918N5695K37464K43859P9422
1589.3I9649193k69707k86140j02394K37381K90191j98044m23072M1770N62981K16889
1599I9719048k61338m55406j1932L51448j1421K6512q7616J01204K37716m4624O3393
$$ plain form
1532.4 99512039 99609917 99973969 99810875 99347115 99112717 99479660 100970596 99337700 97909615
1541.1 97909615 97924820 98931107 99544807 99277130 98881836 99025826 99109489 99118340 99370125 100029884
1550.7 100029884 99999657 99684074 99452560 99371162 99629646 99298912 98086090 96468857 97627769
1559.4 97627769 99760925 100146866 100334190 99950920 99215401 98996681 99188545 99249054 99135422 99082886
1569.1 99082886 98970352 99132637 99249908 99107117 99301186 99620827 99134956 98352928 98965073 99369156
1578.7 99369156 99670227 99628868 99234550 99149368 99219505 99153671 99032753 99088448 99325912 99569771 99649193
1589.3 99649193 99379486 99093346 98990952 99228333 99518524 99320480 98897408 98939178 99502159 99719048
1599 99719048 99457710 99002304 98990372 99341820 99330399 99356911 99269295 99370499 99608215 99563591 99626984
1609.6I9626984j43578M5792Q6105j14548j67320k08549N77133M97642p58133k37182
1619.2I9204346L3081j07102j09749j13822O9419M56726J28624k53189k84622K61231
1628.9I9284943K89375J57288O5223k43210k08389M61746J053376r97078k41234K8572
1638.5I9650612j13213Q789j37870q9982p202Q0246r0347j14639J079643k09167m40247
1649.1I9616623l12363n13008k53021O27533K118263j482345n58365K71675L78471
1657.8I9893463j51245n62004j47049o2897l78441p461N05455N60013R7023k24541
1667.4I9522316n13245m47517N91164K39959j59103p6729r8076l63769O39442L72009
1677.1I9706451j96014j55777Q1383J63452R7206k63405j135696J56257M91509R3056
$$ plain form
1609.6 99626984 99483406 99529198 99615303 99500755 99333435 99124886 99702019 100199661 99441528 99204346
1619.2 99204346 99237427 99130325 99020576 98906754 98976173 99432899 99561523 99308334 99023712 99284943
1628.9 99284943 99574318 99731606 99796829 99553619 99345230 99806976 100860352 99863274 99622040 99650612
1638.5 99650612 99537399 99546188 99408318 99318336 99311134 99391380 99301033 99186394 100266037 100056870 99616623
1649.1 99616623 99304260 98791252 98538231 99165764 101284027 99801682 99243317 99514992 99893463
1657.8 99893463 99742218 99180214 99033165 98970268 98591827 98584366 99089821 99649834 99746857 99522316
1667.4 99522316 99009071 98561554 99152718 99392677 99233574 99156845 99058769 98695000 99334442 99706451
1677.1 99706451 99510437 99354660 99436043 99599495 99696701 99433296 98297600 98453857 98945366 99038422
1686.7I9038422o4843J03829M56344j56700j71806K40280M0238r4925j90026o54289
1696.4I8546524K27898J8898m03542N51170j31896J48918N14785j47621q5434J02158
1706I9341858J58249J22413l59207k60338L4417J13418m4769j96762l13172j97868
1715.6I8398239J01509M7440J46744j95481J98090L36571k28112m21905p2693K78206
1725.3I8588608j5877k29370k00890k93266K37785M8386l79906m53163k17598J365509
1734.9I8450218j03149j31951m2854k49626M8553L1563Q0818k021l34420K12311M70223
1745.5I8429665M08546q8539k20734L04627P4157k84400K96150M69742m0711j36886
1755.2I9211617J15211J62071K8214l05443j19476L56285L15284j04667M6104j26449
$$ plain form
1686.7 99038422 98973579 99077408 99533752 99377052 99205246 99445526 99485764 99390839 99200813 98546524
1696.4 98546524 98774422 98793320 98389778 98940948 98809052 98957970 99472755 99325134 99239700 99341858
1706 99341858 99500107 99622520 99263313 99002975 99037392 99150810 99106041 98909279 98596107 98398239
1715.6 98398239 98499748 98547188 98693932 98498451 98696541 99033112 98805000 98383095 98310402 98588608
1725.3 98588608 98572731 98343361 98142471 97849205 98086990 98135376 97755470 97302307 97084709 98450218
1734.9 98450218 98347069 98215118 98172264 97922638 97971191 98002754 98083572 98081551 97747131 97959442 98429665
1745.5 98429665 98838211 98749672 98528938 98833565 98907722 98623322 98919472 99389214 99348503 99211617
1755.2 99211617 99326828 99488899 99517113 99211670 99092194 99448479 99763763 99659096 99705200 99578751
1764.8I9578751j89400K04758M8172j76514n509o8275K60628L87848l35755l62816
1774.5I9341888l06083L00537N04486o1691j26877L8009j38694J90414Q9569j88988
1784.1I9642570J8288N0743p8483J43135k0218l53035O3278l8765Q2016N91812O0692
1794.7A00162033P3387l24203m55185N3840L74474J84875j03477j747R445J51672P325
1805.3A00132439l71926j96922O9740J38893K28875J40670k58003k36679j60019M6669
1815I9533737K45468j22383k136L36357J31653j92268m4396L56232j07453o43699k12258
1825.6I9278854O85883M15459j56548n79918n18158N53978M31267k21893j74263q629
1835.2I9706032j5785K33368O2614j39732P4203O8672l364k13776j78612M38332j07086
$$ plain form
1764.8 99578751 99389351 99594109 99642281 99465767 99460258 99391983 99652611 100040459 99704704 99341888
1774.5 99341888 99035805 99336342 99840828 99779137 99652260 99690269 99551575 99741989 99831558 99642570
1784.1 99642570 99660858 99711601 99633118 99776253 99756035 99403000 99466278 99427513 99509529 100101341 100162033
1794.7 100162033 100235420 99911217 99456032 99509872 99884346 100069221 99965744 99963997 99973442 100125114 100132439
1805.3 100132439 99760513 99563591 99633331 99772224 100001099 100141769 99883766 99647087 99487068 99533737
1815 99533737 99779205 99656822 99654686 99991043 100122696 99930428 99886032 100242264 100134811 99491112 99278854
1825.6 99278854 99964737 100380196 100223648 99643730 99125572 99679550 100110817 99888924 99714661 99706032
1835.2 99706032 99690247 99923615 99986229 99846497 99920700 99989372 99986008 99772232 99593620 100031952 99924866
1845.8I9924866j92627m1641j78444L7063K79946k7131j57356J70342J95106J3268
1855.5A00023392j75415k3094J35932k0225K5825K5116k7244m0665K6901j24176k40104
1866.1I9586243L4301L6538J79672R2338j09382M4121K479o6582p8132K29835L72628
1876.7A00324059k19681n29656l3371L30185K84195J43738j26602j44303m0947L8521
1886.3A00026138k7580k37007k23702k9480J92353L44261J47980k12921K45368K62444
1896A00487854m48074k41242J4557J92467N5900k51793o0791k3475M8691J11564K20154
1906.6A00105812O3629k27592j17226p7141J64666K5550j01051J23650M5578K7214
1916.2A00033089j8341j74248m1123l1913j19568K86186M00787k16598l08907j13166
$$ plain form
1845.8 99924866 99732239 99690598 99512154 99549217 99829163 99802032 99644676 99815018 100010124 100023392
1855.5 100023392 99847977 99824883 99960815 99940590 99966415 99991531 99964287 99923622 99950523 99826347 99586243
1866.1 99586243 99620544 99657082 99836754 99929092 99819710 99863831 99866310 99799728 99721596 99951431 100324059
1876.7 100324059 100104378 99574722 99541351 99871536 100155731 100299469 100172867 100028564 99987617 100026138
1886.3 100026138 99998558 99761551 99537849 99508369 99700722 100044983 100192963 99980042 100225410 100487854
1896 100487854 100039780 99798538 99813095 100005562 100061462 99809669 99748878 99725403 99774094 99885658 100105812
1906.6 100105812 100169441 99941849 99824623 99747482 99912148 99937698 99836647 99960297 100005875 100033089
1916.2 100033089 100014748 99840500 99799377 99767464 99647896 99934082 100334869 100118271 99809364 99696198
1925.9I9696198M47357K92854m90067k70744Q1032J73317L19420k26227n16945J08139
1935.5I9614334J91757M4396M2434j34368j5854o7696q7997J47041l1281r2018J74645
1946.1I9785393J29715j26877K0897J52977P6629k06192k25746K08504K26326j98822
1955.8I9842804k19765J81313m944j83151n3719K0432K22885J65146J76414k06161
1965.4I9941254m29108O6376K51312K03682m6516l7972M1870J6571l0258j24565J04256
1976I9956902M2190J24947N7930k12258m1877k4430O7185N4535j07L4530k3750L761
1987.6A00039558p0846r987O5613j83480l04283J03539L05061Q2909j08345J68617
1997.2A00088356J54022j34117N2712m0291n5031r1515j38160K45987J74781l5682
$$ plain form
1925.9 99696198 100143555 100436409 99946342 99675598 99756630 99929947 100249367 100023140 99506195 99614334
1935.5 99614334 99806091 99850487 99892921 99758553 99742699 99675003 99587006 99734047 99702766 99610748 99785393
1946.1 99785393 99915108 99788231 99809128 99962105 100038734 99832542 99606796 99815300 100041626 99842804
1955.8 99842804 99623039 99804352 99799408 99616257 99562538 99582970 99805855 99971001 100147415 99941254
1965.4 99941254 99512146 99578522 99829834 100033516 99987000 99949028 99990898 100007469 99977211 99852646 99956902
1976 99956902 99999092 100124039 100181969 99969711 99927834 99903404 99970589 100025124 100025017 100059547 100035797 100039558
1987.6 100039558 99968712 99958725 100024338 99840858 99536575 99640114 99945175 100028084 99919739 100088356
1997.2 100088356 100242378 100108261 100160973 100120682 100065651 99974136 99835976 100081963 100256744 100221062
2006.9A00221062l22579j27762L54119J80809p4059j64299M830q2260j27663k983K07237
2017.5A00066452K28081l26500r4185K30179J56555K2324j72532m2854n3467J2337
2027.1A00026390j67862j56204J01807Q2534J36978j16401n158O6185k7824K12669
2036.8A00153114L1k86057k28050K03919L38516j11916l29841m8623L55751J67450
2046.4A00214294j49841j47011K9122M1809j44409P3120J01333j67526J06270K36183
2056.1A00193344o6635j86981j56075J73668K1858l64860M1061M9713j16325n6908
2065.7I9531860m005L60184L22921K2362q8806r850p2090k43934j8723R9388J21758
2076.3A00021065M9316r4467K0508Q8501Q7227n806n905N7617p6264l5476O5651j16135
$$ plain form
2006.9 100221062 99898483 99770721 100124840 100305649 100231590 100067291 100072121 99989861 99862198 99859215 100066452
2017.5 100066452 100294533 99968033 99873848 100104027 100260582 100282906 100110374 100067520 100014053 100026390
2027.1 100026390 99858528 99702324 99804131 99886665 100023643 99907242 99902084 99968269 99940445 100153114
2036.8 100153114 100153145 99867088 99639038 99842957 100181473 100069557 99739716 99691093 100046844 100214294
2046.4 100214294 100064453 99917442 99946564 99988373 99843964 99917084 100018417 99850891 99957161 100193344
2056.1 100193344 100126709 99939728 99783653 99957321 99979179 99614319 99655380 99705093 99588768 99531860
2065.7 99531860 99527855 99888039 100210960 100233322 100144516 100134666 100062576 99818642 99799919 99899307 100021065
2076.3 100021065 100070381 99975914 99996422 100084923 100172150 100166344 100160439 100218056 100141792 100106316 100171967 100055832
2087.9A00055832k22015K0492J84303J3222r4177N1185K79580K87742j25633l98575
2097.5A00051956j35338k4330j32217O2218K80105K20520m2992k29843j94137n7053
2107.2I9798889J51169J49559N0194K7588L0792J29784j28197k70989O3454K72636
2116.8A00274879J05744l55583k10793J20278N9867J00647l5446r6077K0355J94001
2126.5A00177872R7664j46187J15188J8509k41256p561K64465J73737l06748l11302
2136.1I9834381R0065J36559j43204j45805J45866J6106q4504J2085R774J10382N8403
2146.7A00040108M5196L9955j25084l4172R2347J54655P4463r3483l0876q1658n8296
2157.3A00023155J47423J65459n3391l44948k26333P3143J88423L11348K02431j70327
$$ plain form
2087.9 100055832 99833817 99854309 100038612 100051834 99957657 100008842 100288422 100576164 100450531 100051956
2097.5 100051956 99916618 99892288 99760071 99822289 100102394 100322914 100279922 100050079 99855942 99798889
2107.2 99798889 99950058 100099617 100149811 100177399 100208191 100337975 100209778 99938789 100002243 100274879
2116.8 100274879 100380623 100025040 99814247 99934525 99994392 100095039 100059593 99963516 99983871 100177872
2126.5 100177872 100275536 100129349 100244537 100263046 100021790 100014229 100278694 100452431 100145683 99834381
2136.1 99834381 99924446 100061005 99917801 99771996 99917862 99933968 99849464 99861549 99871323 99981705 100040108
2146.7 100040108 100085304 100125259 100000175 99966003 100058350 100213005 100287468 100193985 100163109 100081451 100023155
2157.3 100023155 100170578 100336037 100282646 99937698 99711365 99784508 99972931 100284279 100486710 100316383
2167A00316383k04292m8653m5295O9809l9666k06642L4546J50658P2288Q2535n348
2177.6A00176323j21407M5380L2936k09877p2845J54144J38542Q5411O859k23015j59111
2188.2I9853340K23305K26082m8035l7765R23n8640J35727m1679j72982O7986l1799
2198.8A00116463J0521k5498p377J57440L158j81541k82318K5955K98309K48116m5014
2209.4A00318214j97815j3771l8368N9807o6139j62438p1785k9647K43301K2797j22467
2220I9941689J06178K25128N1430j67435O7085Q1826l2830j4496J4672q4954n5465
2230.6A00132828J50619j50032k75833j12701Q1550K32231J16333K4849q3778L4714
2240.3A00150780k8298k30117M0161J90124R5131J07788p1495k35237P0587K8832j33782
$$ plain form
2167 100316383 100112091 100063438 100018143 100087952 100048286 99841644 99876190 100026848 100099136 100181671 100176323
2177.6 100176323 100054916 100100296 100133232 99923355 99850510 100004654 100143196 100228607 100235466 100012451 99853340
2188.2 99853340 100076645 100302727 100254692 100216927 100217850 100159210 100294937 100253258 100080276 100148262 100116463
2198.8 100116463 100126984 100101486 100094109 100251549 100254707 100073166 99790848 99816803 100115112 100363228 100318214
2209.4 100318214 100120399 100106628 100068260 100128067 100061928 99899490 99827705 99798058 100041359 100064156 99941689
2220 99941689 100047867 100272995 100324425 100156990 100224075 100305901 100273071 100258575 100273247 100188293 100132828
2230.6 100132828 100283447 100133415 99857582 99744881 99826431 100058662 100174995 100199844 100116066 100150780
2240.3 100150780 100122482 99892365 99932526 100122650 100217781 100325569 100254074 100018837 100089424 100118256 99984474
2250.9I9984474K9061l1174r400P1709J52039O9450j58997J7830J41167j85936k13821
2261.5I9866402J80366J25389L6606J58424J4420j57822k68180j13015K19597K56020
2271.1A00318207p0183j85234K1446M5868k6344j03798o3301J2764R0049K55913J31798
2281.7A00427185j41998k68654j14388K87712K91016j37428l07938j33652J77247J67350
2291.4A00246452l5156J4534r0050k9289J20293N7457M9789j07368k01065o0654K38068
2302A00203011J20117j33003l2967j49750n3512R4352r636j41227j33919M8599R5154
2312.6I9907219L12912K52747m6090j75804k42920j96441j02684J90223j40396n25101
2322.2I9233665n8731M27155O60049K88422o20575n72044N35194O14189R7199k83814
$$ plain form
2250.9 99984474 100013535 99982361 99972961 100044670 100196709 100266159 100107162 100124992 100266159 100080223 99866402
2261.5 99866402 100046768 100172157 100208763 100367187 100381607 100223785 99955605 99842590 100062187 100318207
2271.1 100318207 100248024 100062790 100084236 100130104 100103760 99999962 99936661 99949425 100039474 100295387 100427185
2281.7 100427185 100285187 100016533 99902145 100189857 100480873 100343445 100035507 99901855 100079102 100246452
2291.4 100246452 100211296 100225830 100135780 100106491 100226784 100284241 100334030 100226662 100025597 99964943 100203011
2302 100203011 100323128 100190125 100157158 100007408 99953896 100048248 100038612 99897385 99763466 99812065 99907219
2312.6 99907219 100220131 100472878 100426788 100250984 100008064 99811623 99708939 99899162 99758766 99233665
2322.2 99233665 99174934 99602089 100262138 100550560 99929985 99357941 99893135 100507324 100604523 100320709
2331.9A00320709n21858l7018j2680n3108j9112o3713J22467J7876J05843K51838Q7586
2342.5A00198830k01638l50967l80409m5502N06592L77289j75019n70282k39891M60778
2352.1I9579781K61253N2177K85889k54570n45013k24495n3276K57125J63125L20846
2361.8I9842842j54289K7580Q82431L00507J50306q94111q99979L21190L47649L85627
2371.4A00309753j82800j10939K52083k411j22795j1154L81752K1866j98342j14853
2381.1A00222160k87071j8875J88705K90894K1217l01300Q2123J44417j11031j79863
2390.7A00051376k04261O1164K92580J1261k35931O2614K04285O5696O1974l3050K1080
2401.3A00358788l5004k09877p7027J28815K40677j03119q7562P1914k43454m7004
$$ plain form
2331.9 100320709 99798851 99761833 99749153 99696045 99676933 99613220 99735687 99753563 99859406 100111244 100198830
2342.5 100198830 99997192 99646225 99265816 99220314 99726906 100104195 99929176 99358894 99119003 99579781
2352.1 99579781 99841034 99893211 100179100 99924530 99379517 99155022 99101746 99358871 99521996 99842842
2361.8 99842842 99688553 99716133 100598564 100899071 101049377 100155266 99255287 99576477 99924126 100309753
2371.4 100309753 100126953 100016014 100268097 100265686 100142891 100131737 100513489 100535355 100337013 100222160
2381.1 100222160 99935089 99916214 100104919 100395813 100417030 100115730 100197853 100342270 100231239 100051376
2390.7 100051376 99847115 99908279 100200859 100212120 99976189 100038803 100243088 100308784 100370758 100337708 100358788
2401.3 100358788 100323784 100113907 100036880 100165695 100406372 100303253 100215691 100287605 100044151 99997147
2410.9I9997147J67656K12799l8559j76056K16346K05796N4764l19733k12753J54525
2420.6A00261932n5801Q9043P4302j20514j11991j25870j67290L5912L37684Q9806
2430.2A00307213r7099j00113r743Q7768J96839K30308k21710j78924j4954j54770
2439.9A00044815L685J37215J81953R0004j61377k77016n3741K37076K19925j29158
2449.5A00293381j33057J95244J33003l6117k39640j75903R4749J79619N0492k44812
2459.2A00116959j30158P7027K15927R5688j69991M631J30501L7559j22284n7022J0849
2469.8A00209686L4935K2293j21498m1298J885K01408J4031k85508M8966J70776K42546
2480.4A00498222K26082j17981l31428J4564K46903m7509j42128k03018j52K16476
$$ plain form
2410.9 99997147 100164803 100377602 100339043 100162987 100379333 100585129 100639893 100320160 100107407 100261932
2420.6 100261932 100206131 100295174 100369476 100248962 100136971 100011101 99843811 99879723 100217407 100307213
2430.2 100307213 100210114 100110001 100100258 100188026 100384865 100615173 100393463 100214539 100199585 100044815
2439.9 100044815 100048500 100185715 100367668 100457672 100296295 100019279 99965538 100202614 100422539 100293381
2449.5 100293381 100160324 100355568 100488571 100452454 100212814 100036911 100131660 100311279 100361771 100116959
2459.2 100116959 99986801 100063828 100279755 100375443 100205452 100210083 100340584 100378143 100255859 100198837 100209686
2469.8 100209686 100244621 100266914 100145416 100104118 100106003 100307411 100321442 100035934 100084900 100255676 100498222
2480.4 100498222 100724304 100606323 100274895 100289459 100536362 100488853 100346725 100143707 100143555 100360031
2490A00360031K8824j01105q5922j7426r2704o7589L5187P2715O9832P4761R4246n7091
2501.6A00313759o1249J59393J26282j79230j06277j1177n5725J4343o1974L1617l1487
2512.2A00138275l5293L9306k7839J71051J55685M7050k2193p1030j75766q62K35954
2522.8A00454338j46423j00251M5960M1939J13258M006O9259n6434j82122j25320J5404
2533.4A00133614J09558J73935O1226k55181m3785O0448J00563P3311j95755l74O1645
2544A00279205N3048R4909O439m7790m8271M4006r2155o6468J12175N1171K6794K4086
2555.6A00437149n0957j823J08246m3869j29189m3274j03439m2618P4700J02539K75375
2566.2A00582840J17401k62733j55991N6366M3602j37436j29143J8021k2186J04141
$$ plain form
2490 100360031 100388855 100287750 100201828 100184402 100091698 100024109 100059296 100132011 100201843 100276604 100370850 100313759
2501.6 100313759 100252510 100411903 100538185 100358955 100252678 100241501 100185776 100200119 100138145 100169762 100138275
2512.2 100138275 100102982 100142288 100114449 100285500 100441185 100488235 100466042 100395012 100219246 100218384 100454338
2522.8 100454338 100307915 100207664 100253624 100295563 100408821 100412827 100482086 100425652 100243530 100118210 100133614
2533.4 100133614 100243172 100417107 100478333 100223152 100179367 100239815 100340378 100413689 100217934 100217560 100279205
2544 100279205 100332253 100427162 100433601 100385811 100337540 100381546 100289391 100222923 100335098 100386269 100413063 100437149
2555.6 100437149 100386192 100384369 100492615 100448746 100319557 100276283 100172844 100130226 100204926 100307465 100582840
2566.2 100582840 100700241 100437508 100281517 100337883 100381485 100244049 100114906 100132927 100110741 100214882
2575.9A00214882J76193L6362n9197n5923N951J05209N8190j66275o7414J53084J31660
2586.5A00532722j39854j20422J77757L8925j12938j61720m7905K4376r0462J33225
2596.1A00233704K36580J7433j58638l1327R1523R7427R2079m9499j34949k07520L2219
2606.7A00219032J48339l3745o8108n1880J06278J7204m9599k7397m0268K6062N4077
2617.3A00299995L35358J79321l13140k97020Q377N5397o0288q5579j64825J13167
2627A00070763K74765Q0093p1083p5569P8171L1997J71425K1767l52318k02652N5618
2637.6A00082977J88271q659l2998j1650m2373J06033q5892m761K31965l1876k57431
2648.2A00133606N3741K58332j10222k37145l3630J88118J22292q9249O576r1239j87233
$$ plain form
2575.9 100214882 100391075 100427437 100368240 100312317 100318268 100423477 100481667 100315392 100247978 100401062 100532722
2586.5 100532722 100392868 100272446 100450203 100489128 100376190 100214470 100166565 100190941 100100479 100233704
2596.1 100233704 100470284 100487717 100329079 100297752 100389275 100486702 100578781 100529282 100394333 100186813 100219032
2606.7 100219032 100367371 100333626 100265518 100213638 100319916 100337120 100287521 100260124 100219856 100245918 100299995
2617.3 100299995 100635353 100814674 100501534 100204514 100212891 100268288 100208000 100122421 99957596 100070763
2627 100070763 100345528 100425621 100354538 100278969 100357140 100389137 100560562 100582329 100230011 100027359 100082977
2637.6 100082977 100271248 100262589 100229591 100217941 100175568 100281601 100195709 100190948 100422913 100391037 100133606
2648.2 100133606 100187347 100445679 100335457 100098312 100064682 100252800 100375092 100285843 100292419 100201180 100013947
2658.8A00013947o79K22625K49726j061o462P141o3248j06391j71677R9762J33232
2669.4A00376915m1275q3206o7818J55815n409j31043P6272J27761L0877k13677j32233
2680A00092979O8253J66313J84128k8809j64955j07979J67191J09039j18530q7555
2689.6A00280075j01349J50475L16475L769k62047j44135J07735L7208j46881j26266
2699.3A00115059J2955J61728J6304j31157L7437Q9088K55715J0376l49823Q6380Q3847
2709.9A00387909q0811l9962K830J49651q1932k07940k14729J04935L77037P5409k40769
2720.5A00231628k70454J18713R3277N2086J64620K975k5383l9772R0508j98304k74185
2731.1I9945709J49513J73424L9299j23115j244N8075J85242Q4793l31803K0531K45560
$$ plain form
2658.8 100013947 100013268 100235893 100485619 100484558 100478096 100485237 100421989 100315598 100143921 100243683 100376915
2669.4 100376915 100335640 100252434 100184616 100340431 100335022 100203979 100280251 100408012 100438889 100225212 100092979
2680 100092979 100161232 100327545 100511673 100482864 100317909 100209930 100377121 100486160 100367630 100280075
2689.6 100280075 100178726 100329201 100645676 100649445 100387398 100243263 100350998 100388206 100241325 100115059
2699.3 100115059 100128014 100289742 100306046 100174889 100212326 100301414 100557129 100567505 100217682 100304062 100387909
2709.9 100387909 100307098 100267136 100269966 100419617 100337685 100129745 99915016 100019951 100396988 100472397 100231628
2720.5 100231628 99961174 100079887 100173164 100225250 100389870 100392845 100367462 100327690 100418198 100219894 99945709
2731.1 99945709 100095222 100268646 100307945 100184830 100183586 100241661 100426903 100511696 100179893 100200424 100445984
2741.7A00445984L4271j75934j22291N6694p3448j15662k5246K11426R0523q0269O6124
2752.3A00312172M65Q8738L0510r7687K235j51649j69945J17737P0580j63460j8433
2762.9A00021263K32620K60674O0432j74911j81137O4537R6100j72890q3138N5375
2772.6A00178925J4923R773K6733J63895L2837k85507k46178J03912J52695m4258L2455
2783.2A00140205q4144j84471R8175K31666K11998M9774o7291R201l9787q9897j60668
2793.8A00114761o8573J42693M2297m7165p1014l4462o7657o5674K13211J77658L4904
2804.4A00370979k7336j18179j61095j55983m9309m3609O7650M4105N4573K18170N9266
2815A00259232k6177j71226j44188J07322N5664m8744j15288o3690Q0437L6194k04338
$$ plain form
2741.7 100445984 100480255 100304321 100182030 100238724 100165276 100049614 100024368 100235794 100326317 100246048 100312172
2752.3 100312172 100312637 100401375 100431885 100334198 100336433 100184784 100014839 100132576 100203156 100039696 100021263
2762.9 100021263 100253883 100514557 100574989 100400078 100218941 100283478 100379578 100206688 100123550 100178925
2772.6 100178925 100193848 100203621 100230354 100394249 100427086 100141579 99895401 99999313 100152008 100107750 100140205
2783.2 100140205 100056061 99871590 99969765 100201431 100413429 100463203 100395912 100405113 100365326 100275429 100114761
2793.8 100114761 100046188 100188881 100231178 100184013 100112999 100078537 100010880 99945206 100158417 100336075 100370979
2804.4 100370979 100343643 100225464 100064369 99908386 99859077 99815468 99883118 99927223 99981796 100199966 100259232
2815 100259232 100233055 100061829 99917641 100024963 100080627 100031883 99916595 99852905 99933342 99969536 99765198
2825.6I9765198o4537J43860M8950J05888O317n0216j58333k63863j4839N4817R1843
2836.2I9665085m5746j73836j10336j06934J73844K52807j14669m34998k55272R1347
2845.9I8941292M1229o5918k02392k93526j67267J53603K48169j51917k75459j36719
2855.5I8091095J55861K64374j49163j35887q24P5096J34697o6536P3037Q346l075
2866.1I8447021K39342L1861q4282r0012J0475J34789M7821j73729j93283J05720K2385
2876.7I8498108J16310K38167k1050o7520k05284m2213J80702q0452j26541m1847j52756
2887.3I8295624n2101N1002j38351m6509r4231j75468K03995J93039j45684l24981
2897I7766335j39184J11718O9717l0975j22788Q560l7689k92267j47300J03622Q2070
$$ plain form
2825.6 99765198 99700661 99844521 99893471 99999359 100005676 99955460 99797127 99533264 99518425 99573242 99665085
2836.2 99665085 99619339 99445503 99335167 99228233 99402077 99654884 99540215 99105217 98849945 98941292
2845.9 98941292 98982521 98916603 98714211 98420685 98253418 98407021 98655190 98503273 98227814 98091095
2855.5 98091095 98246956 98511330 98362167 98226280 98225456 98300552 98435249 98368713 98441750 98450096 98447021
2866.1 98447021 98686363 98718224 98633942 98543930 98554405 98689194 98737015 98563286 98370003 98475723 98498108
2876.7 98498108 98614418 98852585 98831535 98764015 98558731 98516518 98697220 98616768 98490227 98448380 98295624
2887.3 98295624 98243523 98294525 98156174 98109665 98015434 97839966 98043961 98237000 98091316 97766335
2897 97766335 97627151 97738869 97808586 97777611 97654823 97663383 97625694 97333427 97186127 97289749 97371819
2907.6I7371819n4116Q3237K35847j8722l28354k61353K4193M6143j01311q2786p0084
2918.2I6844513j06804O9595J00823k43683k23480j7067N554K02751L9787q6387P8308
2928.8I6663910r9083q179K7947j08742P2784K36741J87339N4039J31234m3129q0758
2939.4I7034103R3697k7611J7464j35666j05919P7713N2750L4088l13957j57235L04337
2950I6873764J90071j62872l15674l67676m22745j29547j20483k21832r3903j93550
2959.7I5035553j32759o9542Q1581K90863P6477O1852J84105k5788O0547K67342J52130
2970.3I5982361J78131L19191L73451L94440J75690j77819P5218M09386K50809O3248
2979.9I8044106k74888m7187L05275R6305J53359q6014k39876J90514K24800m585J28471
$$ plain form
2907.6 97371819 97317703 97400940 97636787 97618065 97289711 97028358 97052551 97098694 96997383 96914597 96844513
2918.2 96844513 96737709 96807304 96908127 96664444 96440964 96423897 96429451 96632202 96671989 96585602 96663910
2928.8 96663910 96564827 96556648 96584595 96475853 96548637 96785378 96972717 97026756 97157990 97114861 97034103
2939.4 97034103 97127800 97100189 97117653 96981987 96876068 96953781 97006531 97040619 96726662 96569427 96873764
2950 96873764 97063835 96900963 96585289 96217613 95794868 95665321 95544838 95323006 95229103 95035553
2959.7 95035553 94902794 94833252 94914833 95205696 95282173 95344025 95528130 95502342 95562889 95830231 95982361
2970.3 95982361 96160492 96479683 96853134 97247574 97423264 97245445 97320663 97730049 97980858 98044106
2979.9 98044106 97769218 97722031 98027306 98123611 98276970 98190956 97951080 98141594 98366394 98361809 98490280
2990.5I8490280K62856K5375n4375J39702K19742J7044j4732J00189K0515Q4961J0048
3001.1I9301605k5734R3575R6435P6661J5434K7878j13182M4120L74337J88316j55357
3011.7I9924088k56333J13472K46925N1209l6583j62300n6694Q3633J7838O6337K87285
3022.4A00278877J69487j41411o7932M196n0407k6306J16882K01042o5292k02736N402
3033A00221802J03943l3127j85852l4859J56273P9651m3884Q1230K48726k4506j54701
3043.6A00414696p9338p0053J75651Q5747q7235j71447k96456j98K12532J84677J34850
3054.2A00503426P1357l3943j26068k7595J19483N4512j27624m654p7400j57807L6004
3064.8A00229691M0298J27960M0589j473K0401j18950K6375J33575m760k08206k33612
$$ plain form
2990.5 98490280 98753136 98778511 98724136 98863838 99083580 99100624 99085892 99186081 99206596 99291557 99301605
3001.1 99301605 99275871 99369446 99465881 99542542 99557976 99585854 99472672 99516792 99891129 100079445 99924088
3011.7 99924088 99667755 99781227 100028152 100079361 100042778 99880478 99823784 99907417 99925255 99991592 100278877
3022.4 100278877 100448364 100306953 100239021 100243217 100192810 100166504 100283386 100484428 100419136 100216400 100221802
3033 100221802 100325745 100292618 100106766 100071907 100228180 100307831 100263947 100345177 100593903 100569397 100414696
3043.6 100414696 100335358 100265305 100440956 100526703 100439468 100268021 99971565 99971367 100183899 100368576 100503426
3054.2 100503426 100574783 100540840 100414772 100387177 100506660 100561172 100433548 100428894 100351494 100193687 100229691
3064.8 100229691 100269989 100397949 100438538 100437065 100457466 100338516 100364891 100498466 100493706 100285500 100051888
3075.4A00051888q103K53761J10619m5738K4917p2281P0382Q2389J763j21742j37932
3086A00209923O3301n6961K09579J71372K0866O8627l05115K9617J58836k33947r6550
3096.6A00239548J77757R5467n5466J62430K00775q7113m60235k93961K05498K14020
3106.2A00398720q7670k14508K08573J37855j44371R8778J34155Q1208r8816j53351
3115.9A00360573R2300J70799j76841k92847J99974K10060j7837j4260M1710J01219
3125.5A00674850o5345j72013n6038J28289J33766q6754k48512r6375J28273J22643
3135.2A00462784J41220J8707k55394j32919K11609M9003k09297M7005L47725K46757
3144.8A00927200j49223k35069J8913J82983M2893j94649m2816J30562K9106j45905
$$ plain form
3075.4 100051888 100043785 100297546 100408165 100362427 100387344 100315063 100385445 100467834 100469597 100347855 100209923
3086 100209923 100273224 100216263 100425842 100597214 100618080 100686707 100381592 100411209 100570045 100336098 100239548
3096.6 100239548 100417305 100512772 100457306 100619736 100820511 100733398 100273163 99979202 100184700 100398720
3106.2 100398720 100311050 100096542 100305115 100442970 100298599 100397377 100531532 100612740 100513924 100360573
3115.9 100360573 100452873 100623672 100446831 100153984 100353958 100564018 100546181 100531921 100573631 100674850
3125.5 100674850 100609505 100437492 100381454 100509743 100643509 100556755 100308243 100211868 100340141 100462784
3135.2 100462784 100604004 100622711 100367317 100234398 100446007 100495010 100285713 100332718 100680443 100927200
3144.8 100927200 100777977 100542908 100561821 100744804 100787697 100593048 100550232 100680794 100709900 100563995
3154.5A00563995j21376J3604p2594o7764Q506L0091J80198J98235J6868o6703j15433
3165.1A00567627j54717l2760J25099R9533L21K2415j03371j35002R0935J53671N8037
3175.7A00691788j14159r4505m5571m2366P0359j7456j40564j770K72697R9548k29683
3186.3A00448318j77749L9963K23991k8374j21284N0728m9324j0010J93924J60080
3195.9A00730263n8861K8351J1299k28256j95450m7501K01454K47254L4599o9580L9459
3206.5A00693031M1367j77063j38809l8910P9033K35855J65046k5642j69739q003j0673
3217.2A00645493k87407k02721N8075K45834J69670q5327l0845N0926N4214P508j41426
3227.8A00483994M5265K58980m2672l45932k8984K10541L7231N7465p7782k24266N1697
$$ plain form
3154.5 100563995 100442619 100456223 100383629 100315865 100324371 100354462 100534660 100732895 100749763 100683060 100567627
3165.1 100567627 100412910 100380150 100505249 100604782 100605103 100627518 100524147 100389145 100480080 100633751 100691788
3175.7 100691788 100577629 100483124 100437553 100395187 100465546 100448090 100307526 100305756 100578453 100678001 100448318
3186.3 100448318 100270569 100310532 100534523 100506149 100384865 100435593 100386269 100376259 100570183 100730263
3195.9 100730263 100671402 100699753 100711052 100482796 100287346 100239845 100441299 100688553 100723152 100653572 100693031
3206.5 100693031 100734398 100557335 100418526 100379616 100458649 100694504 100859550 100833908 100664169 100656166 100645493
3217.2 100645493 100358086 100155365 100213440 100459274 100628944 100543617 100512772 100563698 100617912 100625420 100483994
3227.8 100483994 100529259 100788239 100745567 100399635 100370651 100581192 100618423 100675888 100598106 100373840 100425537
3238.4A00425537K83592J08025j63994n9944J5655m0092J50978K10014j75903k66113
3248A00487755m6501r3193Q6067K32628p0107j03165J51680l9947r3857J38069j33506
3258.6A00515923r797K71256J58050J6869l16017l07579o6582L24005L86971j52390
3268.3A00820709l25599r0615K28317J51612q7433j64558j15860N539L2447R7191j8783
3278.9A00532967n417m1542M005L05039Q4655j38153n3596L0746j36909j18958K72690
3289.5A00735527J33369l48609k89048K56935K70874M738k51335k39792L03582J53945
3299.1A00730186k35763j885L16636J6418k47826p9246m4838J77772o1401j73187Q1070
3309.7A00477936Q6410K63741j000p3272o7574q3168J88347N6107n9739j71234o6490
$$ plain form
3238.4 100425537 100709129 100817154 100653160 100593216 100608871 100568779 100719757 100929771 100753868 100487755
3248 100487755 100441254 100348061 100434128 100666756 100596649 100493484 100645164 100605217 100511360 100649429 100515923
3258.6 100515923 100506126 100777382 100935432 100952301 100636284 100328705 100262123 100586128 100973099 100820709
3268.3 100820709 100495110 100404495 100632812 100784424 100696991 100532433 100416573 100422112 100454559 100551750 100532967
3278.9 100532967 100527550 100486008 100490013 100795052 100879707 100741554 100687958 100718704 100581795 100462837 100735527
3289.5 100735527 100868896 100520287 100231239 100488174 100759048 100763786 100512451 100272659 100576241 100730186
3299.1 100730186 100494423 100492538 100809174 100825592 100577766 100498520 100453682 100631454 100570053 100396866 100477936
3309.7 100477936 100564346 100828087 100827087 100753815 100686241 100603073 100791420 100847527 100787788 100616554 100550064
3320.3A00550064l899l410M5288l7224L67417J81793k98790l16742k35237J62224L03978
3330.9A00715462J87416j65131k78557O2996O2561q1726j75384P7278K45056J6907
3340.6A00666878q4694k01706P6095M07586O6513j97670J45Q7486j24741j892N7442
3351.2A00751442k85652j45188J69472J10993j00304q7616K38625K92518j25137l66676
3360.8A00452477J6349K53205Q9042J2009k0660o8749k53296k47246q85R6322J07894
3371.4A00436462K51358L04184N2948J900j47713l47801k42996O7886K79946k62596
3381.1A00393578k70211K22443J97555K73453Q8547j77132j95312K5131K78404l2829
3390.7A00803627k40929J183J04172p6699l5606P4501P9742J55503J09886k9770l08945
$$ plain form
3320.3 100550064 100546165 100542755 100588043 100550819 100918236 101100029 100801239 100484497 100249260 100411484 100715462
3330.9 100715462 100902878 100737747 100459190 100522186 100584747 100503021 100327637 100404915 100649971 100666878
3340.6 100666878 100582184 100380478 100456573 100864159 100930672 100733002 100733147 100820633 100695892 100694000 100751442
3351.2 100751442 100465790 100320602 100490074 100601067 100500763 100413147 100651772 100944290 100819153 100452477
3360.8 100452477 100468826 100722031 100811073 100823082 100802422 100733673 100480377 100233131 100232246 100328568 100436462
3371.4 100436462 100687820 100992004 101044952 101046852 100899139 100551338 100308342 100376228 100656174 100393578
3381.1 100393578 100123367 100345810 100543365 100816818 100905365 100728233 100532921 100558052 100836456 100803627
3390.7 100803627 100562698 100563881 100668053 100591354 100555748 100630249 100709991 100865494 100975380 100945610 100636665
3401.3A00636665k58064K0294J07559J93161J137l4897R6428o6795p0786Q5358J1185
3412A00721245p0366M6478L5141q5922j70960n6343J10810J37512K17361j4152j57799
3422.6A00713005j32820j52077J80077K01958j67626k03895J66671K76741j8440k24235
3432.2A00639359m30924k55348J84593L93539K44874r3903R705o012j64574r514J55327
3442.8A00667122M9370k42249j01303J89636J98029j85303k12448O8687j19346J03660
3452.5A00415855L54775K73018l3486n24574j25809K00280L6216j88354j13251K06223
3462.1A00500893L9756P668m5631R7724J63994p6263N3070j48720j49628l1715M9248
3472.7A00460396L05954m502k13562j16806R8061K56401n7220j32164P9872m2481q5174
$$ plain form
3401.3 100636665 100378601 100398895 100506454 100699615 100700752 100665855 100762283 100695488 100624702 100710060 100721245
3412 100721245 100650879 100697357 100732498 100646576 100475616 100419273 100530083 100667595 100884956 100870804 100713005
3422.6 100713005 100580185 100428108 100608185 100810143 100642517 100438622 100605293 100882034 100863594 100639359
3432.2 100639359 100208435 99953087 100137680 100531219 100776093 100682190 100691895 100685883 100521309 100511795 100667122
3442.8 100667122 100716492 100474243 100372940 100562576 100760605 100575302 100362854 100431541 100312195 100415855
3452.5 100415855 100770630 101043648 101010162 100485588 100359779 100560059 100596275 100407921 100294670 100500893
3462.1 100500893 100540649 100548317 100502686 100600410 100764404 100688141 100741211 100592491 100442863 100411148 100460396
3472.7 100460396 100766350 100761848 100548286 100431480 100529541 100785942 100728722 100596558 100676430 100633949 100548775
3483.3A00548775J7395j10489j63452j0506K35344K94029J57082j709N5679R3140k85568
3493.9A00829720j90804o0547o1630L0235j96258P6789K39106K723j47834k82631J6502
3504.5A00255371M59175L17276m01825m37790K0562J96350P6950r3529l7697Q5137
3514.2A00439980L89526J87088k51503k54013l4874K32307P9506m9499l82141p2060
3523.8A00284317O08772m6203l89649o0570M4213j00472L0045L23616J96365o2752
3533.5A00827682k48397L1852K57454j7341j13327o8489m0650J08368K86682J09940
3543.1A01133774p4791k21993l06465l7964K21840K68852M0093k7184K610j38779j91238
3553.7A00668755O0356K89726l4897k65655O6970L04818l8964j21170J50406P4494
$$ plain form
3483.3 100548775 100566170 100455681 100292229 100281723 100517067 100811096 100968178 100966469 101022148 101115288 100829720
3493.9 100829720 100638916 100578369 100516739 100546974 100350716 100427505 100666611 100669334 100521500 100238869 100255371
3504.5 100255371 100714546 101031822 100629997 100192207 100212769 100409119 100486069 100392540 100354843 100439980
3514.2 100439980 100829506 101016594 100765091 100511078 100476204 100708511 100788017 100738518 100356377 100284317
3523.8 100284317 100893089 100846886 100457237 100396667 100440880 100340408 100370453 100694069 100890434 100827682
3533.5 100827682 100579285 100611137 100868591 100851250 100737923 100669434 100628784 100737152 101023834 101133774
3543.1 101133774 101058983 100836990 100530525 100492561 100714401 100983253 101023346 100996162 100998772 100859993 100668755
3553.7 100668755 100729111 101018837 100983940 100718285 100785255 101090073 101051109 100929939 101080345 101154839
3563.4A01154839r5765j24740J78139q9341j99127K31011M4715j4312k07619j45767
3573A00732033J64032J52542j18706k13310M7592J24764P4974j53771n9654J38351
3582.6A00888847p064K6954N9746L1662j22231K4826k7023j09306q0765m5975K34383
3593.2A00874054l7186j32393j0673J62819L02231m9210N1239j57021k38128J46034
3602.9A00911766M0367n7144M6k11098l89793J45889l731J18050K86896J33483K05292
3613.5A01180023n5603J45668j22345n24215k15622M8202K98760K42263K01676m4136
3623.1A01154671j73706j91819k26394j312j97548j2574J51268K48009K67365j4435
3632.8A01003525L46649K03125k51541k92671m3053J02524n8434j72348j66817M16451
$$ plain form
3563.4 101154839 101059074 100934334 101112473 101023132 100824005 101055016 101099731 101085419 100877800 100732033
3573 100732033 100896065 101048607 100929901 100716591 100764183 100888947 100963921 100810150 100750496 100888847
3582.6 100888847 100881783 100908737 100968483 101000145 100877914 100902740 100875717 100766411 100685646 100639671 100874054
3593.2 100874054 100836868 100704475 100693802 100856621 101158852 101109642 101160881 101003860 100765732 100911766
3602.9 100911766 100952133 100894989 100895035 100683937 100294144 100440033 100436302 100554352 100841248 100974731 101180023
3613.5 101180023 101124420 101270088 101147743 100623528 100407906 100456108 100754868 100997131 101198807 101154671
3623.1 101154671 100980965 100789146 100562752 100561440 100363892 100351318 100502586 100750595 101017960 101003525
3632.8 101003525 101350174 101553299 101301758 101009087 100966034 101068558 101010124 100837776 100670959 101087410
3642.4A01087410L15811k23747k21016j1887K36077l99803k97715J60973J94687J51787
3652.1A00992577M089J01204L8109l81600j87446M64019J94207j12053j68808J22848
3661.7A01067146J80764p3800j1695L8398l0159k86575j91139L28102n3253J41472
3671.4A01109261Q7974k18681l23273k65312M37508N04318K42241j46431l67081l00247
3681A00760277N6160L9909j40785K97768J26686k75231j90796K60628J74278l73436
3690.6A00735458j51718M27513K30317j39397k54418r9243J37398J03096K7008R7412
3700.3A01113426j2108L502O7269P9315k5887j57203m9981J1635k50435o35261R5192
3710.9A00239464L55697N08225R1492j20774j3191j12915J02135J02936j8311O3812
$$ plain form
3642.4 101087410 101403221 101179474 100958458 100946571 101182648 100782845 100485130 100646103 100840790 100992577
3652.1 100992577 100996666 101097870 101135979 100754379 100566933 101030952 101225159 101113106 100944298 101067146
3661.7 101067146 101247910 101174110 101162415 101200813 101170654 100884079 100692940 101021042 100967789 101109261
3671.4 101109261 101197235 100978554 100655281 100389969 100827477 101331795 101574036 101427605 101060524 100760277
3681 100760277 100816437 100856346 100715561 101013329 101140015 100864784 100673988 100934616 101108894 100735458
3690.6 100735458 100583740 101011253 101241570 101102173 100847755 100748512 100885910 100989006 101016014 101113426
3700.3 101113426 101101318 101104820 101172089 101251404 101225517 101068314 101018333 101029968 100779533 100144272 100239464
3710.9 100239464 100595161 101103386 101194878 101074104 101060913 100947998 101050133 101153069 101134758 101198570
3720.5A01198570m9698J44394N7701J37268k03247l92395J39466J9584O9191K1195
3730.2A01142029J42982q117l06664K16255J20423l82584n74387K09679K36847l4988
3739.8A00761475K35061J11283K3658j27288J50283L42530n19341m03351j38694K55004
3749.5A00690620L10540j69632k79869K93800K72179Q2656j78756j60431J44104k0668
3759.1A00984543J62727J13144k74841j48575N5176R7770J00419O3736J411r1461r2194
3769.7A00971855O6841J07216P8369j30569k62055M1657L18588J95404l08037m85740
3779.4A00593529J79840L59733J94825m6181j3451n9929j40365J40762J77948r430
3789A01377281l64464l05107J42807K00150k9183M6387Q0299l84323l2241K45384O1546
$$ plain form
3720.5 101198570 101148872 101293266 101350967 101488235 101284988 100892593 101032059 101051643 101120834 101142029
3730.2 101142029 101285011 101276894 100970230 101186485 101306908 100924324 100349937 100559616 100796463 100761475
3739.8 100761475 100996536 101107819 101131477 101004189 101154472 101497002 100977661 100574310 100435616 100690620
3749.5 100690620 101001160 100831528 100551659 100845459 101117638 101200294 101021538 100861107 101005211 100984543
3759.1 100984543 101147270 101260414 100985573 100836998 100892174 100989944 101090363 101154099 101155510 101064049 100971855
3769.7 100971855 101038696 101145912 101224281 101093712 100831657 100873314 101191902 101387306 101079269 100593529
3779.4 100593529 100773369 101133102 101327927 101281746 101268295 101208366 101068001 101208763 101386711 101377281
3789 101377281 101012817 100707710 100850517 101050667 101021484 101067871 101148170 100763847 100731606 100976990 101038536
3799.6A01038536o0501l5530L34961j15135j20156K5498K54387M64164l87405m14673
3809.3A00984146q4389L01873K71705j68709l71261k02912k95600L34098N74418J78627
3818.9A01521996P3509k97760l13919k0195n7282J96602j04896j20446o225p065O2187
3829.5A00926506Q5785L38196j63895j88591M2618J25221j9066j69838N76149k08656
3839.2A01344429m25926P1960J9158O1386j2085R4353K71888J35758k40494k66495
3848.8A01053932r6245k93769j34415J078377Q88389r98070n05172J6731K06413j14250
3858.4A01101921k36984J03058K9098L1784L26462M06036j15974n61745j06819j5137
3868.1A00961700J35163J92642M4395k0340Q5297K46048l42560k60307P2845J05927
$$ plain form
3799.6 101038536 100978035 100942505 101277466 101162331 101042175 101067673 101322060 101786224 101398819 100984146
3809.3 100984146 100899757 101201630 101473335 101304626 100933365 100730453 100434853 100768951 101343369 101521996
3818.9 101521996 101595505 101297745 100983826 100963631 100906349 101102951 100998055 100877609 100871384 100864319 100926506
3829.5 100926506 101012291 101350487 101186592 100998001 101040619 101165840 101146774 100976936 101553085 101344429
3839.2 101344429 100918503 100990463 101009621 101071007 101058922 101153275 101425163 101560921 101320427 101053932
3848.8 101053932 100957687 100663918 100529503 101607880 102496269 101498199 100993027 101009758 101216171 101101921
3858.4 101101921 100864937 100967995 100997093 101028877 101355339 101761375 101645401 101083656 100976837 100961700
3868.1 100961700 101096863 101289505 101333900 101313560 101398857 101644905 101302345 101042038 101114883 101220810
3877.7A01220810P0190K0432l45421k29027J15441J64459K89955k13112k43400K31025
3887.4A01081352N3681Q5197k05391K4559M02558l6187j06491p1762J34239r4596k18361
3898A01048798j45676j12854M0871n6527J43891J14197L02444N661k47505K34619J35895
3908.6A01463814j50551l6217M6265j7456j97891n6466J66367m3724m2168q7639j05529
3919.2A00938805K52143J9578j12206R4978j6426P836K97897N1842k76940j56852k2293
3929.8A01078362J35711o2393k43095J29791o9557n8365J18194R2133J49361L4301
3939.5A01304443J4473J42876N2475j24802M3640m3891q6235Q8195J18965L6316j11625
3950.1A01434830L9924j6868j65734j73256N1789L05633p2197j57257p9834k7771K6039
$$ plain form
3877.7 101220810 101291000 101311432 100966011 100736984 100852425 101016884 101306839 101093727 100850327 101081352
3887.4 101081352 101135033 101220230 101014839 101039398 101441956 101405769 101299278 101227516 101361755 101267159 101048798
3898 101048798 100903122 100790268 100831139 100774612 100918503 101032700 101335144 101340805 101093300 101327919 101463814
3908.6 101463814 101313263 101277046 101323311 101305855 101107964 101051498 101217865 101174141 101131973 101044334 100938805
3919.2 100938805 101190948 101210526 101098320 101193298 101176872 101184708 101482605 101534447 101257507 101100655 101078362
3929.8 101078362 101214073 101151680 100908585 101038376 100968819 100910454 101028648 101120781 101270142 101304443
3939.5 101304443 101318916 101461792 101514267 101389465 101433105 101389214 101302979 101391174 101510139 101546455 101434830
3950.1 101434830 101474754 101457886 101292152 101118896 101170685 101476318 101404121 101246864 101167030 101139259 101165298
3960.7A01165298J09803L07876j51352j53457k6772j16638J0284K4178J2650j65612
3970.3A01016258J11428K72399l0235j63017j23245P408j05995J5388K78206L08945
3980A01587540j21552k82753R7321J37672K08672o3523l16009j60286J13167L87878
3989.6A01588127K9228l27400l48648J20667L11904j80336j57997J22612M17992J85577
3999.2A01761726l11744
4000.2A01449982
$$ plain form
3960.7 101165298 101275101 101582977 101431625 101278168 101251396 101134758 101145042 101169220 101181870 101016258
3970.3 101016258 101127686 101400085 101369850 101206833 101083588 101090996 100985001 101000389 101278595 101587540
3980 101587540 101465988 101183235 101280556 101418228 101626900 101563377 101247368 101087082 101200249 101588127
3989.6 101588127 101617355 101289955 100941307 101061974 101373878 101193542 101035545 101158157 101576149 101761726
3999.2 101761726 101449982
4000.2 101449982
##END=$$ End of the data block
