##TITLE=Instantgum BB $$ Begin of the data block
##JCAMP-DX=5.00 $$ ACD/SpecManager v 10.08
##SPECTROMETER/DATA SYSTEM=Alpha
##DATE=19 Feb 2015 09:45:16
##DATA TYPE=INFRARED SPECTRUM
##DATA CLASS=XYDATA
##ORIGIN=
##OWNER=
##NPOINTS=1765
##FIRSTX=399.76428223
##LASTX=3997.64306641
##MAXX=3997.64306641
##MINX=399.76428223
##MAXY=0.83647752
##MINY=0.50986856
##XFACTOR=1.0000000000
##YFACTOR=1.000000000000000e-9
##FIRSTY=0.65037084
##DELTAX=2.03961372
##XUNITS=1/CM
##YUNITS=ARBITRARY UNITS
##XYDATA=(X++(Y..Y))
$$ plain form
399.8 650370836 650081694 649243772 647936821 646936476 646981418 647662401 647837043 647397041 647274077 647445083
420.2 647445083 647590101 647494256 646357417 644627154 643641949 643722773 644062996 643865049 642884135 641810477
440.6 641810477 641675830 642186463 642184973 641364813 640439272 640278339 640967429 641755342 641586840 640580952
461 640580952 639942050 640155613 640632093 640704811 640456140 640165925 640059352 640343070 640626132 640385270
481.3 640385270 639890730 639778972 640082061 640265763 639891148 638995707 638138235 637793303 637765884 637448907
501.7 637448907 636518955 635446191 634856343 634718359 634526193 633859873 632840991 632020116 631645024
520.1 631645024 631362796 630834222 630039215 629232645 628804386 628672719 628374815 627868414 627515197 627439320
540.5 627439320 627541006 627676070 627707899 627865314 628378987 628993988 629443407 629726231 630058825 630718410
$$ packed form
399.8F50370836k89142q37922j306951j000345M4942O80983J74642m40002j22964J71006
420.2F47445083J45018r5845j136839j730263r85205Q0824L40223j97947r80914j073658
440.6F41810477j34647N10633j490q20160r25541j60933O89090P87913j68502j005888
461F40580952o38902K13563M76480P2718k48671k90215j06573K83718K83062k40862
481.3F40385270m94540j11758L03089J83702l74615q95441q57472l44932k7419l16977
501.7F37448907r29952j072764n89848j37984j92166o66320j018882q20875l75092
520.1F31645024k82228n28574p95007q06570m28259j31667k97904n06401l53217p5877
540.5F27439320J01686J35064L1829J57415N13673O15001M49419K82824L32594O59585
$$ plain form
560.9 630718410 631552219 632133186 632308304 632257760 632343352 632741392 633164823 633203566 632899523 632654369
581.3 632654369 632708371 632893443 632774353 632167757 631331027 630681276 630448937 630325973 629858494 629087627
601.7 629087627 628452599 628302157 628445506 628337443 627798736 627274573 627354562 628199458 629325628 630218923
622.1 630218923 630948603 631937385 633413613 635106981 636532784 637488246 638304710 639400065 640757501
640.4 640757501 642023087 642868161 643284440 643703997 644499242 645480275 646203876 646543860 646838486 647423267
660.8 647423267 648202240 648664892 649083495 650215983 651172101 652038276 653389573 654852688 655950785
679.2 655950785 656697869 657476902 658443153 659342170 659783244 659621418 659187376 658878267 658724070 658519626
699.6 658519626 658027649 657264650 656599283 656360209 656581640 657064378 657594800 658240438 659411550 661501229
$$ packed form
560.9F30718410Q33809N80967J75118n0544Q5592L98040M23431L8743l04043k45154
581.3F32654369N4002J85072j19090o06596q36730o49751k32339j22964m67479p70867
601.7F29087627o35028j50442J43349j08063n38707n24163P9989Q44896J126170Q93295
622.1F30218923P29680R88782J476228J693368J425803R55462Q16464J095355J357436
640.4F40757501J265586Q45074M16279M19557P95245R81033P23601L39984K94626N84781
660.8F47423267P78973M62652M18603J132488R56118Q66175J351297J463115J098097
679.2F55950785P47084P79033R66251Q99017M41074j61826m34042l09109j54197k04444
699.6F58519626m91977p62999o65367k39074K21431M82738N30422O45638J171112K089679
$$ plain form
720 661501229 664365232 667429984 670328736 673023343 675610542 678117931 680358291 681992710 682919443
738.3 682919443 683534324 684231520 685051978 685737431 685928583 685585499 685098052 684801579 684554815 683900237
758.7 683900237 682541788 680649757 678749323 677310288 676331758 675570071 675084054 675286472 676605225
777.1 676605225 679026723 681886315 684444368 686653495 688986957 691784620 694831669 697480738
793.4 697480738 699286580 700348556 701085031 701725483 702046037 701802373 701284349 701334953 702769160
811.8 702769160 705592215 708999932 712259173 715308130 718352139 721183896 722984135 722855031 720683873
830.1 720683873 717324615 713990211 711466134 709914804 709399939 710224748 712586939 716148496 719918489
848.5 719918489 722693980 723928988 724033952 723835945 723719418 723278880 721932709 719718099 717265844
$$ packed form
720F61501229K864003L064752K898752K694607K587199K507389K240360J634419R26733
738.3F82919443O14881O97196Q20458O85453J91152l43084m87447k96473k46764o54578
758.7F83900237j358449j892031j900434j439035r78530p61687m86017K02418J318753
777.1F76605225K421498K859592K558053K209127K333462K797663L047049K649069
793.4F97480738J805842J061976P36475O40452L20554k43664n18024N0604J434207
811.8G02769160K823055L407717L259241L048957L044009K831757J800239j29104k171158
830.1G20683873l359258l334404k524077j551330n14865Q24809K362191L561557L769993
848.5G19918489K775491J235008J04964j98007j16527m40538j346171k214610k452255
$$ plain form
866.8 717265844 715077281 713036537 710625350 707580686 704329789 701629460 699826717 698626399
883.2 698626399 697530568 696415246 695517004 694943130 694422841 693488777 691915035 690011322 688386321
901.5 688386321 687405884 686908364 686497867 686092257 686008811 686436117 687009633 686997950 685848534 683609426
921.9 683609426 680759192 677607000 674077094 669986963 665350556 660437167 655524969 650599837
938.2 650599837 645421028 639899611 634302378 629038155 624275744 619782686 615147531 610176086
954.5 610176086 604985297 599797428 594758332 589872062 585164428 580829382 577068865 573877573
970.9 573877573 571015537 568175435 565248191 562362552 559639394 557058930 554547668 552077651
987.2 552077651 549688101 547453403 545373380 543304324 541129529 538895905 536703110 534606040
$$ packed form
866.8G17265844k188563k040744k411187l044664l250897k700329j802743j200318
883.2F98626399j095831j115322q98242n73874n20289r34064j573742j903713j625001
901.5F88386321r80437m97520m10497m05610q3446M27306N73516j1683j149416k239108
921.9F83609426k850234l152192l529906m090131m636407m913389m912198m925132
938.2F50599837n178809n521417n597233n264223m762411m493058m635155m971445
954.5F10176086n190789n187869n039096m886270m707634m335046l760517l191292
970.9E73877573k862036k840102k927244k885639k723158k580464k511262k470017
987.2E52077651k389550k234698k080023k069056k174795k233624k192795k097070
$$ plain form
1003.5 534606040 532575548 530511260 528394282 526401877 524751544 523470759 522421300 521486402
1019.8 521486402 520667791 520001590 519487143 519054830 518604994 518122852 517711759 517482877 517311990 516938627
1040.2 516938627 516275227 515440285 514624536 513931632 513305485 512637377 511946201 511407077 511175334 511185884
1060.6 511185884 511229813 511197329 511157691 511250317 511589885 512168169 512850523 513633370 514742434 516379774
1081 516379774 518487692 520816147 523124993 525401533 527878225 530710518 533770025 536792755 539625108
1099.4 539625108 542305470 544921696 547425985 549602509 551201105 552201271 552900016 553650260 554533601
1117.7 554533601 555357754 556014717 556679666 557602525 558816791 560055017 560867608 560995936 560643554
1136.1 560643554 560207129 559858978 559527993 559190512 559072435 559553027 560842156 562765360 564916313
$$ packed form
1003.5E34606040k030492k064288k116978j992405j650333j280785j049459r34898
1019.8E21486402q18611o66201n14447m32313m49836m82142m11093k28882j70887l73363
1040.2E16938627o63400q34942q15749o92904o26147o68108o91176n39124k31743J0550
1060.6E11185884M3929l2484l9638R2626L39568N78284O82354P82847J109064J637340
1081E16379774K107918K328455K308846K276540K476692K832293L059507L022730K832353
1099.4E39625108K680362K616226K504289K176524J598596J000166O98745P50244Q83341
1117.7E54533601Q24153O56963O64949R22859J214266J238226Q12591J28328l52382
1136.1E60643554m36425l48151l30985l37481j18077M80592J289129J923204K150953
$$ plain form
1154.4 564916313 567082047 569447279 572289050 575624287 579200983 582733870 586206973 589927852
1170.7 589927852 594179630 598905921 603791416 608644903 613626301 619076490 625087917 631269157
1187.1 631269157 637048900 642147839 646717906 650992930 654877126 658006310 660136819 661432147
1203.4 661432147 662381411 663341641 664241493 664778411 664822698 664640725 664631724 664876163 665089667 664971292
1223.8 664971292 664533436 664094329 663915873 663892150 663663447 663056970 662302494 661759496 661552429 661491752
1244.2 661491752 661311746 660955071 660637200 660610318 660860777 661149442 661342919 661580205 662120700 663089633
1264.6 663089633 664310098 665457547 666375935 667141259 667914331 668710113 669298649 669461370 669246972
1282.9 669246972 668893218 668591797 668254972 667672276 666853249 666004479 665350676 664984167 664791107 664560199
$$ packed form
1154.4E64916313K165734K365232K841771L335237L576696L532887L473103L720879
1170.7E89927852M251778M726291M885495M853487M981398N450189O011427O181240
1187.1F31269157N779743N098939M570067M275024L884196L129184K130509J295328
1203.4F61432147R49264R60230Q99852N36918M4287j81973r001K44439K13504j18375
1223.8F64971292m37856m39107j78456k3723k28703o06477p54476n42998k07067o0677
1244.2F61491752j80006l56675l17871k6882K50459K88665J93477K37286N40495R68933
1264.6F63089633J220465J147449R18388P65324P73072P95782N88536J62721k14398
1282.9F69246972l53754l01421l36825n82696q19027q48770o53803l66509j93060k30908
$$ plain form
1303.3 664560199 664201140 663823307 663565993 663413465 663239241 662986338 662759840 662674367 662710845 662756681
1323.7 662756681 662646294 662314355 661857486 661362410 660822093 660229027 659604967 658886313 658089459 657465518
1344.1 657465518 657153249 657021761 656899631 656727552 656496704 656122506 655572891 654979467 654290199 653216362
1364.5 653216362 651930213 650754035 649719000 649030864 648689151 648366690 648132265 648029387 648029387 648567557
1384.9 648567557 649813116 650735617 650783241 650677979 650574982 650009632 648953438 647507846 645982802
1403.3 645982802 644543886 642974257 641385198 639903486 638458848 637195528 636523604 636225998 635522902
1421.6 635522902 634811163 634465933 634558856 635292888 636206865 637141287 638888359 640783727 641757607
1440 641757607 642767727 644106805 645470321 646690428 647475123 648018777 649024248 651485324 654090405
$$ packed form
1303.3F64560199l59059l77833k57314j52528j74224k52903k26498q5473L6478M5836
1323.7F62756681j10387l31939m56869m95076n40317n93066o24060p18654p96854o23941
1344.1F57465518l12269j31488j22130j72079k30848l74198n49615n93424o89268j073837
1364.5F53216362j286149j176178j035035o88136l41713l22461k34425j02878%N38170
1384.9F48567557J245559R22501M7624j05262j02997n65350j056194j445592j525044
1403.3F45982802j438916j569629j589059j481712j444638j263320o71924k97606p03096
1421.6F35522902p11739l45230R2923P34032R13977R34422J747072J895368R73880
1440F41757607J010120J339078J363516J220107P84695N43654J005471K461076K605081
$$ plain form
1458.3 654090405 654822052 655750573 658395231 661537409 664022446 667118490 671782196 676349878 679979920
1476.7 679979920 683426738 687048316 690771818 694508076 698775709 703641534 707778037 710435688
1493 710435688 713171482 716886163 720186114 722407281 724376798 727501690 731413305 733054876 733797967
1511.4 733797967 735142112 736936927 738725424 740454614 742551446 744036019 744708478 745077848 745242536
1529.7 745242536 745990396 747141778 747560024 748006940 749139488 749061346 747842073 746560812 745353580
1548.1 745353580 744100332 742784500 741719365 741244495 741073132 738549650 734664500 731428683 728743672
1566.4 728743672 726111412 722479165 718008280 713447630 707996726 701798141 695633471 689164460
1582.8 689164460 682380140 675636828 669258177 663326681 657787740 652515948 647589862 643345892
$$ packed form
1458.3F54090405P31647R28521K644658L142178K485037L096044M663706M567682L630042
1476.7F79979920L446818L621578L723502L736258M267633M865825M136503K657651
1493G10435688K735794L714681L299951K221167J969517L124892L911615J641571P43091
1511.4G33797967J344145J794815J788497J729190K096832J484573O72459L69370J64688
1529.7G45242536P47860J151382M18246M46916J132548p8142j219273j281261j207232
1548.1G45353580j253248j315832j065135m74870j71363k523482l885150l235817k685011
1566.4G28743672k632260l632247m470885m560650n450904o198585o164670o469011
1582.8F89164460o784320o743312o378651n931496n538941n271792m926086m243970
$$ plain form
1599.1 643345892 639982581 637312293 635054111 633190691 631778121 630720317 630060911 630372882 631166816
1617.4 631166816 630931377 630776167 631691277 632618666 633208632 633589506 633750618 634950995 637928486
1635.8 637928486 639971733 640520573 641211629 642692029 645771861 648880124 650220156 653023779 657599330
1654.1 657599330 659100771 659983814 662285805 665658712 668676019 670965850 674255490 678397000
1670.5 678397000 681578815 684812367 688256264 690949857 693772852 698002279 703315079 706492245
1686.8 706492245 708457649 710894048 713542044 717069209 720817626 723832190 726486504 727927089
1703.1 727927089 729180753 730611145 731466055 732157707 733171821 734735966 736509383 737144947 737021923
1721.5 737021923 737368464 738358200 739802122 741623461 743712604 746348858 748352587 749581695 751459301
$$ packed form
1599.1F43345892l363311k670288k258182j863420j412570j057804o59406L11971P93934
1617.4F31166816k35439j55210R15110R27389N89966L80874J61112J200377K977491
1635.8F37928486K043247N48840O91056J480400L079832L108263J340032K803623M575551
1654.1F57599330J501441Q83043K301991L372907L017307K289831L289640M141510
1670.5F78397000L181815L233552L443897K693593K822995M229427N312800L177166
1686.8G06492245J965404K436399K647996L527165L748417L014564K654314J440585
1703.1G27927089J253664J430392Q54910O91652J014114J564145J773417O35564j23024
1721.5G37021923L46541R89736J443922J821339K089143K636254K003729J229108J877606
$$ plain form
1739.8 751459301 753578782 755399764 757359624 759702086 762324095 764610767 766369164 768253148
1756.1 768253148 770236492 772135854 774110079 775673032 777056694 778691471 780473650 782200217
1772.4 782200217 783269286 783886075 784724355 785799026 786843181 787866592 788823783 789788067 791083634
1790.8 791083634 792361796 793014944 793538809 794386148 795296609 795930564 796437383 797109663 797958255
1809.2 797958255 798753202 799310207 799818218 800415456 801007926 801623285 802395046 803186297 803864658 804505289
1829.6 804505289 804831088 804960072 805305779 805775523 806210339 806823075 807641685 808104813 808213055 808379769
1850 808379769 808646083 808976650 809375048 809835613 810310543 810730577 811157405 811764896 812461197 812803268
1870.3 812803268 812830627 812943757 813186288 813488245 813853741 814242184 814591408 814932168 815322995 815611064
$$ packed form
1739.8G51459301K119481J820982J959860K342462K622009K286672J758397J883984
1756.1G68253148J983344J899362J974225J562953J383662J634777J782179J726567
1772.4G82200217J069069O16789Q38280J074671J044155J023411R57191R64284J295567
1790.8G91083634J278162O53148N23865Q47339R10461O33955N06819O72280Q48592
1809.2G97958255P94947N57005N08011N97238N92470O15359P71761P91251O78361O40631
1829.6H04505289L25799J28984L45707M69744M34816O12736Q18610M63128J08242J66714
1850H08379769K66314L30567L98398M60565M74930M20034M26828O07491O96301L42071
1870.3H12803268K7359J13130K42531L01957L65496L88443L49224L40760L90827K88069
$$ plain form
1890.7 815611064 815797329 816049993 816274524 816417813 816602826 816874444 817212939 817555428 817790508 817885578
1911.1 817885578 817978263 818273842 818732619 819026291 819112659 819183886 819261134 819390297 819568753 819694221
1931.5 819694221 819752216 819818974 819978654 820258737 820574462 820693076 820612550 820565283 820643067 820793092
1951.9 820793092 820900857 820919216 820936799 821042001 821194887 821337700 821429670 821418762 821370542 821420312 821534276
1974.4 821534276 821570575 821528614 821517646 821593463 821710646 821818233 821890175 821942091 821961164 821937323 821944654
1996.8 821944654 821962357 821911991 821824968 821803927 821858585 821887910 821824133 821717083 821662545 821644604 821524680
2019.2 821524680 821218312 820654213 820062220 820063114 820549726 820849597 820839465 820718288 820615947 820586860
2039.6 820586860 820587575 820535719 820420504 820284963 820203900 820214033 820240021 820200324 820099056 820029676 820069432
$$ packed form
1890.7H15611064J86265K52664K24531J43289J85013K71618L38495L42489K35080R5070
1911.1H17885578R2685K95579M58777K93672Q6368P1227P7248J29163J78456J25468
1931.5H19694221N7995O6758J59680K80083L15725J18614q0526m7267P7784J50025
1951.9H20793092J07765J8359J7583J05202J52886J42813R1970j0908m8220M9770J13964
1974.4H21534276L6299m1961j0968P5817J17183J07587P1942N1916J9073k3841P331
1996.8H21944654J7703n0366q7023k1041N4658K9325o3777j07050n4538j7941j19924
2019.2H21524680l06368n64099n91993Q94M86612K99871j0132j21177j02341k9087
2039.6H20586860P15n1856j15215j35541q1063J0133K5988l9697j01268o9380L9756
$$ plain form
2062.1 820069432 820171416 820210397 820168197 820133388 820160329 820254266 820370555 820424259 820395589 820362985 820399940
2084.5 820399940 820519209 820632577 820628524 820556521 820562124 820678413 820797503 820811272 820736706 820686102 820753038
2106.9 820753038 820902288 820990503 820952773 820870399 820865691 820951462 821040511 821067035 821021318 820966184 821000457
2129.4 821000457 821138918 821271956 821309686 821277320 821276605 821390927 821569085 821680307 821694911 821703970 821799636
2151.8 821799636 821985364 822166741 822266459 822331488 822466135 822707236 822979927 823174179 823304117 823477566
2172.2 823477566 823716462 823985577 824247181 824442863 824563503 824702024 824953794 825272262 825540483 825734973
2192.6 825734973 825900793 826103568 826391757 826691687 826906741 827064037 827239990 827492356 827807605 828082561
2213 828082561 828260243 828414977 828638792 828929007 829227686 829479337 829652309 829823792 830082178 830387294
$$ packed form
2062.1H20069432J01984L8981m2200l4809K6941R3937J16289N3704k8670l2604L6955
2084.5H20399940J19269J13368m053p2003N603J16289J19090J3769p4566n0604O6936
2106.9H20753038J49250Q8215l7730q2374m708Q5771Q9049K6524m5717n5134L4273
2129.4H21000457J38461J33038L7730l2366p15J14322J78158J11222J4604R059R5666
2151.8H21799636J85728J81377R9718O5029J34647K41101K72691J94252J29938J73449
2172.2H23477566K38896K69115K61604J95682J20640J38521K51770L18468K68221J94490
2192.6H25734973J65820K02775K88189K99930K15054J57296J75953K52366L15249K74956
2213H28082561J77682J54734K23815K90215K98679K51651J72972J71483K58386L05116
$$ plain form
2233.4 830387294 830647647 830811024 830946028 831149280 831411600 831676483 831893325 832040787 832171738 832376599
2253.8 832376599 832643569 832858860 832973003 833057582 833209336 833447993 833702266 833890319 834016442 834144831
2274.2 834144831 834299624 834482193 834679544 834821820 834894657 834974766 835109234 835250795 835339248 835385084
2294.6 835385084 835417867 835464239 835528135 835562468 835507572 835359454 835235715 835255027 835341990 835317552 835138559
2317 835138559 834917367 834784031 834765792 834738851 834615767 834491551 834454060 834456503 834431827 834327459 834159732
2339.5 834159732 834079504 834310770 834813356 835046351 834774315 834255636 833739996 833356380 833198488 833203554
2359.9 833203554 833285689 833490193 833825827 834229410 834634125 834989667 835312784 835655332 835998416 836280584
2380.2 836280584 836446345 836477518 836443663 836427748 836418271 836373031 836268961 836102068 835938394 835834801 835759103
$$ packed form
2233.4H30387294K60353J63377J35004K03252K62320K64883K16842J47462J30951K04861
2253.8H32376599K66970K15291J14143Q4579J51754K38657K54273J88053J26123J28389
2274.2H34144831J54793J82569J97351J42276P2837Q0109J34468J41561Q8453M5836
2294.6H35385084L2783M6372O3896L4333n4896j48118j23739J9312Q6963k4438j78993
2317H35138559k21192j33336j8239k6941j23084j24216l7491K443k4676j04368j67727
2339.5H34159732q0228K31266N02586K32995k72036n18679n15640l83616j57892N066
2359.9H33203554Q2135K04504L35634M03583M04715L55542L23117L42548L43084K82168
2380.2H36280584J65761L1173l3855j5915r477m5240j04070j66893j63674j03593p5698
$$ plain form
2402.7 835759103 835637450 835427165 835192919 835044801 834982693 834872007 834620476 834336996 834158421 834042311
2423.1 834042311 833888531 833674431 833402634 833105624 832855523 832673013 832483172 832208455 831880212 831581175
2443.5 831581175 831336319 831101477 830816865 830472767 830122769 829831839 829597592 829339802 829007387 828648150
2463.9 828648150 828323901 828041553 827772558 827452779 827056646 826652288 826326847 826082647 825821579 825477898
2484.3 825477898 825086057 824701726 824376762 824130356 823876858 823528528 823135614 822802663 822543383 822283268
2504.7 822283268 821958661 821584702 821245551 820982754 820743263 820460975 820125043 819779038 819477439 819233477
2525.1 819233477 818995476 818698645 818368077 818060637 817781210 817542732 817310333 817003429 816646457 816332817
2545.5 816332817 816089630 815860510 815595806 815302193 815016448 814773321 814559996 814297855 813952506 813591659
$$ packed form
2402.7H35759103j21653k10285k34246j48118o2108j10686k51531k83480j78575j16110
2423.1H34042311j53780k14100k71797k97010k50101j82510j89841k74717l28243k99037
2443.5H31581175k44856k34842k84612l44098l49998k90930k34247k57790l32415l59237
2463.9H28648150l24249k82348k68995l19779l96133m04358l25441k44200k61068l43681
2484.3H25477898l91841l84331l24964k46406k53498l48330l92914l32951k59280k60115
2504.7H22283268l24607l73959l39151k62797k39491k82288l35932l46005l01599k43962
2525.1H19233477k38001k96831l30568l07440k79427k38478k32399l06904l56972l13640
2545.5H16332817k43187k29120k64704k93613k85745k43127k13325k62141l45349l60847
$$ plain form
2565.8 813591659 813284993 813027442 812748730 812417448 812067688 811731219 811417401 811103761 810755074 810348511
2586.2 810348511 809908032 809495509 809117258 808723629 808290422 807821810 807345450 806910276 806512296 806085587
2606.6 806085587 805585861 805024743 804473102 803966522 803437293 802845359 802222192 801603258 801012456 800436556
2627 800436556 799820006 799124300 798387110 797687411 797033548 796353281 795616686 794851542 794084430 793351233
2647.4 793351233 792642236 791884959 791065395 790246546 789481044 788771868 788075805 787364185 786645174 785924256
2667.8 785924256 785230875 784596503 783971369 783308566 782642961 782008171 781383693 780745208 780114949 779521406
2688.2 779521406 778974652 778462708 777940273 777378857 776810765 776273072 775752604 775256455 774775505 774246931
2708.6 774246931 773682594 773163915 772701204 772226334 771720946 771217346 770734787 770278931 769805431 769280970
$$ packed form
2565.8H13591659l06666k57551k78712l31282l49760l36469l13818l13640l48687m06563
2586.2H10348511m40479m12523l78251l93629m33207m68612m76360m35174l97980m26709
2606.6H06085587m99726n61118n51641n06580n29229n91934o23167o18934n90802n75900
2627H00436556o16550o95706p37190o99699o53863o80267p36595p65144p67112p33197
2647.4G93351233p08997p57277q19564q18849p65502p09176o96063p11620p19011p20918
2667.8G85924256o93381o34372o25134o62803o65605o34790o24478o38485o30259n93543
2688.2G79521406n46754n11944n22435n61416n68092n37693n20468m96149m80950n28574
2708.6G74246931n64337n18679m62711m74870n05388n03600m82559m55856m73500n24461
$$ plain form
2729 769280970 768762648 768298090 767878830 767471671 767039716 766578078 766108871 765667617 765247822 764801741
2749.4 764801741 764310241 763780117 763251126 762741923 762205660 761635482 761059403 760460496 759831131 759194613
2769.8 759194613 758565247 757928014 757237852 756481469 755711079 754955590 754183590 753382087 752565920 751707971
2790.2 751707971 750794291 749880016 748972714 748015881 747012079 746003449 744956017 743822813 742636144
2808.6 742636144 741415203 740161836 738905787 737638235 736299694 734862566 733366370 731846333
2824.9 731846333 730282485 728627682 726880670 725096822 723332882 721622169 719921112 718153715
2841.2 718153715 716365218 714625776 712906182 711165428 709394634 707582235 705722868 703851819
2857.5 703851819 701962173 699964881 697856724 695721388 693586230 691513181 689589322 687761486
$$ packed form
2729G69280970n18322m64558m19260m07159m31955m61638m69207m41254m19795m46081
2749.4G64801741m91500n30124n28991n09203n36263n70178n76079n98907o29365o36518
2769.8G59194613o29366o37233o90162p56383p70390p55489p72000q01503q16167q57949
2790.2G51707971r13680r14275r07302r56833j003802j008630j047432j133204j186669
2808.6G42636144j220941j253367j256049j267552j338541j437128j496196j520037
2824.9G31846333j563848j654803j747012j783848j763940j710713j701057j767397
2841.2G18153715j788497j739442j719594j740754j770794j812399j859367j871049
2857.5G03851819j889646j997292k108157k135336k135158k073049j923859j827836
$$ plain form
2873.8 687761486 685949862 684220314 682682514 681351840 680162787 679043233 677971542 676961780
2890.1 676961780 676060081 675284564 674547255 673761725 672957897 672210872 671501935 670762837 669992089 669214070
2910.5 669214070 668400466 667506993 666563034 665626705 664723635 663925529 663316429 662965477 662889719 662955284
2930.9 662955284 663118184 663524210 664258778 665317178 666714370 668431878 670353174 672376513 674543381
2949.3 674543381 676933050 679455876 681981921 684515238 687088490 689689338 692237616 694627166
2965.6 694627166 696832538 698904216 700904369 702834070 704637527 706354380 708018959 709513485
2981.9 709513485 710824132 712076664 713295758 714459300 715496898 716273308 716847062 717293680 717543602
3000.3 717543602 717641771 717631519 717483401 717304349 717177212 716923714 716342628 715482533 714525104 713570476
$$ packed form
2873.8F87761486j811624j729548j537800j330674j189053j119554j071691j009762
2890.1F76961780r01699p75517p37309p85530q03828p47025p08937p39098p70748p78019
2910.5F69214070q13604q93473r43959r36329r03070p98106o09100l50952p5758O5565
2930.9F62955284J62900M06026P34568J058400J397192J717508J921296K023339K166868
2949.3F74543381K389669K522826K526045K533317K573252K600848K548278K389550
2965.6F94627166K205372K071678K000153J929701J803457J716853J664579J494526
2981.9G09513485J310647J252532J219094J163542J037598P76410N73754M46618K49922
3000.3G17543602R8169j0252j48118j79052j27137k53498n81086q60095r57429r54628
$$ plain form
3020.7 713570476 712630033 711644113 710530341 709392011 708369434 707391441 706255138 704911768 703620970
3039 703620970 702499092 701305509 699896693 698410690 697012305 695656419 694254458 692846656 691385806
3057.4 691385806 689830244 688332319 686996877 685764134 684443831 682892442 681231737 679681957
3073.7 679681957 678371251 677220464 675938666 674427211 672824264 671185851 669605315 668125510
3090 668125510 666579127 664955199 663421988 662028730 660658419 659164727 657621920 656229377 654925466
3108.4 654925466 653496325 652066588 650857568 649685085 648317277 646727085 644985020 643293858
3124.7 643293858 641801834 640435994 639043927 637589514 636184573 634948611 633750618 632325113
3141 632325113 630755246 629288614 627936363 626696229 625571191 624316573 622800469 621272981 619891346
$$ packed form
3020.7G13570476r40443r85920j113772j138330j022577r77993j136303j343370j290798
3039G03620970j121878j193583j408816j486003j398385j355886j401961j407802j460850
3057.4F91385806j555562j497925j335442j232743j320303j551389j660705j549780
3073.7F79681957j310706j150787j281798j511455j602947j638413j580536j479805
3090F68125510j546383j623928j533211j393258j370311j493692j542807j392543j303911
3108.4F54925466j429141j429737j209020j172483j367808j590192j742065j691162
3124.7F43293858j492024j365840j392067j454413j404941j235962j197993j425505
3141F32325113j569867j466632j352251j240134j125038j254618j516104j527488j381635
$$ plain form
3159.4 619891346 618572235 617271662 615993440 614715695 613424778 612137794 610882998 609675109
3175.7 609675109 608503640 607317090 606079936 604840517 603643715 602460027 601261199 600056410
3192 600056410 598856091 597663939 596478999 595313013 594175100 593056500 591968119 590903044 589825690
3210.3 589825690 588748515 587699473 586645007 585593581 584583998 583563268 582515776 581512392
3226.7 581512392 580573857 579712629 578921199 578033924 576995373 575977743 575047672 574203074 573469877
3245 573469877 572713852 571798623 570863187 570091367 569415212 568661571 567863226 567120433 566419661 565770686
3265.4 565770686 565226316 564754963 564178288 563454092 562712848 561962128 561204553 560507357 559848368 559183657
3285.8 559183657 558569968 558076262 557606578 556979239 556185067 555341482 554569304 553983629 553551257 553041160
$$ packed form
3159.4F19891346j319111j300573j278222j277745j290917j286984j254796j207889
3175.7F09675109j171469j186550j237154j239419j196802j183688j198828j204789
3192F00056410j200319j192152j184940j165986j137913j118600j088381j065075j077354
3210.3E89825690j077175j049042j054466j051426j009583j020730j047492j003384
3226.7E81512392r38535q61228p91430q87275j038551j017630r30071q44598p33197
3245E73469877p56025r15229r35436p71820o76155p53641p98345p42793p00772o48975
3265.4E65770686n44370m71353n76675p24196p41244p50720p57575o97196o58989o64711
3285.8E59183657o13689m93706m69684o27339p94172q43585p72178n85675m32372n10097
$$ plain form
3306.2 553041160 552276611 551304460 550284922 549344301 548487961 547666252 546864212 546111643 545386612
3324.6 545386612 544526517 543502510 542497039 541595280 540815711 540149689 539381981 538395047 537363172
3342.9 537363172 536359787 535411775 534616649 533779800 532658935 531438231 530394793 529524624 528659940
3361.3 528659940 527789116 527100205 526497662 525625288 524431050 523248911 522300959 521464527 520617545
3379.6 520617545 519761086 518974543 518332779 517843723 517526448 517197132 516547620 515781522 515358508 515149355
3400 515149355 514641285 513793349 513084173 512699306 512401700 512033641 511560798 511028707 510647297 510466039
3420.4 510466039 510259569 510013402 509924114 510015547 510123014 510220826 510380149 510397792 510124743 509872019
3440.8 509872019 509868562 510115027 510573924 510891080 510978580 511156499 511482954 511906445 512422144 512915194
$$ packed form
3306.2E53041160p64549r72151j019538r40621q56340q21709q02040p52569p25031
3324.6E45386612q60095j024007j005471r01759p79569o66022p67708r86934j031875
3342.9E37363172j003385r48012p95126q36849j120865j220704j043438q70169q64684
3361.3E28659940q70824o88911o02543q72374j194238j182139r47952q36432q46982
3379.6E20617545q56459p86543o41764m89056l17275l29316o49512p66098m23014k09153
3400E15149355n08070q47936p09176l84867k97606l68059m72843n32091l81410j81258
3420.4E10466039k06470k46167q9288R1433J07467R7812J59323J7643k73049k52724
3440.8E09872019l457K46465M58897L17156Q7500J77919L26455M23491N15699M93050
$$ plain form
3461.2 512915194 513396680 514093995 514929593 515434325 515530050 515713274 516225934 516901851 517617106 518259525
3481.6 518259525 518770278 519346833 520059347 520699024 521250367 521936536 522831261 523629606 524324000 525333762
3502 525333762 526290119 526722133 527257860 528265536 529321313 530146480 530816615 531520545 532454491 533770978
3522.4 533770978 535103559 536131024 537147522 538164139 539103568 540331066 541769564 542878628
3538.7 542878628 543867469 545322120 547233522 548879385 549841344 550907969 552436054 553805232 555070579
3557.1 555070579 556635261 558181345 559410274 561306775 564476550 566976130 568088651 569288194
3573.4 569288194 571127415 573253036 575458169 577516019 579383373 581874967 585280836 587928653
3589.7 587928653 589556158 591686249 594424725 597079217 599734247 602277219 604394972 606718898
$$ packed form
3461.2E12915194M81486O97315Q35598N04732R5725J83224N12660O75917P15255O42419
3481.6E18259525N10753N76555P12514O39677N51343O86169Q94725P98345O94394J009762
3502E25333762R56357M32014N35727J007676J055777Q25167O70135P03930R33946J316487
3522.4E33770978J332581J027465J016498J016617R39429J227498J438498J109064
3538.7E42878628R88841J454651J911402J645863R61959J066625J528085J369178J265347
3557.1E55070579J564682J546084J228929J896501L169775K499580J112521J199543
3573.4E69288194J839221K125621K205133K057850J867354K491594L405869K647817
3589.7E87928653J627505K130091K738476K654492K655030K542972K117753K323926
$$ plain form
3606 606718898 609877825 613146007 616113782 618876219 621329010 624514937 628211379 630563796 631868720
3624.4 631868720 634000301 638623595 643230319 645549715 647662222 650193989 652800322 655511737
3640.7 655511737 658012509 660305858 663545549 668550372 672640085 674133599 675775588 678816140
3657 678816140 681528687 683590829 685617328 687514007 689671457 692844093 695720375 697706401 700649679
3675.4 700649679 703175366 704209089 705192447 706342936 707767308 710277677 713206589 714642167
3691.7 714642167 715163291 715895474 716880262 718199015 719856262 721049726 721752107 722821593 724632561
3710 724632561 726507783 727295518 727475047 727972925 728857338 729817152 730707645 731454372 731921077 732525527
3730.4 732525527 733865798 735692203 737028182 737255394 736976981 737628400 739347696 740138650 740595043
$$ packed form
3606F06718898L158927L268182K967775K762437K452791L185927L696442K352417J304924
3624.4F31868720K131581M623294M606724K319396K112507K531767K606333K711415
3640.7F55511737K500772K293349L239691N004823M089713J493514J641989L040552
3657F78816140K712547K062142K026499J896679K157450L172636K876282J986026K943278
3675.4G00649679K525687J033723R83358J150489J424372K510369K928912J435578
3691.7G14642167N21124P32183R84788J318753J657247J193464P02381J069486J810968
3710G24632561J875222P87735J79529M97878Q84413R59814Q90493P46727M66705O04450
3730.4G32525527J340271J826405J335979K27212k78413O51419J719296P90954M56393
$$ plain form
3748.8 740595043 741984904 742819786 742676497 742819726 743570566 744117677 744332969 744813144 745495081
3767.1 745495081 746277571 746900678 747072816 747260571 747927368 748826981 749274671 749464929 749850571 750232875
3787.5 750232875 750528276 750805438 751218081 751901388 752472162 753192544 754204512 754465044 754616737
3805.9 754616737 755088449 755014300 754739761 755147576 756160319 756841242 757571101 758230031 758069038 757901728
3826.3 757901728 758014143 758316278 758826315 759364724 760116339 760873854 761033893 760915697 760825634 760573566
3846.7 760573566 760255814 760545313 762163460 763458669 763001204 762351274 762409806 763018787 763447046
3865 763447046 763534784 763976216 764488280 764562249 764443398 764285386 764565647 765029788 765316248 765744090
3885.4 765744090 765770257 765672505 766005397 765990496 765661120 765843868 766478181 767037392 767363787 767299950
$$ packed form
3748.8G40595043J389861Q34882j43289J43229P50840N47111K15292M80175O81937
3767.1G45495081P82490O23107J72138J87755O66797Q99613M47690J90258L85642L82304
3787.5G50232875K95401K77162M12643O83307N70774P20382J011968K60532J51693
3805.9G54616737M71712p4149k74539M07815J012743O80923P29859O58930j60993j67310
3826.3G57901728J12415L02135N10037N38409P51615P57515J60039j18196r0063k52068
3846.7G60573566l17752K89499J618147J295209m57465o49930N8532O08981M28259
3865G63447046Q7738M41432N12064P3969j18851j58012K80261M64141K86460M27842
3885.4G65744090K6167r7752L32892j4901l29376J82748O34313N59211L26395o3837
$$ plain form
3905.8 767299950 766940653 766710818 766695857 766827822 767154753 767518878 767685294 767747939 767867327 767899275
3926.2 767899275 767850935 768017590 768318236 768369079 768191993 768081009 768184721 768427134 768551111 768583179
3946.6 768583179 768680334 768759608 768793702 768821120 768836141 768827915 768848598 768944263 769076347 769192874 769259989
3969.1 769259989 769294560 769358397 769490838 769621313 769676030 769714952 769764066 769789636 769835174 769910097 769959271
3991.5 769959271 769975901 769978642 770016551
3997.6 770016551
$$ packed form
3905.8G67299950l59297k29835j4961J31965L26931L64125J66416O2645J19388L1948
3926.2G67899275m8340J66655L00646N0843j77086j10984J03712K42413J23977L2068
3946.6G68583179R7155P9274L4094K7418J5021q226K0683R5665J32084J16527O7115
3969.1G69259989L4571O3837J32441J30475N4717L8922M9114K5570M5538P4923M9174
3991.5G69959271J6630K741L7909
3997.6G70016551
##END=$$ End of the data block
