##TITLE=Imina $$ Begin of the data block
##JCAMP-DX=5.00 $$ ACD/SpecManager v 10.08
##SPECTROMETER/DATA SYSTEM=Alpha
##DATE=08 Jun 2015 09:26:56
##DATA TYPE=INFRARED SPECTRUM
##DATA CLASS=XYDATA
##ORIGIN=
##OWNER=
##NPOINTS=1765
##FIRSTX=399.76428223
##LASTX=3997.64306641
##MAXX=3997.64306641
##MINX=399.76428223
##MAXY=1.00239074
##MINY=0.45351377
##XFACTOR=1.0000000000
##YFACTOR=0.000000010000000
##FIRSTY=1.00000000
##DELTAX=2.03961372
##XUNITS=1/CM
##YUNITS=ARBITRARY UNITS
##XYDATA=(X++(Y..Y))
$$ plain form
399.8 100000000 98913860 97631001 95884144 93677777 91450173 89414668 87794441 88156879 92467129
418.1 92467129 98014802 100099742 100000000 99724585 99335241 98992115 98787916 98585480 98308593 98118287
438.5 98118287 98030436 97877795 97718489 97638267 97487736 97285855 97188771 97153592 97024947 96840632 96698058
461 96698058 96512121 96303296 96161568 95990056 95734519 95483226 95192647 94742543 94158387 93360907
481.3 93360907 91920406 89751983 87743634 87052697 88007969 89466769 89763069 88984203 89020181
499.7 89020181 90771651 92826450 93790084 93842274 93468088 92833710 92112690 91363323 90369546 89064652
520.1 89064652 87576264 85668278 82767212 78353083 71719855 63530159 57551628 55443937 53975171
538.5 53975171 53139096 57927549 68833327 80134225 87695491 91892081 94193751 95460457
$$ packed form
399.8A00000000j086140j282859j746857k206367k227604k035505j620227L62438M310250
418.1I2467129N547673K084940r9742k75415l89344l43126k04199k02436k76887j90306
438.5I8118287q7851j52641j59306q0222j50531k01881r7084l5179j28645j84315j42574
461I6698058j85937k08825j41728j71512k55537k51293k90579m50104n84156p97480
481.3I3360907j440501k168423k008349o90937R55272J458800K96300p78866L5978
499.7H9020181J751470K054799R63634N2190l74186o34378p21020p49367r93777j304894
520.1H9064652j488388j907986k901066m414129o633228q189696n978531k107691j468766
538.5E3975171q36075M788453J0905778J1300898P561266M196590K301670J266706
$$ plain form
554.8 95460457 96306461 96983129 97407359 97657156 97889286 98012000 97969937 97959149 97992402 97911060 97814447
577.2 97814447 97836310 97827774 97731709 97723514 97750211 97657806 97565150 97579604 97545040 97448897 97455788 97481704
601.7 97481704 97391468 97329563 97363794 97312152 97196722 97181666 97169667 97031820 96930748 96897012 96690667
624.1 96690667 96161348 95603073 95679325 96311015 96724892 96647507 95951730 94820929 94763303 96178889
644.5 96178889 97280884 97453839 97370088 97188425 97012621 96954143 96831161 96602869 96473849 96457678
664.9 96457678 96348768 96085912 95906681 95677239 95241302 94600242 93476540 91655236 89998019
683.3 89998019 90126896 92374414 95092696 96695608 97028881 96647108 96056861 95485842 94991744
701.6 94991744 94719589 94648737 94308001 93197131 90730995 85441047 77566284 73395842 78802913
$$ packed form
554.8I5460457Q46004O76668M24230K49797K32130J22714m2063j0788L3253q1342r6613
577.2I7814447K1863q536r6065q195K6697r2405r2656J4454l4564r6143O891K5916
601.7I7481704r0236o1905L4231n1642j15430j5056j1999j37847j01072l3736k06345
624.1I6690667n29319n58275P6252O31690M13877p7385o95777j130801n7626J415586
644.5I6178889J101995J72955q3751j81663j75804n8478j22982k28292j29020j6171
664.9I6457678j08910k62856j79231k29442m35937o41060j123702j821304j657217
683.3H9998019J28877K247518K718282J602912L33273l81773n90247n71019m94098
701.6I4991744k72155p0852l40736j110870k466136n289948p874763m170442N407071
$$ plain form
720 78802913 88821322 95120871 97032291 97309971 97158289 96884823 96681970 96485829 96217078 95998228
740.4 95998228 95845950 95623702 95360303 95148677 94887012 94514626 94118232 93636727 92861515 91709143
760.8 91709143 90150476 88566893 88331527 90139675 92366219 93331200 93272179 92956746 92559093
779.1 92559093 92066312 91578615 91091847 90519333 89903444 89278454 88540697 87648362 86659652 85517287
799.5 85517287 84107685 82417089 80407953 77882946 74681818 71027094 67672271 65385902 63910550
817.9 63910550 61803615 57997102 53154725 48772150 45937824 45351377 46303049 46797737 47461247
836.2 47461247 51119196 57503134 63713288 68575484 72774404 76474464 79288244 81720674 84567893
854.6 84567893 87413830 89369458 90375710 90844685 91001409 90928030 90703297 90296423 89515615 88110799
$$ packed form
720G8802913J0018409O299549J911420K77680j51682k73466k02853j96141k68751k18850
740.4I5998228j52278k22248k63399k11626k61665l72386l96394m81505p75212j152372
760.8I1709143j558667j583583k35366J808148K226544R64981n9021l15433l97653
779.1I2559093m92781m87697m86768n72514o15889o24990p37757q92335r88710j142365
799.5H5517287j409602j690596k009136k525007l201128l654724l354823k286369j475352
817.9F3910550k106935l806513m842377m382575k834326n86447R51672M94688O63510
836.2D7461247L657949O383938O210154M862196M198920L700060K813780K432430K847219
854.6H4567893K845937J955628J006252M68975J56724p3379k24733m06874p80808j404816
$$ plain form
875 88110799 85853809 82982874 81156164 82857668 88154268 93803978 97181010 98482352 98829985
893.4 98829985 98852319 98823220 98810422 98752397 98648274 98553938 98445207 98288870 98136181 98007947 97850746
915.8 97850746 97676939 97540855 97403723 97219670 97029805 96830237 96530408 96071094 95329487 94008434
936.2 94008434 92194164 90744376 90238899 90349454 90768415 91496831 92338657 93032181 93428844 93121105
956.6 93121105 91454726 88707644 86455613 85352278 84446633 83504927 83246559 83902961 85345244
974.9 85345244 87396514 89512104 91122037 92111522 92593080 92698240 92595381 92435855 92222208
993.3 92222208 91878849 91375333 90637916 89567280 88233566 86410177 82877249 76873857 72366983
1011.6 72366983 76604307 88192552 96842241 98573261 97293609 95817387 94550341 93425471
$$ packed form
875H8110799k256990k870935j826710J701504N296600N649710L377032J301342L47633
893.4I8829985K2334k9099j2798n8025j04123r4336j08731j56337j52689j28234j57201
915.8I7850746j73807j36084j37132j84053j89865j99568k99829m59314p41607j321053
936.2I4008434j814270j449788n05477J10555M18961P28416Q41826O93524L96663l07739
956.6I3121105j666379k747082k252031j103335r05645r41706k58368O56402J442283
974.9H5345244K051270K115590J609933R89485M81558J05160j02859j59526k13647
993.3I2222208l43359n03516p37417j070636j333714j823389l532928o003392m506874
1011.6G2366983M237324J1588245Q649689J731020j279652j476222j267046j124870
$$ plain form
1028 93425471 92336810 91248745 90243822 89413500 88809216 88474107 88410228 88530505 88721043 88916111
1048.4 88916111 89042479 89021391 88834071 88497537 87980598 87299103 86561882 85749161 84696835 83434343
1068.8 83434343 82140285 80660582 78436947 74987048 70501387 66318065 64803618 68076611
1085.1 68076611 76031095 85239249 90971869 91014075 86391288 80070639 76170206 76721120 79655015
1103.4 79655015 82491398 84530795 85759115 87270343 90235835 93784457 96503490 98179883
1119.8 98179883 99100262 99474311 99529999 99473190 99367023 99211377 99040920 98865068 98642290 98382974
1140.1 98382974 98136002 97882527 97597247 97316295 97045654 96728945 96385795 96076322 95728552 95163935
1160.5 95163935 94186342 92761844 91611969 91896492 93583816 95327622 96152353 96155989 95731235
$$ packed form
1028I3425471j088661j088065j004923q30322o04284l35109o3879J20277J90538J95068
1048.4H8916111J26368k1088j87320l36534n16939o81495p37221q12721j052326j262492
1068.8H3434343j294058j479703k223635l449899m485661m183322j514447L272993
1085.1F8076611P954484R208154N732620M2206m622787o320649l900433N50914K933895
1103.4G9655015K836383K039397J228320J511228K965492L548622K719033J676393
1119.8I8179883R20379L74049N5688n6809j06167j55646j70457j75852k22778k59316
1140.1I8382974k46972k53475k85280k80952k70641l16709l43150l09473l47770n64617
1160.5I5163935r77593j424498j149875K84523J687324J743806Q24731L636m24754
$$ plain form
1178.9 95731235 94959021 93639332 91557628 89453977 89421314 92152244 95264310 96721500 96910226
1197.3 96910226 96714723 96389490 95918190 95236450 94230199 93040866 92469889 93179768 94527334
1215.6 94527334 95428580 95697862 95665199 95491093 95196217 94795269 94303840 93835121 93648326 93908054
1236 93908054 94444072 94926274 95173943 95188612 95063376 94903302 94759047 94632751 94527090 94433439
1256.4 94433439 94317657 94153512 93942904 93690693 93383658 92969775 92338896 91422755 90491456 90303105
1276.8 90303105 91215730 92335510 92756510 92764133 92841291 92817211 92342913 91276842 89915788 89418548
1297.2 89418548 90586042 92211473 92729563 92197424 91652203 91865718 92568034 92985696 92936236 92669570
1317.6 92669570 92322457 91946840 91601753 91320580 91108245 90945125 90786439 90585268 90305519 89877230
$$ packed form
1178.9I5731235p72214j319689k081704k103651l2663K730930L112066J457190J88726
1197.3I6910226j95503l25233m71300o81740j006251j189333n70977P09879J347566
1215.6I4527334R01246K69282l2663j74106k94876m00948m91429m68719j86795K59728
1236I3908054N36018M82202K47669J4669j25236j60074j44255j26296j05661r3651
1256.4I4433439j15782j64145k10608k52211l07035m13883o30879r16141r31299j88351
1276.8I0303105R12625J119780M21000P623P7158k4080m74298j066071j361054m97240
1297.2H9418548J167494J625431N18090n32139n45221K13515P02316M17662m9460k66666
1317.6I2669570l47113l75617l45087k81173k12335j63120j58686k01171k79749m28289
$$ plain form
1338 89877230 89193845 88204932 86847275 84996396 82666796 80206096 78303778 77574116 78034872
1356.4 78034872 79110378 80245328 81315559 82528847 84009409 85463119 86377615 86664122 86799169
1374.7 86799169 87447459 88701266 89899737 90480453 90574157 90458870 90186727 89823914 89336783 88507539
1395.1 88507539 87149996 84853613 81583142 79211080 80393976 84392822 87577915 88712829
1411.4 88712829 88881928 89069653 89389098 89567882 89542133 89426148 89225358 88975430 88656723 88279158
1431.8 88279158 87952185 87594044 87109452 86686152 86364239 86085504 85838598 85595256 85412282 85368609
1452.2 85368609 85467076 85583192 85491222 85316616 85204017 85010195 84632617 84237540 83798075 82967091
1472.6 82967091 81633621 80000579 78105545 76136810 74934089 75471717 77524114 79918045 81726724
$$ packed form
1338H9877230o83385r88913j357657j850879k329600k460700j902318p29662M60756
1356.4G8034872J075506J134950J070231J213288J480562J453710R14496K86507J35047
1374.7H6799169O48290J253807J198471N80716R3704j15287k72143l62813m87131q29244
1395.1H8507539j357543k296383l270471k372062J182896L998846L185093J134914
1411.4H8712829J69099J87725L19445J78784k5749j15985k00790k49928l18707l77565
1431.8H8279158l26973l58141m84592m23300l21913k78735k46906k43342j82974m3673
1452.2H5368609R8467J16116r1970j74606j12599j93822l77578l95077m39465q30984
1472.6H2967091j333470j633042j895034j968735j202721N37628K052397K393931J808679
$$ plain form
1491 81726724 82758194 83002543 81894130 78931177 74446958 70052439 70284724 81037968 93081743
1509.3 93081743 98545635 100000000 99789071 99109161 98379540 97618520 97020316 96737909 96527094
1527.7 96527094 96298641 96064585 95734608 95465642 95383292 95142567 94533861 93881857 93277282 92716873
1548.1 92716873 92099857 91355944 90515488 89654893 87942022 84466201 81129849 79025656 79890436
1566.4 79890436 83941340 87095439 87032920 86448485 86980104 87313479 86487645 84902930 83098644
1584.8 83098644 81458378 80368042 80600411 82745957 85836154 87963933 88801569 89303869 89747363
1603.2 89747363 89884746 89751363 89458406 88928777 88074887 86389303 83026576 78578186 73731726
1621.5 73731726 70386976 72771543 80491358 88064969 91887993 93185359 93424439 93124729 92748481
$$ packed form
1491H1726724J031470K44349j108413k962953m484219m394519K32285J0753244J2043775
1509.3I3081743N463892J454365k10929o79910p29621p61020n98204k82407k10815
1527.7I6527094k28453k34056l29977k68966q2350k40725o08706o52004o04575n60409
1548.1I2716873o17016p43913q40456q60595j712871l475821l336352k104193Q64780
1566.4G9890436M050904L154099o2519n84435N31619L33375q25834j584715j804286
1584.8H3098644j640266j090336K32369K145546L090197K127779Q37636N02300M43494
1603.2H9747363J37383j33383k92957n29629q53890j685584l362727m448390m846460
1621.5G3731726l344750K384567P719815P573611L823024J297366K39080k99710l76248
$$ plain form
1639.9 92748481 92490149 92441350 92475945 92407304 92479348 92815864 93046165 93089157 93290055 93664223 94054270
1662.3 94054270 94336724 94598413 94902390 95145410 95346451 95548743 95669788 95774299 95974481 96198803
1682.7 96198803 96199065 96077412 96074975 96144629 96290344 96485764 96628451 96691906 96618068 96531534 96489424
1705.1 96489424 96393740 96303636 96291000 96364731 96475887 96454936 96277875 96160716 96116883 96084058 96088761
1727.6 96088761 96168154 96304268 96342951 96247715 96230292 96244997 96208650 96186846 96203715 96209967 96114165 95932204
1752 95932204 95808208 95730406 95643812 95561332 95447272 95373732 95439702 95599020 95763046 95813155 95732582
1774.5 95732582 95648706 95588428 95512724 95414150 95313513 95249778 95265985 95302701 95254034 95185119 95190328 95238435
1799 95238435 95282620 95323747 95385152 95481026 95598418 95681810 95716178 95751196 95792353 95819432 95860314 95924252
$$ packed form
1639.9I2748481k58332m8799L4595o8641P2044L36516K30301M2992K00898L74168L90047
1662.3I4054270K82454K61689L03977K43020K01041K02292J21045J04511K00182K24322
1682.7I6198803K62j21653k437O9654J45715J95420J42687O3455p3838q6534m2110
1705.1I6489424r5684r0104j2636P3731J11156k0951j77061j17159m3833l2825M703
1727.6I6088761P9393J36114L8683r5236j7423J4705l6347k1804J6869O252r5802j81961
1752I5932204j23996p7802q6594q2480j14060p3540O5970J59318J64026N0109q0573
1774.5I5732582q3876o0278p5704r8574j00637o3735J6207L6716m8667o8915N209M8107
1799I5238435M4185M1127O1405R5874J17392Q3392L4368L5018M1157K7079M0882O3938
$$ plain form
1823.4 95924252 95965981 95985329 95969975 95895934 95830649 95798218 95773345 95767772 95790160 95770544 95673066 95571476
1847.9 95571476 95492518 95438486 95405304 95381808 95371813 95363075 95337659 95325875 95352185 95336485 95223999 95105553
1872.4 95105553 95012623 94896859 94754928 94612306 94473010 94340116 94238961 94151360 94040400 93941498
1892.8 93941498 93865496 93755150 93568003 93291825 92923385 92499363 92123055 91879535 91761464 91750306
1913.2 91750306 91886497 92184871 92583746 93027145 93467081 93818736 94037813 94128746 94112307 94019318
1933.6 94019318 93905509 93846762 93878216 93967527 94085890 94236714 94390017 94508171 94593406 94651049 94677931
1956 94677931 94693750 94724220 94771123 94832051 94900131 94945145 94948643 94926399 94893396 94849324 94802558 94776034
1980.5 94776034 94770920 94769657 94773495 94789577 94796908 94778401 94759434 94752514 94741142 94725281 94715321 94709843 94708103
$$ packed form
1823.4I5924252M1729J9348j5354p4041o5285l2431k4873n573K2388j9616r7478j01590
1847.9I5571476p8958n4032l3182k3496r995q738k5416j1784K6310j5700j12486j18446
1872.4I5105553r2930j15764j41931j42622j39296j32894j01155q7601j10960r8902
1892.8I3941498p6002j10346j87147k76178l68440m24022l76308k43520j18071j1158
1913.2I1750306J36191K98374L98875M43399M39936L51655K19077R0933j6439r2989
1933.6I4019318j13809n8747L1454Q9311J18363J50824J53303J18154Q5235N7643K6882
1956I4677931J5819L0470M6903O0928O8080M5014L498k2244l3003m4072m6766k6524
1980.5I4776034n114j263L838J6082P331j8507j8967o920j1372j5861r960n478j740
$$ plain form
2007 94708103 94721377 94748551 94771153 94781661 94773221 94725198 94640642 94543856 94486547 94532132 94634998 94696110
2031.5 94696110 94703019 94686556 94672096 94667119 94658113 94643474 94631666 94618660 94604230 94604635 94621074 94631493 94629675
2058 94629675 94627029 94619256 94598407 94577813 94568890 94559950 94549757 94557083 94578314 94593996 94605601 94619203 94624454
2084.5 94624454 94620752 94622171 94627470 94627017 94629306 94641024 94647002 94645399 94650924 94655824 94646704 94637203 94638699 94638270 94631654
2115.1 94631654 94629723 94625360 94607490 94592553 94595319 94603151 94605219 94606179 94603789 94593400 94587010 94595462 94613171 94636524
2143.7 94636524 94670039 94705242 94725627 94734257 94741416 94741970 94735658 94735414 94740224 94739556 94733733 94727206 94724250 94727319
2172.2 94727319 94728613 94714981 94688869 94672394 94678289 94694030 94707370 94718987 94725752 94725907 94729555 94738775 94741935
2198.7 94741935 94736087 94730657 94730198 94728184 94724804 94726557 94727308 94721377 94714296 94707853 94698292 94687307 94677007 94665587
$$ packed form
2007I4708103J3274K7174K2602J0508q440m8023q4556r6786n7309M5585J02866O1112
2031.5I4696110O909j6463j4460m977r006j4639j1808j3006j4430M05J6439J0419j818
2058I4629675k646p773k0849k0594q923q940j0193P326K1231J5682J1605J3602N251
2084.5I4624454l702J419N299m53K289J1718N978j603N525M900r120r501J496m29o616
2115.1I4631654j931m363j7870j4937K766P832K068R60k390j0389o390Q452J7709K3353
2143.7I4636524L3515L5203K0385Q630P159N54o312k44M810o68n823o527k956L069
2172.2I4727319J294j3632k6112j6475N895J5741J3340J1617O765J55L648R220L160
2198.7I4741935n848n430m59k014l380J753P51n931p081o443r561j0985j0300j1420
$$ plain form
2227.3 94665587 94653261 94638246 94616169 94588798 94567776 94558471 94551539 94539171 94523662 94507658 94489574 94473642
2251.8 94473642 94464517 94450092 94410807 94334245 94206887 94020146 93805891 93648839 93637562 93779963 93973011
2274.2 93973011 94095343 94115657 94089413 94084930 94129789 94213498 94309950 94390237 94437283 94450438 94438607 94422281
2298.7 94422281 94423515 94439840 94442981 94415653 94389957 94426304 94531184 94634247 94671172 94641823 94601303 94625920
2323.1 94625920 94741333 94883001 94975770 95005322 94995224 94974917 94962060 94952977 94936407 94891733 94832259
2345.6 94832259 94850713 94955701 95053303 95078325 95057923 95040667 95031649 95019281 95000392 94969898 94925451 94868743
2370.1 94868743 94800526 94728512 94664115 94611740 94577855 94570601 94585907 94606858 94613874 94599408 94572949 94553655
2394.5 94553655 94554412 94573396 94598615 94615108 94620824 94626671 94633049 94629097 94613934 94599563 94596916 94608831 94630975
$$ packed form
2227.3I4665587j2326j5015k2077k7371k1022r305o932j2368j5509j6004j8084j5932
2251.8I4473642r125j4425l9285p6562j27358j86741k14255j57052j1277J42401J93048
2274.2I3973011J22332K0314k6244m483M4859Q3709R6452Q0287M7046J3155j1831j6326
2298.7I4422281J234J6325L141k7328k5696L6347J04880J03063L6925k9349m0520K4617
2323.1I4625920J15413J41668R2769K9552j0098k0307j2857r083j6570m4674n9474
2345.6I4832259J8454J04988R7602K5022k0402j7256r018j2368j8889l0494m4447n6708
2370.1I4868743o8217p2014o4397n2375l3885p254J5306K0951P016j4466k6459j9294
2394.5I4553655P57J8984K5219J6493N716N847O378l952j5163j4371k647J1915K2144
$$ plain form
2421 94630975 94651818 94661748 94667435 94676101 94677734 94669986 94664150 94660854 94654602 94645524 94636101 94627100 94618785 94611800 94604552
2451.6 94604552 94594800 94587374 94585878 94580531 94564599 94553691 94564462 94585657 94599503 94607049 94612598 94616973 94628292
2478.1 94628292 94643444 94646031 94641995 94650114 94668537 94680810 94682240 94677860 94668603 94658065 94650495 94645137 94641823
2504.7 94641823 94641018 94640213 94632852 94611681 94578993 94543648 94515955 94513571 94538224 94564474 94580138 94593257 94600201
2531.2 94600201 94594216 94585395 94578922 94565606 94544941 94526345 94508922 94483536 94452894 94423765 94389719 94347441
2555.6 94347441 94306761 94274563 94255400 94253999 94252545 94220024 94163263 94131690 94157946 94226122 94301820 94362247
2580.1 94362247 94405770 94451666 94510633 94564259 94596684 94619870 94644868 94667220 94690615 94719958 94747347 94767153
2604.6 94767153 94785500 94805437 94816488 94818193 94823349 94831401 94834930 94836277 94836408 94829267 94814837 94800317 94787967
$$ packed form
2421I4630975K0843R930N687Q666J633p748n836l296o252r078r423r001q315o985p248
2451.6I4604552r752p426j496n347j5932j0908J0771K1195J3846P546N549M375J1319
2478.1I4628292J5152K587m036Q119J8423J2273J430m380r257j0538p570n358l314
2504.7I4641823q05Tp361k1171l2688l5345k7693k384K4653K6250J5664J3119O944
2531.2I4600201n985q821o473j3316k0665j8596j7423k5386l0642k9129l4046m2278
2555.6I4347441m0680l2198j9163j401j454l2521n6761l1573K6256O8176P5698O0427
2580.1I4362247M3523M5896N8967N3626L2425K3186K4998K2352K3395K9343K7389J9806
2604.6I4767153J8347J9937J1051J705N156Q052L529J347J31p141j4430j4520j2350
$$ plain form
2631.1 94787967 94772047 94751388 94730061 94703454 94669181 94632196 94594592 94564795 94552982 94556731 94570714 94594306
2655.6 94594306 94621754 94640028 94645894 94646996 94642133 94624853 94604933 94599211 94604951 94606626 94596887 94577610 94553417
2682.1 94553417 94530427 94514972 94506091 94499004 94490814 94474518 94444293 94406730 94372588 94341129 94310814 94287461
2706.6 94287461 94265831 94236338 94202948 94166696 94114161 94038373 93948406 93864632 93818927 93842626 93943530
2729 93943530 94094324 94247812 94368303 94442260 94472343 94475210 94469339 94458979 94436020 94396621 94346964 94295710
2753.5 94295710 94248521 94202936 94154394 94102252 94048470 93994093 93939161 93889439 93844622 93789107 93714219 93650216
2778 93650216 93640476 93683118 93739963 93782860 93801463 93789965 93756324 93718100 93680561 93632597 93563575 93481427
2802.4 93481427 93397975 93313742 93228060 93146956 93080509 93029225 92974949 92904693 92821860 92722791 92601460
$$ packed form
2631.1I4787967j5920k0659k1327k6607l4273l6985l7604k9797j1813L749J3983K3592
2655.6I4594306K7448J8274N866J102m863j7280j9920n722N740J675r739j9277k4193
2682.1I4553417k2990j5455q881p087q190j6296l0225l7563l4142l1459l0315k3353
2706.6I4287461k1630k9493l3390l6252n2535p5788q9967q3774m5705K3699J00904
2729I3943530J50794J53488J20491P3957L0083K867n871j0360k2959l9399m9657n1254
2753.5I4295710m7189m5585m8542n2142n3782n4377n4932m9722m4817n5515p4888o4003
2778I3650216r740M2642N6845M2897J8603j1498l3641l8224l7539m7964o9022q2148
2802.4I3481427q3452q4233q5682q1104o6447n1284n4276p0256q2833r9069j21331
$$ plain form
2824.9 92601460 92465091 92312950 92131042 91915357 91669726 91388583 91044915 90611160 90092140 89499706
2845.3 89499706 88830203 88090032 87333703 86687034 86300868 86227220 86348063 86468792 86461699 86294484
2865.7 86294484 85993403 85622776 85241473 84881562 84622580 84611684 84936082 85551476 86338896 87165666
2886.1 87165666 87918681 88524669 88947070 89163792 89162344 88967454 88670385 88395530 88216352 88099092
2906.5 88099092 87938511 87686610 87424028 87313795 87508506 88027424 88716531 89367574 89840180 90097028
2926.8 90097028 90164590 90082371 89905542 89697731 89513087 89397973 89388305 89498961 89713907 89991045
2947.2 89991045 90287048 90562314 90764135 90860045 90867174 90814286 90725619 90631944 90562028 90525508 90502888
2969.7 90502888 90474105 90444624 90424985 90423614 90442175 90466601 90493524 90543348 90645605 90835512 91119140
$$ packed form
2824.9I2601460j36369j52141j81908k15685k45631k81143l43668m33755n19020n92434
2845.3H9499706o69503p40171p56329o46669l86166p3648J20843J20729p093j67215
2865.7H6294484l01081l70627l81303l59911k58982j0896L24398O15394P87420Q26770
2886.1H7165666P53015O05988M22401K16722j448j94890k97069k74855j79178j17260
2906.5H8099092j60581k51901k62582j10233J94711N18918O89107O51043M72606K56848
2926.8I0097028O7562q2219j76829k07811j84644j15114r668J10656K14946K77138
2947.2H9991045K96003K75266K01821R5910P129n2888q8667r3675o9916l6520k2620
2969.7I0502888k8783k9481j9639j371J8561K4426K6923M9824J02257J89907K83628
$$ plain form
2992.1 91119140 91448152 91779453 92087787 92343557 92544454 92700773 92806304 92854089 92838031 92737353
3012.5 92737353 92518806 92153943 91625506 90948164 90231681 89682609 89498681 89721644 90165520 90611434
3032.9 90611434 91025418 91464889 91929489 92363477 92707115 92901617 92893291 92721802 92569113 92631310
3053.3 92631310 92917830 93233669 93396252 93403429 93400019 93540335 93814588 94051617 94125688 94033152 93809110
3075.7 93809110 93474352 93061060 92663825 92417419 92415410 92651248 92994010 93284625 93489861 93676180
3096.1 93676180 93890190 94122446 94337243 94518024 94673204 94805819 94912064 95007157 95102978 95180821
3116.5 95180821 95220280 95208371 95153046 95096463 95061362 95047313 95058501 95075607 95073664 95059460 95039392 95002711
3141 95002711 94956499 94919485 94891447 94866091 94840950 94799089 94729400 94651741 94586223 94535303 94493812 94456488
$$ packed form
2992.1I1119140L29012L31301L08334K55770K00897J56319J05531M7785j6058j00678
3012.5I2737353k18547l64863n28437o77342p16483n49072j83928K22963M43876M45914
3032.9I0611434M13984M39471M64600M33988L43638J94502q326j71489j52689O2197
3053.3I2631310K86520L15839J62583P177l410J40316K74253K37029P4071r2536k24042
3075.7I3809110l34758m13292l97235k46406k009K35838L42762K90615K05236J86319
3096.1I3676180K14010K32256K14797J80781J55180J32615J06245R5093R5821P7843
3116.5I5180821L9459j1909n5325n6583l5101j4049J1188J7106j943j4204k0068l6681
3141I5002711m6212l7014k8038k5356k5141m1861o9689p7659o5518n0920m1491l7324
$$ plain form
3165.5 94456488 94421685 94387394 94350547 94309640 94259244 94186133 94090563 93989956 93896919 93823582 93784767
3187.9 93784767 93772221 93756521 93729120 93693370 93634629 93551004 93461674 93370628 93271464 93166655 93066597
3210.3 93066597 92976880 92899859 92845541 92808527 92770237 92728192 92685914 92634839 92573404 92518938 92462146 92365992
3234.8 92365992 92239845 92124158 92031974 91970050 91949856 91958100 91962910 91946614 91904640 91832161 91737258 91647184
3259.3 91647184 91576135 91515172 91462839 91432667 91425771 91405249 91347319 91268599 91184109 91106224 91037732 90968883
3283.8 90968883 90898830 90839124 90797555 90749627 90668869 90564913 90446651 90326834 90239531 90182221 90100193
3306.2 90100193 89958888 89780909 89601189 89438885 89291871 89137250 88969058 88806635 88653684 88482738
3326.6 88482738 88282907 88077587 87875378 87678611 87499189 87308651 87078053 86830401 86582696 86341834
$$ packed form
3165.5I4456488l4803l4291l6847m0907n0396p3111r5570j00607r3037p3337l8815
3187.9I3784767j2546j5700k7401l5750n8741q3625q9330r1046r9164j04809j00058
3210.3I3066597q9717p7021n4318l7014l8290m2045m2278n1075o1435n4466n6792r6154
3234.8I2365992j26147j15687r2184o1924k0194Q244M810j6296m1974p2479r4903r0074
3259.3I1647184p1049o0963n2333l0172o896k0522n7930p8720q4490p7885o8492o8849
3283.8I0968883p0053n9706m1569m7928q0758j03956j18262j19817q7303n7310q2028
3306.2I0100193j41305j77979j79720j62304j47014j54621j68192j62423j52951j70946
3326.6H8482738j99831k05320k02209j96767j79422j90538k30598k47652k47705k40862
$$ plain form
3347 86341834 86119819 85887355 85614020 85324150 85048765 84788579 84521383 84244233 83991486 83761227
3367.4 83761227 83500403 83189327 82874459 82600379 82356274 82122862 81896758 81675375 81465608 81286347
3387.8 81286347 81145608 81000370 80812812 80626512 80497438 80402327 80259520 80060428 79888326 79768646
3408.2 79768646 79662329 79550171 79425687 79307282 79220527 79147243 79075831 79025745 79003203 78993589 78977501
3430.6 78977501 78968549 78988558 79003310 78983849 78964776 78983647 79038334 79101676 79163289 79241586 79333568 79424208
3455.1 79424208 79529792 79656637 79769218 79870605 80009055 80172652 80300039 80383098 80474049 80600095
3475.5 80600095 80757427 80922949 81054795 81171954 81316656 81462967 81595761 81743270 81908429 82072753
3495.9 82072753 82228178 82393461 82571357 82722253 82852924 83002156 83166951 83345205 83531910 83706981
$$ packed form
3347H6341834k22015k32464k73335k89870k75385k60186k67196k77150k52747k30259
3367.4H3761227k60824l11076l14868k74080k44105k33412k26104k21383k09767j79261
3387.8H1286347j40739j45238j87558j86300j29074r5111j42807j99092j72102j19680
3408.2G9768646j06317j12158j24484j18405q6755p3284p1412n0086k2542r614j6088
3430.6G8977501q952K0009J4752j9461j9073J8871N4687O3342O1613P8297R1982R0640
3455.1G9424208J05584J26845J12581J01387J38450J63597J27387Q3059R0951J26046
3475.5H0600095J57332J65522J31846J17159J44702J46311J32794J47509J65159J64324
3495.9H2072753J55425J65283J77896J50896J30671J49232J64795J78254J86705J75071
$$ plain form
3516.3 83706981 83879822 84073120 84279269 84461474 84608358 84747374 84911132 85112739 85333377 85537362
3536.7 85537362 85718066 85923254 86170083 86391550 86541557 86684656 86867923 87052411 87229174 87431759
3557.1 87431759 87663424 87911344 88176239 88428980 88609004 88752180 88940114 89163393 89401627 89657331
3577.5 89657331 89932185 90239513 90583867 90896845 91092944 91269058 91533452 91818607 92075950 92338073
3597.9 92338073 92597091 92843395 93131137 93449223 93717986 93947041 94189161 94442284 94698077 94903290
3618.3 94903290 95042932 95227712 95517975 95829421 95968014 95975167 96080124 96234262 96374702 96515960
3638.7 96515960 96655267 96826345 97075683 97326910 97392070 97291511 97268844 97296596 97272140 97272927 97318417
3661.1 97318417 97375262 97503376 97697407 97823721 97907132 98053312 98072112 97960651 97946578 98012662 98149049
$$ packed form
3516.3H3706981J72841J93298K06149J82205J46884J39016J63758K01607K20638K03985
3536.7H5537362J80704K05188K46829K21467J50007J43099J83267J84488J76763K02585
3557.1H7431759K31665K47920K64895K52741J80024J43176J87934K23279K38234K55704
3577.5H9657331K74854L07328L44354L12978J96099J76114K64394K85155K57343K62123
3597.9I2338073K59018K46304K87742L18086K68763K29055K42120K53123K55793K05213
3618.3I4903290J39642J84780K90263L11446J38593P153J04957J54138J40440J41258
3638.7I6515960J39307J71078K49338K51227O5160j00559k2667K7752k4456P87M5490
3661.1I7318417N6845J28114J94031J26314Q3411J46180J8800j11461j4073O6084J36387
$$ plain form
3683.5 98149049 98366803 98552543 98548055 98444408 98423362 98479539 98561400 98626369 98627305 98624611 98714596 98859745
3708 98859745 98918509 98802292 98691577 98707205 98770815 98822457 98853958 98869210 98879218 98946953 99099326
3730.4 99099326 99253285 99274033 99158859 99121004 99248737 99348056 99260151 99240792 99326116 99230373 99063492
3752.9 99063492 99068332 99136496 99125457 99091977 99134958 99209255 99261385 99255306 99203938 99204105 99278891 99365574
3777.3 99365574 99386156 99361676 99356544 99352390 99349743 99367756 99410385 99473912 99525350 99589062 99638945 99576056
3801.8 99576056 99525458 99498034 99400043 99383211 99503917 99629635 99666429 99711871 99719131 99585295 99506408
3824.3 99506408 99519551 99563718 99627614 99694216 99791569 99840510 99747252 99641776 99586529 99537539 99560654
3846.7 99560654 99724197 99921519 99832183 99510866 99446279 99555755 99664479 99705619 99692488 99721676 99733198
$$ packed form
3683.5I8149049K17754J85740m488j03647k1046N6177Q1861O4969R36k694Q9985J45149
3708I8859745N8764j16217j10715J5628O3610N1642L1501J5252J0008O7735J52373
3730.4I9099326J53959K0748j15174l7855J27733R9319q7905j9359Q5324r5743j66881
3752.9I9063492M840O8164j1039l3480M2981P4297N2130o079n1368J67P4786Q6683
3777.3I9365574K0582k4480n132m154k647J8013M2629O3527N1438O3712M9883o2889
3801.8I9576056n0598k7424r7991j6832J20706J25718L6794M5442P260j33836p8887
3824.3I9506408J3143M4167O3896O6602R7353M8941r3258j05476n5247m8990K3115
3846.7I9560654J63543J97322q9336l21317o4587J09476J08724M1140j3131K9188J1522
$$ plain form
3869.1 99733198 99670476 99615663 99586421 99615479 99653882 99654925 99675518 99646872 99597424 99603528 99566001 99518824
3893.6 99518824 99577624 99688417 99754244 99737030 99640691 99547523 99542570 99589175 99646378 99719256 99771178 99772137
3918.1 99772137 99773270 99799722 99808782 99812418 99848413 99874240 99855703 99836391 99847448 99884856 99933165 99957818
3942.5 99957818 99970067 100000000 100023174 100025141 100026023 100037420 100052774 100060213 100058699 100056601 100055444 100056219 100063431 100069582
3971.1 100069582 100072145 100081396 100102878 100136948 100176489 100201821 100206220 100208962 100219810 100229299 100232768 100235724 100239074
3997.6 100239074
$$ packed form
3869.1I9733198o2722n4813k9242K9058L8403J043K0593k8646m9448O104l7527m7177
3893.6I9518824N8800J10793O5827j7214r6339r3168m953M6605N7203P2878N1922R59
3918.1I9772137J133K6452R060L636L5995K5827j8537j9312J1057L7408M8309K4653
3942.5I9957818J2249K9933K3174J967Q82J1397J5354P439j514k098j157P75P212O151
3971.1A00069582K563R251K1482L4070L9541K5332M399K742J0848R489L469K956L350
3997.6A00239074
##END=$$ End of the data block
