##TITLE=ImClCH3 $$ Begin of the data block
##JCAMP-DX=5.00 $$ ACD/SpecManager v 10.08
##SPECTROMETER/DATA SYSTEM=Alpha
##DATE=08 Jun 2015 09:26:56
##DATA TYPE=INFRARED SPECTRUM
##DATA CLASS=XYDATA
##ORIGIN=
##OWNER=
##NPOINTS=1765
##FIRSTX=399.76428223
##LASTX=3997.64306641
##MAXX=3997.64306641
##MINX=399.76428223
##MAXY=1.00170648
##MINY=0.50995517
##XFACTOR=1.0000000000
##YFACTOR=0.000000010000000
##FIRSTY=1.00000000
##DELTAX=2.03961372
##XUNITS=1/CM
##YUNITS=ARBITRARY UNITS
##XYDATA=(X++(Y..Y))
399.8A00000000j167929j287949j569295j955551k028352j792735j309395N15258L984803
418.1I3388855M905063J706082l2175l21406l10683l55250k51281j25068k37155k70880
438.5I8096102o0308m7481k37673j90175p8612j46944j50001K003l6800k50888k12925
461I6686298j27948k20328j96845m7034j16276l36832l53646l61741o01834q71825
481.3I3451989j308334j986295j973713o17754J030683J301140J60003o39016J06573
499.7H9525276J533902J914835J012540j925m21137m90093o47473q13866q94582j111269
520.1H9606208j469195j826179k498669l882605n930358p170832n151927j829929j318603
538.5E8527911p48039M194642R528839R883458O627476L600007K017111J343214R16565
$$ y = [100000000, 98832071, 97544122, 95974827, 94019276, 91990924, 90198189, 88888794, 89404052, 93388855, 98293918, 100000000, 99967825, 99646419, 99335736, 98980486, 98729205, 98604137, 98366982, 98096102, 98035794, 97988313, 97750640, 97560465, 97481853, 97334909, 97184908, 97186911, 97150111, 96899223, 96686298, 96558350, 96338022, 96141177, 96094143, 95977867, 95641035, 95287389, 94925648, 94323814, 93451989, 92143655, 90157360, 88183647, 87565893, 88596576, 89897716, 90057719, 89418703, 89525276, 91059178, 92974013, 93986553, 93984628, 93563491, 93073398, 92425925, 91612059, 90717477, 89606208, 88137013, 86310834, 83812165, 79929560, 73999202, 66828370, 61676443, 59846514, 58527911, 57779872, 61974514, 71503353, 81386811, 88014287, 91614294, 93631405, 94974619, 95891184]
556.8I5891184N99438M94009M21685K47437J34831J14763M1401m1991l100N0253j669
579.3I7948241l9124L135O676n3609l5029J4734k9671o8397L201M0698k5475l3563
603.7I7731817K8193J3548m7469j5706J0192o1530q6724j8788n4419j94847m09603
626.2I6894664n11599J5956O40142M82047n5343o24019r84669o9499J252389J069844
646.6I8109913K58595m9544j56873j23877l9058j20003k04610j10984K7484N9396j16778
669I7533661k40511k71898l98547n65904r91160j654738j569038M2003K006209K454400
689.4I6344477J460957L53611l09300n62156n28341m28874k97075j42545l03280j002747
709.8I4584727k334583m877930p122499l828663M740399R073794N909068J895803L57675
$$ y = [95891184, 96490622, 96984631, 97406316, 97653753, 97788584, 97903347, 97944748, 97902757, 97899657, 97949910, 97948241, 97909117, 97912252, 97918928, 97865319, 97830290, 97845024, 97815353, 97746956, 97750157, 97790855, 97765380, 97731817, 97760010, 97773558, 97726089, 97710383, 97720575, 97659045, 97572321, 97553533, 97499114, 97304267, 96894664, 96383065, 96399021, 97039163, 97521210, 97465867, 96841848, 95857179, 95787680, 97040069, 98109913, 98368508, 98318964, 98162091, 98038214, 97999156, 97879153, 97674543, 97563559, 97591043, 97650439, 97533661, 97293150, 97021252, 96622705, 96056801, 95065641, 93410903, 91841865, 91883868, 93890077, 96344477, 97805434, 98159045, 97849745, 97287589, 96759248, 96330374, 96033299, 95890754, 95587474, 94584727, 92250144, 87372214, 80249715, 76421052, 81161451, 90235245, 96144313, 98040116, 98397791]
728.1I8397791j1688k06792k17653j38044j89459k46537j63514j27124k24245k41983
748.5I6630752j92821k84606m30542m81791o43480j076489j575351j541108k42704
766.9I0161860J615393K099699J066607K4659l45534l42346l72958m76497m80759m54432
787.3I2495692n46867o44487o59412p43187r28425j082993j238281j525384j891720
805.6H3234936k304578k868974l350419l098327k051610j298302j904958l431988m397971
824E8527809m108375k775145o48772Q46004L89588N00423L331953N901033N700201
842.4F7664719M447353L840923L328019K516657K215362K513331K424735J720709R60999
860.7I1632807M09979J04844q428j34515l66581o68967j171761k002746k626407j681310
$$ y = [98397791, 98386103, 98179311, 97961658, 97823614, 97634155, 97387618, 97224104, 97096980, 96872735, 96630752, 96437931, 96153325, 95722783, 95240992, 94597512, 93521023, 91945672, 90404564, 90161860, 91777253, 93876952, 94943559, 94968218, 94622684, 94280338, 93907380, 93430883, 92950124, 92495692, 91948825, 91304338, 90644926, 89901739, 88973314, 87890321, 86652040, 85126656, 83234936, 80930358, 78061384, 74710965, 71612638, 69561028, 68262726, 66357768, 62925780, 58527809, 54419434, 51644289, 50995517, 51841521, 52231109, 52731532, 56063485, 61964518, 67664719, 72112072, 75952995, 79281014, 81797671, 84013033, 86526364, 88951099, 90671808, 91632807, 92042786, 92147630, 92139202, 92004687, 91638106, 90969139, 89797378, 87794632, 85168225, 83486915]
881.1H3486915J437181M590493N011452L142130J278311L66753J27107Q9854N377m1336
901.5I9494237q703m1270j22958j05238n8741j10131j48743r4671q8298j54275j48695
923.9I8412514j08260j79005k99030l94005o79511j311511j780468j399612n34642
942.3I1726470L6454L90393P18206Q12352P10928M98116j95974j569003k626634k167737
962.7H8333571j092327q65900q56656k61033N25433J280755J915449K001429J558542
981.1I2539263J032948N50354J42157n0426p6067j50305k88230m06373o13510r53234
1001.4I1726577j199400j609582l179890n537766m326689L498626J0224050P828933
1017.8I7424859J767713r91893j275909j121694j004028j011712j036340r41896p76869
$$ y = [83486915, 84924096, 89514589, 94526041, 97668171, 98946482, 99313235, 99440342, 99530196, 99535573, 99494237, 99485534, 99444264, 99321306, 99216068, 99157327, 99047196, 98898453, 98803782, 98715484, 98561209, 98412514, 98304254, 98125249, 97826219, 97432214, 96752703, 95441192, 93660724, 92261112, 91726470, 91762924, 92153317, 92871523, 93683875, 94394803, 94892919, 94696945, 93127942, 90501308, 88333571, 87241244, 86375344, 85518688, 85257655, 85783088, 87063843, 88979292, 90980721, 92539263, 93572211, 94122565, 94264722, 94214296, 94138229, 93987924, 93699694, 93293321, 92679811, 91726577, 90527177, 88917595, 85737705, 80199939, 75873250, 79371876, 89595926, 97424859, 99192572, 98200679, 96924770, 95803076, 94799048, 93787336, 92750996, 91809100, 91032231]
1036.1I1032231n91391l30085l4654J52123K17873K44903J97542M4346j20872k50459
1056.5I0561557m25285n96136o40381o94125r23652j132285j157248j318270k008045
1074.9H1666130l154177m148936l946066j550710K827364P085204Q203572N109609
1091.2I2091990P8052m093468n682242l544820M76653K617639K470636J711136R99612
1109.6H7125188J269943K600216L209115K537155J606965R38695M72552J52814N514
1127.9I9918157k1452n8055j18541j35088j45537j96761k25824k07305k09451k43926
1148.3I8356217k44325k41059k79999l00729l12400m75437q97711j359254j129258
1166.7I3116045J50144J459235J644212Q92454R0385l56227o58149j183766j961672
$$ y = [91032231, 90440840, 90110755, 90076101, 90228224, 90446097, 90691000, 90888542, 90932888, 90812016, 90561557, 90136272, 89540136, 88899755, 88205630, 87281978, 86149693, 84992445, 83674175, 81666130, 78511953, 74363017, 70416951, 68866241, 71693605, 78778809, 86982381, 92091990, 92170042, 88076574, 82394332, 78849512, 79326165, 81943804, 84414440, 86125576, 87125188, 88395131, 90995347, 94204462, 96741617, 98348582, 99287277, 99759829, 99912643, 99918157, 99896705, 99838650, 99720109, 99585021, 99439484, 99242723, 99016899, 98809594, 98600143, 98356217, 98111892, 97870833, 97590834, 97290105, 96977705, 96502268, 95604557, 94245303, 93116045, 93266189, 94725424, 96369636, 97262090, 97352475, 96996248, 96338099, 95154333, 93192661]
1185I3192661k014101j18625K410573K835113J435768K83903j42062k77060l83425
1203.4I7222745o03336r39542j103514n59092N74768J205951Q77052K94185j5080j27345
1223.8I6826792k31201l69346m69535m35865j99759J87158M79675M71484K47890K7615
1244.2I6534908q9455j34927j39344j06155p1097p7450j08171j39397j84596k38114
1264.6I5246202k81400l62807n73123q66896r03701k36917P75623R96858L81732J5533
1285I4191104J03432K8473m02844j003277j348603n74493J048612J587439N93847m20892
1305.4I3802798m93974J71197O45762M19647k0868k44021l19952l55571l47996k84815
1325.8I2972207j94532j39743j38306j63180k19196l61609o27769r52625j319194j774054
$$ y = [93192661, 91178560, 91059935, 93470508, 96305621, 97741389, 98025292, 97883230, 97606170, 97222745, 96619409, 95679867, 94576353, 94017261, 94592029, 95797980, 96675032, 96969217, 96954137, 96826792, 96595591, 96226245, 95756710, 95320845, 95121086, 95308244, 95787919, 96259403, 96507293, 96534908, 96445453, 96310526, 96171182, 96065027, 95993930, 95916480, 95808309, 95668912, 95484316, 95246202, 94964802, 94601995, 94028872, 93161976, 92258275, 92021358, 92796981, 93793839, 94175571, 94191104, 94294536, 94323009, 93920165, 92916888, 91568285, 90993792, 92042404, 93629843, 94223690, 93802798, 93308824, 93480021, 94125783, 94545430, 94524562, 94280541, 93960589, 93605018, 93257022, 92972207, 92777675, 92637932, 92499626, 92336446, 92117250, 91755641, 91127872, 90175247, 88856053, 87081999]
1346.2H7081999k193356k290636j778871p15047L72022R46635J023513R66829J071459
1364.5H4484547J326627J360810R23276L69465J86241N76478J109046J080280N45800
1382.9I1962570J42842k7877k21806l40188m09853p05111j244373k143806l078133
1401.2H3934265k307284R12488L529257K910298J094013K10256K57122M33731K67416
1419.6I1241562l0934j30773j91540k28792k72197l40265k95788k86680m50617m78351
1440H8535625l73078k80785j98800j91503j80990l8957J77502K73639j8263k52598
1460.4H7451792j55401j38623l11691l49658l23773o22898j160985j543737j816165
1478.7H1028861j868653j161039M28736J851064K190977J617128Q91316K67070q63838
$$ y = [87081999, 84888643, 82598007, 80819136, 80104089, 80476111, 81422746, 82446259, 83413088, 84484547, 85811174, 87171984, 88095260, 88464725, 88650966, 89227444, 90336490, 91416770, 91962570, 92105412, 92077535, 91855729, 91515541, 91105688, 90400577, 89156204, 87012398, 83934265, 81626981, 82539469, 86068726, 88979024, 90073037, 90283293, 90540415, 90974146, 91241562, 91210628, 91079855, 90888315, 90659523, 90387326, 90047061, 89751273, 89464593, 89013976, 88535625, 88162547, 87881762, 87682962, 87491459, 87310469, 87271512, 87449014, 87722653, 87704390, 87451792, 87296391, 87157768, 86846077, 86496419, 86172646, 85549748, 84388763, 82845026, 81028861, 79160208, 77999169, 78427905, 80278969, 82469946, 84087074, 84978390, 85245460, 84381622]
1497.1H4381622k620697m174101m154474J24484R329772J0581100N036116J496178
1513.4A00000000J8311m10450m91732n73582n41693k89625k10982k34872j65934k07156
1533.8I6892285k22218J2994K3663m71419p28816o83641n61595n51254o54649p05362
1554.2I2349988o46829j322860l113913l341485k214163N68074L530490K756822j38479
1572.6H8427645n24259N93239L52097p75385j471782j678747j561242j096779O8402
1590.9H2333189J762599K607006J797944P13140M49711M01896J35124q7893k34860
1609.3H9877856m70686p55340j458216l000873m156679m569513l182518J913756O703258
1627.6H0901045O687873L500486J387018M95028j88255l87091k07036J04612K65515
$$ y = [84381622, 81760925, 77586824, 73432350, 73556834, 82886606, 93467706, 98503822, 100000000, 100018311, 99607861, 99116129, 98542547, 98000854, 97711229, 97500247, 97265375, 97099441, 96892285, 96670067, 96683061, 96706724, 96235305, 95506489, 94822848, 94261253, 93709999, 93055350, 92349988, 91703159, 90380299, 87266386, 83924901, 81710738, 82278812, 85809302, 88566124, 88427645, 87903386, 88496625, 88848722, 88073337, 86601555, 84922808, 83361566, 82264787, 82333189, 84095788, 86702794, 88500738, 89213878, 89663589, 90065485, 90200609, 90112716, 89877856, 89407170, 88651830, 87193614, 84192741, 80036062, 75466549, 72284031, 74197787, 80901045, 87588918, 91089404, 92476422, 92971450, 92783195, 92396104, 92189068, 92293680, 92559195]
1646I2559195P8439J10764M89121L63249p2730J04296M00657M69840L29160K96223
1666.4I5128214L93117L20816K17688K30861J31863Q8209K52032L72577J09512j95116
1686.8I7049773r9385K6214J56689L14611K89720J54716m6360j59175j00678j20455
1707.2I7465670j20586j7226J14334K16693R6392k10261k34646r1100k7608J4811J20139
1729.6I7326612K33764J63716j02937r7901M953l7187m3106L5411O5100n0062k03985
1752I7294378j81067j06179r7353o9767q9043j07760L7218K02566K28506P8833j16962
1774.5I7073370j43587q9276p0816q4764j05453r1654K0546J08629n185j15776l0357
1796.9I6465677N7614L6460L833L8057R2924J22696R4032K5010L720K9611M8608O7097
$$ y = [92559195, 92637634, 92748398, 93237519, 93600768, 93528038, 93632334, 94032991, 94502831, 94831991, 95128214, 95521331, 95842147, 96059835, 96290696, 96422559, 96510768, 96762800, 97135377, 97244889, 97049773, 96950388, 96976602, 97133291, 97447902, 97737622, 97892338, 97845978, 97686803, 97586125, 97465670, 97345084, 97327858, 97442192, 97658885, 97755277, 97545016, 97310370, 97219270, 97191662, 97206473, 97326612, 97560376, 97724092, 97621155, 97523254, 97528207, 97491020, 97447914, 97483325, 97548425, 97498363, 97294378, 97113311, 97007132, 96909779, 96840012, 96750969, 96643209, 96680427, 96882993, 97111499, 97190332, 97073370, 96929783, 96840507, 96769691, 96684927, 96579474, 96487820, 96508366, 96616995, 96611810, 96496034, 96465677, 96523291, 96559751, 96563584, 96601641, 96694565, 96817261, 96911293, 96936303, 96940023, 96969634, 97018242, 97085339]
1821.4I7085339R3120Q1843N0474n222j00976r8819l8820l0387n436O5619M2790r7292
1845.9I7042233j43004j03265p3188m4525j5998j1456k4736j9574J6779O1297K6971
1868.3I6711534j04493j69313j43075j22833j28335j45548j52791j32388r4097q2350
1888.7I5436311j08224j01442q5926j27774j93131k76876l88377m45277l78567k50178
1909.1I3080539j46652l9726J25462K94572L90577M44877M47041L43144K17909J10018
1929.5I5267761q130r8396j12557n9813K3061R7489J29575J35165J32138J16181R1892
1951.9I5714366N6905K5958K4277L7056M5711P0697R1022N3370k593j8352k4772m7892
1976.4I6025753n0974k2197n346q971J097K1648J6213j6111k6614j1939j5991k3413
$$ y = [97085339, 97178459, 97260302, 97310776, 97305554, 97204578, 97105759, 97066939, 97036552, 97031116, 97096735, 97139525, 97042233, 96899229, 96795964, 96722776, 96678251, 96662253, 96650797, 96626061, 96606487, 96623266, 96684563, 96711534, 96607041, 96437728, 96294653, 96171820, 96043485, 95897937, 95745146, 95612758, 95518661, 95436311, 95328087, 95226645, 95140719, 95012945, 94819814, 94542938, 94154561, 93709284, 93330717, 93080539, 92933887, 92894161, 93019623, 93314195, 93704772, 94149649, 94596690, 94939834, 95157743, 95267761, 95259631, 95161235, 95048678, 94988865, 95011926, 95109415, 95238990, 95374155, 95506293, 95622474, 95714366, 95771271, 95797229, 95821506, 95858562, 95904273, 95974970, 96065992, 96119362, 96116769, 96098417, 96073645, 96025753, 95974779, 95952582, 95947236, 95938265, 95939362, 95961010, 95977223, 95961112, 95934498, 95922559, 95906568, 95883155]
2000.9I5883155r924l285m541J4311L2842K4277J4049M565l5619q5271j03605n7745
2025.4I5673209M2946R1123N5915J2136j6272j6970K998k02k0725k1720j3405j4788
2049.8I5774245m136K0861K2376P1o908l749j8155l0816j5038j687j0854l922K2244
2076.4I5744532K5905Q213O318J1397j437o443R572J3274J109N424J7136O509o044
2102.9I5835465Q11k62j4532n597J6481N108j9121j1617j604j3691j1676J0341J1486
2129.4I5801592q768r054N382j96k754K2834L7098K3932K1809L0279J5748n698j395
2155.9I5930809P021m738p701P355K772j4055k980J2117m965k1672j4025p934m643
2182.4I5877361J4186K8217J3411l976J932R131K21n490p87j693l510N436P885n614
$$ y = [95883155, 95873231, 95869946, 95865405, 95879716, 95912558, 95936835, 95950884, 95955449, 95919830, 95834559, 95730954, 95673209, 95716155, 95807278, 95863193, 95875329, 95859057, 95842087, 95845085, 95844883, 95824158, 95802438, 95789033, 95774245, 95770109, 95790970, 95813346, 95813417, 95806509, 95802760, 95784605, 95753789, 95738751, 95737064, 95726210, 95722288, 95744532, 95770437, 95778650, 95784968, 95796365, 95794928, 95788485, 95798057, 95811331, 95812440, 95817864, 95835000, 95841509, 95835465, 95836276, 95836014, 95821482, 95815885, 95832366, 95837474, 95818353, 95806736, 95805132, 95791441, 95779765, 95790106, 95801592, 95792824, 95783770, 95789152, 95788956, 95786202, 95809036, 95846134, 95870066, 95891875, 95922154, 95937902, 95932204, 95930809, 95937830, 95933092, 95925391, 95932746, 95935518, 95921463, 95918483, 95930600, 95925635, 95903963, 95889938, 95882004, 95877361, 95891547, 95919764, 95933175, 95929199, 95931131, 95940262, 95940483, 95934993, 95934206, 95932513, 95929003, 95934439, 95942324, 95936710]
2211I5936710p910L940j61j5461j4556n144j1742j8632q750q565k4009k4748j2070
2237.5I5788902j2618j7405q982m810j7292k3770j2171o998j8489l4994o6948j31232
2262I5433193k03305k29627j71947k9612J34236K04569J34754J5879l7587r310M7540
2284.4I5288783R2030J13493J04803O4897K3365K307l767Q810L5053L5715J860J127
2308.9I5768476P1680J39320J30939P7129L0553J4019O0052J47086J82456J33801O1959
2331.3I6817470K1541L087j949R507N931m6122j12427q1259L4357J31928J64831J41597
2355.8I7088492Q8638L9226J1551l2192r0516j40273j77503j93369j87272j66113j47151
2378.2I6093518j36441j05471n2279j9914j9467k3156k5964k6405m715K6334L1757
$$ y = [95936710, 95928800, 95932740, 95932579, 95917118, 95902562, 95897418, 95885676, 95867044, 95858294, 95849729, 95825720, 95800972, 95788902, 95776284, 95758879, 95749897, 95745087, 95727795, 95704025, 95691854, 95684856, 95666367, 95631373, 95564425, 95433193, 95229888, 95000261, 94828314, 94798702, 94932938, 95137507, 95272261, 95288140, 95250553, 95241243, 95288783, 95380813, 95494306, 95599109, 95664006, 95687371, 95689678, 95685911, 95694721, 95729774, 95765489, 95767349, 95768476, 95840156, 95979476, 96110415, 96187544, 96218097, 96232116, 96292168, 96439254, 96621710, 96755511, 96817470, 96839011, 96842098, 96840149, 96849656, 96855587, 96809465, 96697038, 96615779, 96650136, 96782064, 96946895, 97088492, 97177130, 97216356, 97227907, 97195715, 97105199, 96964926, 96787423, 96594054, 96406782, 96240669, 96093518, 95957077, 95851606, 95799327, 95779413, 95759946, 95736790, 95710826, 95684421, 95679706, 95706040, 95737797]
2400.6I5737797J2177K212J0532Q303q422j7602j6129j0383P630L1441L0726Q816l28
2427.2I5796770L630k492q017K903O455r107j7953j1295r436j1724l844j73r495r787
2455.7I5716435j180p672k0217j1617R119J5503J0431R024O891L647J1033J6356L773
2482.2I5761526p350K528J5437R030O02L839J91j3727j7006o902q64q9J794p516k9427
2512.8I5712066m1467l7945l0708j2445K3615M2141K2029M900Q285J591j4758j2821
2537.3I5664483l850j3977k6018k2846k2775l2342l3569k9981l8898m8620l8135j7327
2561.8I5336145q035j3494l5298o1923m9073J7548P7581P9489N5891N0098N3352M9108
2586.2I5551389M5419M2927L0470K0075K2477K4295K1118K3520K9945K6363J5629J2159
$$ y = [95737797, 95749974, 95752186, 95762718, 95771021, 95762599, 95744997, 95728868, 95718485, 95726115, 95757556, 95788282, 95797098, 95796770, 95800400, 95797908, 95789891, 95792794, 95799249, 95790142, 95772189, 95760894, 95751458, 95739734, 95735890, 95735717, 95726222, 95716435, 95715255, 95707583, 95687366, 95675749, 95684868, 95700371, 95710802, 95719826, 95726717, 95730364, 95741397, 95757753, 95761526, 95754176, 95756704, 95772141, 95781171, 95781773, 95785612, 95785803, 95772076, 95755070, 95748168, 95747304, 95747215, 95749009, 95741493, 95712066, 95670599, 95632654, 95601946, 95589501, 95613116, 95655257, 95677286, 95682186, 95690471, 95692062, 95677304, 95664483, 95660633, 95646656, 95620638, 95597792, 95575017, 95542675, 95509106, 95479125, 95440227, 95391607, 95353472, 95336145, 95328110, 95314616, 95279318, 95217395, 95168322, 95185870, 95263451, 95342940, 95398831, 95448929, 95502281, 95551389, 95596808, 95639735, 95670205, 95690280, 95712757, 95737052, 95758170, 95781690, 95811635, 95837998, 95853627, 95865786]
2610.7I5865786J1015M107K032O539J854q601p695m828j4901k2287j4078j1319k3526
2637.2I5784098l3057l5178l8505m1115k8557o789K390O443J7304K2530J7590R358
2661.7I5676512J275n233j1599j0538k128j979n269l922j1683k3865j9831r596j4132
2688.2I5558012k0582j2672r102k3204l7390l8528l6353l4153k4736j8555k5708l3235
2712.7I5243794l4774m6777p0334q4996p9030m7952J1540Q8906J43671J43874J10417
2735.1I5378339P2605L1352N06k783m059k4760m4417m7124m6742m9561m3798l9976
2759.6I5179582n1934o1178n5212n1594n5545n3931n7107p5674p0518j0169N3567O3658
2784.1I4753945M4149K3991p975l6144l3719k8252n1219p4976p3678p0929q3411q8507
$$ y = [95865786, 95876801, 95880908, 95882940, 95889479, 95891333, 95882732, 95875037, 95870209, 95855308, 95833021, 95818943, 95807624, 95784098, 95751041, 95715863, 95677358, 95636243, 95607686, 95600897, 95603287, 95609730, 95627034, 95649564, 95667154, 95676512, 95677787, 95672554, 95660955, 95650417, 95648289, 95646310, 95641041, 95637119, 95625436, 95601571, 95581740, 95572144, 95558012, 95537430, 95524758, 95515656, 95492452, 95455062, 95416534, 95380181, 95346028, 95321292, 95302737, 95277029, 95243794, 95209020, 95162243, 95091909, 95006913, 94927883, 94879931, 94891471, 94980377, 95124048, 95267922, 95378339, 95450944, 95482296, 95482802, 95480019, 95475960, 95451200, 95406783, 95359659, 95312917, 95263356, 95219558, 95179582, 95127648, 95066470, 95011258, 94959664, 94904119, 94850188, 94793081, 94717407, 94646889, 94636720, 94690287, 94753945, 94798094, 94822085, 94814110, 94777966, 94744247, 94715995, 94664776, 94589800, 94516122, 94445193, 94361782, 94273275]
2808.6I4273275p5173o1280n2678m8238n7120p9280r6202j04659j24544j53733j73151
2831I3247217j92839k31028k74640l24696m00210m84007n52988o23328p06202p43287
2851.4H8713992o42830l93546j06788P5197Q8317k9827j81126k89953l45987l65996
2871.8H6521453l46971k44349k2310K74438N50049P22951P63339P02250N78957M10468
2892.2H9910275K16526J8197j61475k71744k60925j57249q8012j32340k17146k29818
2912.6H8626289j07568J49721M38088O00254N70816M11803K20483M7773r2077j76626
2933I0688956j97727j77586j21802k2769R3240J88666K54160K84708K62111J89293
2953.4I1441250J01834K3795m1807q1754q3840o0552l5584k2829k4032l0756k5130
$$ y = [94273275, 94198102, 94136822, 94084144, 94035906, 93978786, 93899506, 93803304, 93698645, 93574101, 93420368, 93247217, 93054378, 92823350, 92548710, 92224014, 91823804, 91339797, 90786809, 90163481, 89457279, 88713992, 88071162, 87677616, 87570828, 87646025, 87734342, 87704515, 87523389, 87233436, 86887449, 86521453, 86174482, 85930133, 85907823, 86182261, 86732310, 87455261, 88218600, 88920850, 89499807, 89910275, 90126801, 90144998, 89983523, 89711779, 89450854, 89293605, 89205593, 89073253, 88856107, 88626289, 88518721, 88668442, 89106530, 89706784, 90277600, 90689403, 90909886, 90957659, 90865582, 90688956, 90491229, 90313643, 90191841, 90169072, 90262312, 90450978, 90705138, 90989846, 91251957, 91441250, 91543084, 91566879, 91525072, 91443318, 91359478, 91298926, 91263342, 91240513, 91216481, 91185725, 91160595]
2975.8I1160595j615J4228J2833J9216M7523R8288J72901K55925L10731L19987K91830
2998.2I2702442K41036J89423J47796J07443N8794m935r3341k07722l45790n01615
3018.6I2293531o39451o78319n34862k02244J78337L83562L84104L70413M23449M51845
3039I2430365M08423L28594K04081J2827j52815j48523M6570K64322L02118J57178
3059.4I3853140L290n728J34206K59471K28452P9620q4746k22677l34203m02593l83681
3081.9I3124551k48892j9264K15823L25375K82419K08026J91713K13301K27582K13874
3102.2I4734508J87641J67710J39123J00487Q8889R8985Q2648L9852q512n3650o8480
3124.7I5509201m7886j7679Q375J7923O288r716k5522m3875m9156m0716l6121l2067
$$ y = [91160595, 91158980, 91173208, 91186041, 91205257, 91252780, 91351068, 91523969, 91779894, 92090625, 92410612, 92702442, 92943478, 93132901, 93280697, 93388140, 93446934, 93441999, 93348658, 93140936, 92795146, 92293531, 91654080, 90975761, 90440899, 90238655, 90416992, 90800554, 91184658, 91555071, 91978520, 92430365, 92838788, 93167382, 93371463, 93384290, 93231475, 93082952, 93129522, 93393844, 93695962, 93853140, 93856430, 93850702, 93984908, 94244379, 94472831, 94552451, 94467705, 94245028, 93910825, 93508232, 93124551, 92875659, 92856395, 93072218, 93397593, 93680012, 93888038, 94079751, 94293052, 94520634, 94734508, 94922149, 95089859, 95228982, 95329469, 95418358, 95517343, 95599991, 95639843, 95631331, 95577681, 95509201, 95461315, 95443636, 95452011, 95469934, 95476222, 95466506, 95440984, 95397109, 95347953, 95307237, 95271116, 95239049]
3149.2I5239049k9331m9263p4649p3153o2865n8407m8828m0197l9035m1211m4328n0908
3173.6I4626874o1459p4827r3389j08945j06156q3375n2643l1036k6250l4076n0300
3196.1I3904418o6936q2797j00297j10066j10495j12682j14733j03933q6600o9695
3216.5I2946184n1982m5144n4783o6989o8289o3712o5857q6910j21641j37508j28710
3238.9I2054659j07545o5398k0706p171j9306l4612n0456p0047q4209q8114q7261p8589
3263.4I1341245n9396l8278k6172l5799o0433q3232r4271q5848p8786q4179q3429p2724
3287.8I0538698o3848p3272j00780j24317j37216j35308j08475q4698j07479j61374
3308.2H9441931j92559j90722j79190j77020j87754j94532j87498j85895k11835k36398
$$ y = [95239049, 95209718, 95160455, 95085806, 95012653, 94949788, 94891381, 94842553, 94802356, 94763321, 94722110, 94677782, 94626874, 94565415, 94490588, 94397199, 94288254, 94182098, 94098723, 94046080, 94015044, 93988794, 93954718, 93904418, 93837482, 93754685, 93654388, 93544322, 93433827, 93321145, 93206412, 93102479, 93015879, 92946184, 92894202, 92849058, 92794275, 92727286, 92658997, 92595285, 92529428, 92442518, 92320877, 92183369, 92054659, 91947114, 91881716, 91861010, 91853839, 91834533, 91799921, 91749465, 91679418, 91595209, 91507095, 91419834, 91341245, 91281849, 91243571, 91217399, 91181600, 91121167, 91037935, 90943664, 90857816, 90779030, 90694851, 90611422, 90538698, 90474850, 90401578, 90300798, 90176481, 90039265, 89903957, 89795482, 89710784, 89603305, 89441931, 89249372, 89058650, 88879460, 88702440, 88514686, 88320154, 88132656, 87946761, 87734926, 87498528]
3328.6H7498528k36821k36476k33257k24518k40064k73401k87914k87950k82258k69955
3349H4925914k84571l22777l36355l21358l08430l19517l30257l06821k85137l09789
3369.4H1800902l55500l58665l16429k88981k85101k77722k66218k50137k10780j63567
3389.8G9027802j75047k32190k30700j65725j38616j84274k21836j92768j50198j37406
3410.2G7199042j42306j50216j34426j00059r2047j00446q1682m3470j7517j6010j4371
3432.7G6306492K879M83k0075q142L0547O1691P7504P4810P2485Q6939J06496J24544
3457.1G6916653J37949J31303J22702J45578J69492J43338R8294J08194J54388J81621
3477.5G8309512J80209J54340J40959J59443J63948J51265J62226J86568J94651J82510
$$ y = [87498528, 87261707, 87025231, 86791974, 86567456, 86327392, 86053991, 85766077, 85478127, 85195869, 84925914, 84641343, 84318566, 83982211, 83660853, 83352423, 83032906, 82702649, 82395828, 82110691, 81800902, 81445402, 81086737, 80770308, 80481327, 80196226, 79918504, 79652286, 79402149, 79191369, 79027802, 78852755, 78620565, 78389865, 78224140, 78085524, 77901250, 77679414, 77486646, 77336448, 77199042, 77056736, 76906520, 76772094, 76672035, 76579988, 76479542, 76397860, 76354390, 76336873, 76320863, 76306492, 76309371, 76309854, 76289779, 76281637, 76312184, 76373875, 76451379, 76526189, 76598674, 76685613, 76792109, 76916653, 77054602, 77185905, 77308607, 77454185, 77623677, 77767015, 77865309, 77973503, 78127891, 78309512, 78489721, 78644061, 78785020, 78944463, 79108411, 79259676, 79421902, 79608470, 79803121, 79985631]
3497.9G9985631J83403J98340J78385J54793J72347J89489J88923J85156J81973J94061
3518.3H1812501K22659K42084K22409J86145J76263J83350J98376K23637K20889J98686
3538.7H3886999K27761K81608K73872K03341J70600K03967K13331J90467K08271K58708
3559.1H6118925K96747L25781L39753K83480J77776J52159K10583K68424K97201L12262
3579.5H8783091L33685L77691L98922L26580K31599K45470L10171L22831L02368K91055
3599.9I1923463K83528K98518L40819L59726L22711K88523K82895K76345K71100K21706
3620.3I4869334J66571K26503L31420L24953J47426L4421O7002J06412J22947J43748
3640.7I6540737J88744K77609L51178K53177j9783j39540o7687o568k6745k9874K8950
$$ y = [79985631, 80169034, 80367374, 80545759, 80700552, 80872899, 81062388, 81251311, 81436467, 81618440, 81812501, 82035160, 82277244, 82499653, 82685798, 82862061, 83045411, 83243787, 83467424, 83688313, 83886999, 84114760, 84396368, 84670240, 84873581, 85044181, 85248148, 85461479, 85651946, 85860217, 86118925, 86415672, 86741453, 87081206, 87364686, 87542462, 87694621, 87905204, 88173628, 88470829, 88783091, 89116776, 89494467, 89893389, 90219969, 90451568, 90697038, 91007209, 91330040, 91632408, 91923463, 92206991, 92505509, 92846328, 93206054, 93528765, 93817288, 94100183, 94376528, 94647628, 94869334, 95035905, 95262408, 95593828, 95918781, 96066207, 96100628, 96167630, 96274042, 96396989, 96540737, 96729481, 97007090, 97358268, 97611445, 97591662, 97452122, 97384435, 97377867, 97351122, 97321248, 97350198]
3663.1I7350198J30338K30765K58303J91235J40363R7174n2155j30957n6857O7073
3683.5I8225480J86670K57993J59740m9978j05465k8038N1922Q7023N4317k670L0935
3706I8867929J34295J39260k2155j44374r8771R334Q6046R2053L8403K420L8791J36119
3730.4I9279350K23315J50156n0491j16968j9420Q7327J00601L3241J3274k9558j41698
3752.9I9529129j31440l8201j4418m5818k2817M0645O0773L1250k6309n3334N471P8571
3777.3I9413502N9843k2995l5817J747M357p33K0700O0571J02472J10942Q3846L1924
3801.8I9830359m8947q7166r6381q3047Q065J17212J63621J21754L6937p7474j46788
3824.3I9738145q9240k355N0265R6905J18977Q7303M816q9294j35284j18465l7461
$$ y = [97350198, 97480536, 97711301, 97969604, 98160839, 98301202, 98398376, 98346221, 98215264, 98158407, 98225480, 98412150, 98670143, 98829883, 98779905, 98674440, 98646402, 98698324, 98785347, 98839664, 98836994, 98867929, 99002224, 99141484, 99119329, 98974955, 98876184, 98885518, 98971564, 99063617, 99102020, 99104440, 99143231, 99279350, 99502665, 99652821, 99602330, 99485362, 99465942, 99553269, 99653870, 99687111, 99700385, 99670827, 99529129, 99397689, 99359488, 99345070, 99299252, 99276435, 99317080, 99377853, 99409103, 99382794, 99329460, 99334931, 99413502, 99473345, 99450350, 99414533, 99416280, 99420637, 99419904, 99440604, 99501175, 99603647, 99714589, 99798435, 99830359, 99781412, 99694246, 99597865, 99514818, 99522883, 99640095, 99803716, 99925470, 99962407, 99884933, 99738145, 99648905, 99646550, 99696815, 99793720, 99912697, 100000000, 100004816, 99915522, 99780238, 99661773, 99624312]
3846.7I9624312R4497J95402J31017j01340j84977q8668L1311P9792M5288J7893K8813
3869.1I9873340n895p9989r3669m2641L3402N9587J6326k3031n0587l6365j4865m3827
3893.6I9591786j9926P9101J31864P9840k8998j15812j09434m0573K1750O0547P5090
3916I9725235N3948J6743K873J1628R871R775K9582K1982j8406k2816J6444L6538K2221
3942.5I9915618K0104L7432K6846j2171k3258o086J1266K2417J4234p850j4949n317
3967I9978286P87M500J1200J4466J8370K3031K2888K3473K0873J6999J7298J3089N388
3993.5A00170648j073q786
3997.6A00160789
$$ y = [99624312, 99718809, 99914211, 100045228, 99943888, 99758911, 99670243, 99701554, 99781346, 99826634, 99844527, 99873340, 99867445, 99787456, 99693787, 99651146, 99684548, 99744135, 99760461, 99737430, 99686843, 99650478, 99635613, 99591786, 99571860, 99650961, 99782825, 99862665, 99833667, 99717855, 99608421, 99567848, 99589598, 99650145, 99725235, 99779183, 99795926, 99798799, 99810427, 99820298, 99830073, 99859655, 99881637, 99863231, 99840415, 99856859, 99893397, 99915618, 99935722, 99973154, 100000000, 99987829, 99964571, 99958485, 99969751, 99992168, 100006402, 99998552, 99983603, 99978286, 99979073, 99983573, 99994773, 100009239, 100027609, 100050640, 100073528, 100097001, 100117874, 100134873, 100152171, 100165260, 100170648, 100169575, 100160789]
##END=$$ End of the data block
