##TITLE=ImCH3 $$ Begin of the data block
##JCAMP-DX=5.00 $$ ACD/SpecManager v 10.08
##SPECTROMETER/DATA SYSTEM=Alpha
##DATE=08 Jun 2015 09:26:56
##DATA TYPE=INFRARED SPECTRUM
##DATA CLASS=XYDATA
##ORIGIN=
##OWNER=
##NPOINTS=1765
##FIRSTX=399.76428223
##LASTX=3997.64306641
##MAXX=3997.64306641
##MINX=399.76428223
##MAXY=1.00316226
##MINY=0.72822315
##XFACTOR=1.0000000000
##YFACTOR=0.000000010000000
##FIRSTY=1.00000000
##DELTAX=2.03961372
##XUNITS=1/CM
##YUNITS=ARBITRARY UNITS
##XYDATA=(X++(Y..Y))
399.8A00000000n91141m85331k58142l96877n02127k86520j30385J41764N82349L97998
420.2I8471588k6292N9122M7839j43248q4204j4132j45763j41931n8466j62345k03824
442.6I7598344j35064k46072l23057k08193k55227l14588j57898k52056m86112k46835
463I4973242K34646L94964L03036J85430r143n0807J8662k02578n26780q54123j387995
485.4I3078554j262361l5548P84981M53943j24598n76818r12451q57270n61983n38831
505.8H9447618n87118q7339N71472O46841L72350K24245L28279N82045O26302K96074
526.2I2420769j39892n51820j159686j610541q49331J077730K434987K258849J297956
544.6I5179021M32659r1643m15724n99468n27501k51222K2877K29627L76176M08054
$$ y = [100000000, 99408859, 98923528, 98665386, 98268509, 97766382, 97479862, 97349477, 97491241, 98073590, 98471588, 98445296, 98504418, 98552257, 98409009, 98324805, 98310673, 98164910, 98022979, 97964513, 97802168, 97598344, 97463280, 97217208, 96894151, 96685958, 96430731, 96116143, 95958245, 95706189, 95220077, 94973242, 95207888, 95602852, 95905888, 96091318, 96082175, 96031368, 96050030, 95847452, 95320672, 94466549, 93078554, 91816193, 91780645, 92565626, 93019569, 92894971, 92318153, 91405702, 90548432, 89986449, 89447618, 88860500, 88773161, 89344633, 89991474, 90363824, 90588069, 90916348, 91498393, 92124695, 92420769, 92280877, 91729057, 90569371, 88958830, 88109499, 89187229, 91622216, 93881065, 95179021, 95611680, 95520037, 95104313, 94504845, 93977344, 93726122, 93748999, 93978626, 94354802, 94762856]
565I4762856L52859L02613K25270Q3887k5916j02937k03401k68686k77423l25942m22758
587.4I4100422n22220p40797j178986j669836j696193p83420L54815L70938n43505
605.8H7691218j264710j459372j262259p45374k46328N6976M23044P69615J089942
624.1H5052752J676775K099961J621615M48001o72871j404107j839774j463634L76642
642.5H5895360K117604J727819M07088M16052J234698J523489J466954J297957Q90463
660.8I6977484M64976J74004J5390M2903J08034M4787k4337r8068k27957m25721q25071
683.3I6226424j618886k707881l425306l166115k260167j143211L34281J706243K270108
701.6H6215490K242833J907403J208359P30026J152724J773113J585388Q73160L58969
$$ y = [94762856, 95115715, 95418328, 95643598, 95727485, 95701569, 95598632, 95395231, 95126545, 94849122, 94523180, 94100422, 93578202, 92837405, 91658419, 89988583, 88292390, 87508970, 87863785, 88234723, 87691218, 86426508, 84967136, 83704877, 82959503, 82713175, 82770151, 83193195, 83962810, 85052752, 86729527, 88829488, 90451103, 90899104, 90226233, 88822126, 86982352, 85518718, 85895360, 88012964, 89740783, 90147871, 90563923, 91798621, 93322110, 94789064, 96087021, 96977484, 97442460, 97616464, 97631854, 97674757, 97782791, 97827578, 97803241, 97705173, 97477216, 97051495, 96226424, 94607538, 91899657, 88474351, 85308236, 83048069, 81904858, 82239139, 83945382, 86215490, 88458323, 90365726, 91574085, 92304111, 93456835, 95229948, 96815336, 97688496, 98047465]
720I8047465J98943J74480J43475J19191Q4114J502q2618j17665r4700O961P7010q6141
744.5I8472017m52274q62420j225549j260668p12871Q4352N75406O54149N96648O24573
764.9I6493363O75148O32113N90456O17748N68325L42887P9960l2669q1188k10798
785.3I9675345l39615m39423o72531j052547j483476j968187k581954l146637k733421
803.6H5257554q17084J057654J160998M0966o76078k52443R64319K096314K345860
822I1178060J611501O11472J44046J80042J64527J03026M07631R49609J216173J066852
842.4I7632939P31414M48287L26419K72691J89024J48547J51676R9003N9950Q3554
862.8A00143504N7137n0521j39940k63249m94492p39056r46576j059365p64412M1366
$$ y = [98047465, 98246408, 98420888, 98564363, 98683554, 98767668, 98769170, 98686552, 98568887, 98474187, 98481148, 98558158, 98472017, 98019743, 97157323, 95931774, 94671106, 93958235, 94042587, 94617993, 95272142, 95868790, 96493363, 97168511, 97800624, 98391080, 99008828, 99577153, 99920040, 100000000, 99967331, 99886143, 99675345, 99335730, 98896307, 98223776, 97171229, 95687753, 93719566, 91137612, 87990975, 85257554, 84440470, 85498124, 86659122, 86700088, 86024010, 85771567, 86735886, 88832200, 91178060, 92789561, 93401033, 93545079, 93725121, 93889648, 93992674, 94400305, 95349914, 96566087, 97632939, 98364353, 98812640, 99139059, 99411750, 99600774, 99749321, 99900997, 100000000, 100059950, 100143504, 100200641, 100150120, 100010180, 99746931, 99252439, 98513383, 97566807, 96507442, 95743030, 95784396]
883.2I5784396Q09914J042622Q77953O07711L57908K20734J64383Q4693K6381K3305
903.5A00000000J19p4750j04904j54889k53367k67947j65856o3532k9701p7266j32215
926I8675692n1379R0909O4176r4151j61106q8900K9033J21636J28179K3210r6756j48076
950.5I8492467j91885k58034k66356k18790j94788k12258k94924m75383o09905m80496
970.9I5289648j53280R4611J41424N7631o5493j61404k20686k71815l04592l37171
991.3I4068873m26847n31429o70934q22031m06510M90606O55502j4722n87195r10026
1011.6I0845287j288843j652950j913417k109599j957178j194358N526J171845J774376
1030H3680689J510990M77648p86680j702863k098864k215529k212119j787597q55720
$$ y = [95784396, 96594310, 97636932, 98514885, 99122596, 99480504, 99701238, 99865621, 99950314, 99976695, 100000000, 100000119, 99925369, 99820465, 99665576, 99412209, 99144262, 98978406, 98914874, 98885173, 98807907, 98675692, 98624313, 98715222, 98779398, 98685247, 98524141, 98435241, 98464274, 98585910, 98714089, 98737299, 98640543, 98492467, 98300582, 98042548, 97776192, 97557402, 97362614, 97150356, 96855432, 96380049, 95770144, 95289648, 95136368, 95230979, 95372403, 95430034, 95364541, 95203137, 94982451, 94710636, 94406044, 94068873, 93642026, 93110597, 92439663, 91617632, 91211122, 91701728, 92357230, 92342508, 91755313, 90845287, 89556444, 87903494, 85990077, 83880478, 81923300, 80728942, 80734468, 81906313, 83680689, 85191679, 85669327, 84882647, 83179784, 81080920, 78865391, 76653272, 74865675, 74009955]
1048.4G4009955K89845J604838K853852L399086L056514K246839J405579P10553J67394
1066.7H9744455k42019l97593j98269R6733J56223J0485j65665l05939m05306m82845
1087.1H7810260n56523o12407o28251o35106o92314p75998q05366p93541p86078o80047
1107.5H0844629l85732o7013O5297J9264p9161j54662k14964k75165k95556k14237
1127.9G9242700k4306J51681J89609J00004o4998k61146m31824n44786n95516o08331
1148.3G7153087o54400p44265p28464m84353j26297J25122J32186j45865n27972o03151
1168.7G3395628l18849j11860j09387l3217J86121L63362L53867J75869o1041j59299
1189.1G3681194K10315R21899J208454P91371J80757k50417n40263p66944p96366m53574
$$ y = [74009955, 74299800, 75904638, 78758490, 82157576, 85214090, 87460929, 88866508, 89577061, 89744455, 89502436, 89104843, 88906574, 89003307, 89159530, 89170015, 89004350, 88698411, 88293105, 87810260, 87253737, 86641330, 86013079, 85377973, 84685659, 83909661, 83104295, 82310754, 81524676, 80844629, 80458897, 80391884, 80457181, 80476445, 80397284, 80242622, 80027658, 79752493, 79456937, 79242700, 79218394, 79370075, 79559684, 79659688, 79594690, 79333544, 78901720, 78356934, 77761418, 77153087, 76498687, 75754422, 75025958, 74541605, 74415308, 74540430, 74672616, 74526751, 73998779, 73395628, 73076779, 72964919, 72855532, 72822315, 73008436, 73371798, 73725665, 73901534, 73840493, 73681194, 73891509, 74813408, 76021862, 76813233, 76993990, 76743573, 76203310, 75436366, 74640000, 74186426]
1209.5G4186426P0054M32539O22940P96324R82576J032097P51560J85234m07601q30864
1229.9G7821285j017720q85600l66217M12470J126933J501555J495129J253682R54425
1248.2H2295942O54990L29554O0755J3471J45578J89567J5437j85174j52683R9874
1268.6H3467311L23587M15629N36210P80284J056200J238853J214278R46653N47141
1287I0526146J89441l886k4641P183k9570p6509J7321K60896M81063M45330J27703
1309.4I1920477q2201J10394L96019N06181O10083P47633P90656P18742N58764L64345
1329.8I6641093K13707J59651J60259R7621m8954j33967j02580k7656J10405K53958
1350.2I7323537K59441J50716K0862p6175j28257k02078k51972j28049L9834P1650
$$ y = [74186426, 74256480, 74689019, 75311959, 76108283, 77090859, 78122956, 78874516, 79059750, 78652149, 77821285, 76803565, 75917965, 75551748, 75964218, 77091151, 78592706, 80087835, 81341517, 82295942, 82950932, 83280486, 83341241, 83354712, 83500290, 83689857, 83705294, 83520120, 83367437, 83467311, 83790898, 84206527, 84742737, 85523021, 86579221, 87818074, 89032352, 89979005, 90526146, 90715587, 90711701, 90687060, 90694243, 90664673, 90588164, 90605485, 90866381, 91347444, 91792774, 91920477, 91838276, 91948670, 92344689, 92850870, 93460953, 94208586, 94999242, 95717984, 96276748, 96641093, 96854800, 97014451, 97174710, 97272331, 97223377, 97089410, 96986830, 96959174, 97069579, 97323537, 97582978, 97733694, 97754556, 97678381, 97550124, 97348046, 97096074, 96968025, 97007859, 97079509]
1370.6I7079509k2763j67226j95098q2344L4112J47772K89624L26658J66571O9779
1391I7646594J18852P6317o6989k06483k89231k53391k50942k18928J6719K55674L22974
1413.5I7151166L43788L34197O6376k11942k15978k01440j85138j83403k28971j58394
1433.9I6510261j65146m67634o30600o12634o84852j044297j721686j763934p36046
1452.2H8683432N50497J704597J938022J143562P56777N30880J18894m8346P2676k8526
1472.6I5422465m13043o07425n75733n16385n01704m41992l84122m91476o32900m24916
1493I0432769j59597m09001j235074k037865k247119j701373p09593n27156j327389
1511.4H0078602k076185k081036j191384M55975K316159L280986L376704L082985K275538
$$ y = [97079509, 97056746, 96889520, 96694422, 96612078, 96646190, 96793962, 97083586, 97410244, 97576815, 97646594, 97765446, 97841763, 97774774, 97568291, 97279060, 97025669, 96774727, 96555799, 96572518, 96828192, 97151166, 97494954, 97829151, 97895527, 97683585, 97467607, 97266167, 97081029, 96897626, 96668655, 96510261, 96345115, 95877481, 95246881, 94634247, 93949395, 92905098, 91183412, 89419478, 88683432, 89233929, 90938526, 92876548, 94020110, 94776887, 95307767, 95426661, 95378315, 95450991, 95422465, 95009422, 94401997, 93826264, 93309879, 92808175, 92366183, 91982061, 91490585, 90857685, 90432769, 90273172, 89864171, 88629097, 86591232, 84344113, 82642740, 81933147, 81405991, 80078602, 78002417, 75921381, 74729997, 75185972, 77502131, 80783117, 84159821, 87242806, 89518344]
1529.7H9518344J598889R75537M01754M89181Q82548P35021M62913M27127M64928M62711
1550.1I6418953L90941L94463N09406L86750m88788p54523m71574l66354n37086j032030
1570.5I4450158j217878j085818j018441l31401N63436P63864M08774K3556l29912
1588.9I2226338p08109q81797p56633m85659k60800k36732l73971m93354o30444j009774
1609.3H6389065j577795j863479j641459q66162R0557K47461n32401j079381l65322
1627.6G8801084R43499J860673K284991K250481J366353P39312P27636Q84855J026398
1646I0885282Q20428O58369R46039O92969M0430J61225M59283N36782L81398L63618
1666.4I5945823N18668M16350K21199K20352J39541J09899L16709N14543K40875k23017
$$ y = [89518344, 91117233, 92092770, 92494524, 92983705, 93866253, 94601274, 95064187, 95491314, 95956242, 96418953, 96809894, 97204357, 97713763, 98100513, 97611725, 96857202, 96385628, 96019274, 95482188, 94450158, 93232280, 92146462, 91128021, 90796620, 91360056, 92123920, 92532694, 92556250, 92226338, 91518229, 90636432, 89879799, 89394140, 89133340, 88896608, 88522637, 88029283, 87398839, 86389065, 84811270, 82947791, 81306332, 80440170, 80530727, 80778188, 80245787, 79166406, 78801084, 79744583, 81605256, 83890247, 86140728, 87507081, 88246393, 88974029, 89858884, 90885282, 91705710, 92364079, 93310118, 94003087, 94043517, 94204742, 94664025, 95200807, 95582205, 95945823, 96464491, 96880841, 97102040, 97322392, 97461933, 97571832, 97888541, 98403084, 98643959, 98420942]
1686.8I8420942j73783k2817J24431K79355K48885J42884j09351k24763m7523l0577
1707.2I8607683o2620P3862K53415L48997J66446k02072k24101l3743P6795J48028
1727.6I9152690K41876L42417K63017r0814j10060L8070k551k6107N4413J13261K3788
1750A00000000j56480j54257l7581l391K0420j9973p6079M2218J67942J83254L5179
1772.4A00001252j92207j78057j8877M7499J6087l236J0061R7996J84864N5658j25002
1794.9I9896038q0032K7174O557r2632r7829j4472K7436k3442p1663m5228j2607Q202
1819.4I9527502O1733J09547Q0979N8985K7150j04130j20908l0821j4258J1814J23995
1841.8I9731588J22273o2155j28019p8136m7469j7738r48j6475l6377l8725j6373L2586
$$ y = [98420942, 98247159, 98224342, 98348773, 98628128, 98877013, 99019897, 98910546, 98685783, 98638260, 98607683, 98545063, 98618925, 98872340, 99221337, 99387783, 99185711, 98961610, 98927867, 99004662, 99152690, 99394566, 99736983, 100000000, 99909186, 99799126, 99837196, 99834645, 99808538, 99862951, 99976212, 100000000, 99843520, 99689263, 99651682, 99648291, 99668711, 99648738, 99572659, 99614877, 99782819, 99966073, 100001252, 99809045, 99630988, 99612111, 99659610, 99675697, 99672461, 99682522, 99780518, 99965382, 100021040, 99896038, 99816006, 99843180, 99849737, 99757105, 99659276, 99644804, 99672240, 99648798, 99577135, 99531907, 99519300, 99527502, 99589235, 99698782, 99779761, 99838746, 99865896, 99761766, 99640858, 99610037, 99595779, 99607593, 99731588, 99853861, 99791706, 99663687, 99585551, 99538082, 99520344, 99519396, 99502921, 99466544, 99427819, 99411446, 99444032]
1866.3I9444032k802j66797k25848j42467q9795r2810p6997k8056J0830M4256N3561
1888.7I8727107k0456p3177n1808n0849n6654k0367K7853N8139Q7738J06567P7569
1911.1I8811662N1856R4497J17034M3768L183M768l2776m5902k3031j9342l5661l5042
1935.6I8935014j7089L308J1027k5022o3580n6940k2519j675j3548k7043k4598k0206
1960.1I8677129M88N1701P7445M9370L2807L6800K2584J7577K4557J2219O813K7609
1984.6I9037099L6037L5018N0634L1471j1444m89K7263J7572Q559K0725J5801k15O646
2011.1I9274677J6803R578p969m1330p5936q7774n1427L4821Q0991N8269K5720J269
2035.6I9237692J37J0103n990j8024l487m381j1724O866J5664K861N663J0580n425
$$ y = [99444032, 99441230, 99274433, 99048585, 98906118, 98816323, 98723513, 98646516, 98618460, 98629290, 98673546, 98727107, 98706651, 98633474, 98581666, 98530817, 98474163, 98453796, 98481649, 98539788, 98627526, 98734093, 98811662, 98863518, 98958015, 99075049, 99118817, 99122000, 99126768, 99093992, 99048090, 99025059, 99005717, 98970056, 98935014, 98917925, 98921233, 98932260, 98907238, 98843658, 98786718, 98764199, 98762524, 98748976, 98721933, 98697335, 98677129, 98677617, 98729318, 98806763, 98856133, 98888940, 98925740, 98948324, 98965901, 98990458, 99002677, 99009490, 99037099, 99073136, 99108154, 99158788, 99190259, 99178815, 99178326, 99205589, 99223161, 99231720, 99252445, 99268246, 99268031, 99274677, 99291480, 99301058, 99293089, 99251759, 99175823, 99088049, 99036622, 99071443, 99152434, 99210703, 99236423, 99237692, 99237829, 99247932, 99241942, 99223918, 99220431, 99216050, 99204326, 99211192, 99226856, 99229717, 99235380, 99245960, 99240535]
2062.1I9240535j1259n942j7190k2722q16J0407j431K897R614r644k2298j8805l1299
2088.6I9122047m2355k0975K391R358K4145L0446J1737M041P999n305r888J1128J7702
2115.1I9162471R650J6725J8722N520P033J4347K80q869J257j895j3548o360J222k676
2143.7I9203879L737J4037R781R024K0224J7446O026Q810P295q171j4252j3119j2326
2170.2I9252391k384N799J615j323N156P331L356P367J1432N061K366P707O604J532
2198.7I9314010R78k456r018p373o348j6666k2989j9849k0122k3955k4831k5219k4569
2225.2I9111593j7333j0473j1223j0568m149k277n740n483J73N585Q529R716O860L368
2253.8I9078578L463K992J669M470P308N567M846O175J734o860r662q619p278j657
$$ y = [99240535, 99229276, 99223334, 99206144, 99183422, 99182606, 99193013, 99191582, 99194479, 99204093, 99194449, 99172151, 99153346, 99122047, 99079692, 99058717, 99061108, 99070466, 99094611, 99125057, 99136794, 99140835, 99148834, 99143529, 99133641, 99144769, 99162471, 99172121, 99188846, 99207568, 99213088, 99220121, 99234468, 99234748, 99225879, 99227136, 99225241, 99211693, 99205333, 99206555, 99203879, 99207616, 99221653, 99231434, 99240458, 99260682, 99278128, 99284154, 99292964, 99300259, 99292088, 99277836, 99264717, 99252391, 99250007, 99255806, 99257421, 99256098, 99261254, 99268585, 99271941, 99279308, 99290740, 99295801, 99298167, 99305874, 99312478, 99314010, 99314988, 99312532, 99303514, 99296141, 99289793, 99273127, 99250138, 99230289, 99210167, 99186212, 99161381, 99136162, 99111593, 99094260, 99083787, 99072564, 99061996, 99057847, 99055570, 99049830, 99044347, 99044520, 99050105, 99058634, 99068350, 99075210, 99078578, 99082041, 99085033, 99086702, 99091172, 99098480, 99104047, 99108893, 99115068, 99116802, 99109942, 99100280, 99091661, 99084383, 99082726]
2282.3I9082726K253k336n245j288j120m811m893o855j3762j5593j4841k3121l2652
2308.9I8958462l4934l6931l8779l5584l2901k9928k1028j4115j9800l2878l6008l0016
2333.3I8595560k5469k1428j9950j3447J3268N0116O3425L9774j0782o6567q2290n1266
2357.8I8470944k0611o849J4443L8152M5401M9067N3209M7874M3661M8160M7511L5626
2382.3I8866588K2006R495r36m643n984r215j0324r155q982q071n221l875n954q738
2410.8I8816991r430o932m345o658j0746j3584j5235j3805j2529j6903k0755j8877
2435.3I8667192j8739j9950j8191j8466k0677j9216j9086k2822k0623j5074j7256k1434
2459.8I8435658j9419k0051k6464k7270k4670k7847k9272k5517k6589k8938k4498k1470
$$ y = [99082726, 99084979, 99082643, 99077398, 99076110, 99074990, 99070179, 99065286, 99058431, 99044669, 99029076, 99014235, 98991114, 98958462, 98923528, 98886597, 98847818, 98812234, 98779333, 98749405, 98728377, 98714262, 98694462, 98661584, 98625576, 98595560, 98570091, 98548663, 98528713, 98515266, 98528534, 98578650, 98642075, 98681849, 98671067, 98604500, 98522210, 98470944, 98450333, 98443484, 98457927, 98496079, 98541480, 98590547, 98643756, 98691630, 98735291, 98783451, 98830962, 98866588, 98888594, 98898089, 98897153, 98892510, 98886526, 98877311, 98866987, 98857832, 98848850, 98840779, 98835558, 98831683, 98825729, 98816991, 98807561, 98800629, 98796284, 98789626, 98778880, 98765296, 98750061, 98736256, 98723727, 98706824, 98686069, 98667192, 98648453, 98628503, 98610312, 98591846, 98571169, 98551953, 98532867, 98510045, 98489422, 98474348, 98457092, 98435658, 98416239, 98396188, 98369724, 98342454, 98317784, 98289937, 98260665, 98235148, 98208559, 98179621, 98155123, 98133653]
2484.3I8133653k1380j6141j5217k3895k6119k2876k7508l0309k5755k9302l6412l3379
2508.7I7825360l4016m4549m6134m1389m6700m8870m0907m0412m1884l5602l6317m5121
2533.2I7323459m5830m2271m8989n5772n4235n6958o1112n9236o3920p4648p5508p1692
2557.7I6613288p5746p8755p5686p7689q2105q1301q5414r3483r1547q9568r6607r8157
2582.2I5587230r2006q8644q5843p9906p6574p8135p3743o2609n6106m5192k7573j5676
2606.6I4805223j216J8400L0708L9947N5546O7734P6867R3066J04815J03623J03259
2629.1I5497972J10763J11109J02735R8699R0563P2789O0905N6117M7916M0925L6305
2651.5I6326798K7877K2143K3443K1106J5086J6105J4967N024J306L522l624j4030
$$ y = [98133653, 98112273, 98096132, 98080915, 98057020, 98030901, 98008025, 97980517, 97950208, 97924453, 97895151, 97858739, 97825360, 97791344, 97746795, 97700661, 97659272, 97612572, 97563702, 97522795, 97482383, 97440499, 97404897, 97368580, 97323459, 97277629, 97235358, 97186369, 97130597, 97076362, 97019404, 96958292, 96899056, 96835136, 96760488, 96684980, 96613288, 96537542, 96458787, 96383101, 96305412, 96223307, 96142006, 96056592, 95963109, 95871562, 95781994, 95685387, 95587230, 95495224, 95406580, 95320737, 95240831, 95164257, 95086122, 95012379, 94949770, 94893664, 94848472, 94820899, 94805223, 94804007, 94822407, 94853115, 94893062, 94948608, 95016342, 95093209, 95186275, 95291090, 95394713, 95497972, 95608735, 95719844, 95822579, 95921278, 96011841, 96084630, 96145535, 96201652, 96249568, 96290493, 96326798, 96354675, 96376818, 96400261, 96421367, 96436453, 96452558, 96467525, 96472549, 96473855, 96477377, 96473753, 96459723]
2676I6459723j7065k3043l2610l2175k6291k4939k2477j9276k1923k2447k0843k6995
2700.5I6169639l1299k9397l3873m0716m2331m4996m7529m8208n1939o1637p7975r2852
2724.9I5566887j00237q8072l9149K1089N4359N5700L6109J2153n12j586n310j7900
2749.4I5493531l0458l8051m1002m1777m5246m8047m8060n0574n2119n0318m9722n3596
2773.9I4944561o5637p5841p4410p1812p2825o6769n7346o4337q0645p9298o2669o0689
2798.4I4112283p6646p9882p1573p3642p9256q4507r4879r6130q3888p7742q4317r1183
2822.8I3118638r5278j02550j08558j11520j20110j31940j43987j80477k42353k84224
2843.2I1597641l00634l21430l40534l29256k81834k15322j43713q9776o2436l1471
$$ y = [96459723, 96442658, 96419615, 96387005, 96354830, 96328539, 96303600, 96281123, 96261847, 96239924, 96217477, 96196634, 96169639, 96138340, 96108943, 96075070, 96034354, 95992023, 95947027, 95899498, 95851290, 95799351, 95737714, 95659739, 95566887, 95466650, 95378578, 95339429, 95360518, 95414877, 95470577, 95506686, 95518839, 95518327, 95516741, 95511431, 95493531, 95463073, 95425022, 95384020, 95342243, 95296997, 95248950, 95200890, 95150316, 95098197, 95047879, 94998157, 94944561, 94878924, 94803083, 94728673, 94656861, 94584036, 94517267, 94459921, 94395584, 94314939, 94235641, 94172972, 94112283, 94035637, 93955755, 93884182, 93810540, 93731284, 93646777, 93551898, 93455768, 93371880, 93294138, 93209821, 93118638, 93023360, 92920810, 92812252, 92700732, 92580622, 92448682, 92304695, 92124218, 91881865, 91597641, 91297007, 90975577, 90635043, 90305787, 90023953, 89808631, 89664918, 89575142, 89512706, 89481235]
2863.6H9481235P915L2347N2715P8171P3284L9917L2372M7570N4515O3729P7355Q1986
2888.1I0123111Q0353P7075O1017K5368j8478n9360r8652j38551j84553k41810k86961
2910.5H9338559l01927k85340k00414k3807J75995L10826L61085L48568K86025J92118
2930.9I0201688J13267O8169M3005L8368N4425P6985R3210R6458R1892R1339Q2492
2953.4I1051298N9033N1391O5720O6882M2731K6655L2282M7153Q0335J16766J21021
2975.8I1761267J08421R3108N5653J2458p618j6486k0409j8841k7078l4696l5012l5399
3000.3I1835368l2026k4140R161O7449Q3059k396j66190l29202m25345m31514l50862
3022.7I0233362k09040m8446R2482K03037L22015M34863M56011L82597K54458Q2290
$$ y = [89481235, 89489150, 89521497, 89574212, 89652383, 89725667, 89765584, 89797956, 89845526, 89900041, 89963770, 90041125, 90123111, 90203464, 90280539, 90341556, 90366924, 90348446, 90289086, 90190434, 90051883, 89867330, 89625520, 89338559, 89036632, 88751292, 88550878, 88527071, 88703066, 89013892, 89374977, 89723545, 90009570, 90201688, 90314955, 90383124, 90426129, 90464497, 90518922, 90595907, 90689117, 90785575, 90877467, 90968806, 91051298, 91110331, 91161722, 91227442, 91294324, 91337055, 91363710, 91395992, 91443145, 91523480, 91640246, 91761267, 91869688, 91962796, 92018449, 92030907, 92023289, 92006803, 91986394, 91967553, 91940475, 91905779, 91870767, 91835368, 91803342, 91779202, 91788363, 91855812, 91938871, 91936475, 91770285, 91441083, 91015738, 90584224, 90233362, 90024322, 89975876, 90068358, 90271395, 90593410, 91028273, 91484284, 91866881, 92121339, 92203629]
3043.1I2203629p3671j30016q7434j9503R072k4450r8532j38635o9612R7460K80827
3065.5I1949135L88098L76779K92933K04783J39279Q5258L1543P564K3710M8626R1845
3088I3639553J40708J42205J17332R4104O2131K9797J0186J9062N9843R2012Q1729
3110.4I4488662P1252R0170Q5664L6293k0027n3537o0034n0515l9983m5842o0433n5224
3134.9I4386446l0601k1779m3321o0981o0529n7065m3267l1537n2875q0723p9632p1412
3159.4I3752724o9892o7401p1526q0329q0800q0580q9866r5307r9648j14488j20729
3181.8I2782158j18417j30337j47730j55139j62501j71852j69402j61970j64330j62375
3202.2I1238105j50448j45823j46877j43057j36799j29420j12056q7899o7318l8010
$$ y = [92203629, 92129958, 91999942, 91912508, 91893005, 91902077, 91877627, 91779095, 91640460, 91570848, 91668308, 91949135, 92337233, 92714012, 93006945, 93211728, 93351007, 93436265, 93467808, 93475372, 93499082, 93547708, 93639553, 93780261, 93922466, 94039798, 94133902, 94196033, 94225830, 94236016, 94255078, 94314921, 94406933, 94488662, 94559914, 94650084, 94735748, 94772041, 94752014, 94698477, 94638443, 94587928, 94547945, 94502103, 94441670, 94386446, 94355845, 94334066, 94290745, 94229764, 94169235, 94112170, 94068903, 94037366, 93984491, 93903768, 93824136, 93752724, 93682832, 93615431, 93543905, 93463576, 93382776, 93302196, 93212330, 93117023, 93017375, 92902887, 92782158, 92663741, 92533404, 92385674, 92230535, 92068034, 91896182, 91726780, 91564810, 91400480, 91238105, 91087657, 90941834, 90794957, 90651900, 90515101, 90385681, 90273625, 90185726, 90118408, 90080398]
3222.6I0080398K355L3730N3436P0452P6801O1810M2480L1716K3180K0343J4961o449
3247.1I0505213l0756l7528l3736m3726o7019q8257j02049j07044j09446j10006j04875
3269.5H9670771j22839j71983k10959k26384k35462k49803k62619k60543k39587j98728
3289.9H7491864j62059j45835j28972j12510j07408j00940j05995j62816k62714l47518
3310.3H5855097l91955m21083m59647n00834n10990m60303l61014k56455j64777q9085
3330.7H2238954m2885j1367K7847O2210Q4442Q8530N0015q881n9253j37091k32548
3353.1H2059973k79212k73388k54524k45345k25770j75297j39779j66577k21503k33847
3373.5G9844731k06280j89519j87206j89429j92249j83559j55234j15180j20860j77914
$$ y = [90080398, 90082753, 90116483, 90169919, 90240371, 90317172, 90378982, 90421462, 90453178, 90476358, 90496701, 90511662, 90505213, 90474457, 90436929, 90403193, 90359467, 90292448, 90204191, 90102142, 89995098, 89885652, 89775646, 89670771, 89547932, 89375949, 89164990, 88938606, 88703144, 88453341, 88190722, 87930179, 87690592, 87491864, 87329805, 87183970, 87054998, 86942488, 86835080, 86734140, 86628145, 86465329, 86202615, 85855097, 85463142, 85042059, 84582412, 84081578, 83570588, 83110285, 82749271, 82492816, 82328039, 82238954, 82196069, 82184702, 82212549, 82274759, 82359201, 82447731, 82497746, 82488865, 82429612, 82292521, 82059973, 81780761, 81507373, 81252849, 81007504, 80781734, 80606437, 80466658, 80300081, 80078578, 79844731, 79638451, 79448932, 79261726, 79072297, 78880048, 78696489, 78541255, 78426075, 78305215, 78127301]
3393.9G8127301j86831j26809r5606j46258k00528j79594j35559j23310j25081j29860
3414.3G6677865j25295r9737q4781q8370p1269k9803K808L057j472J2851k98l8344
3438.8G6157212l4255O116L9506M3625J6897N866K6768M6307N8013O6865N9556N7585
3463.2G6550061R1320J10650O6346J5270K5505O9303J07252J18643Q3232N8341Q0270
3485.7G7376193Q7744Q1837J09839J50019J70333J73795J95354K21431J87075J50144
3506.1G8903764J80072K05493J95867J85948J77914J80024K08235K36052K08164J52123
3526.5H0833656J28454J28561J49506J87618J87242J51580J70136K33102K29805J36292
3546.9H2535952Q5932J24729J37812J23674J57660K12651K46460K88570L40116K82818
$$ y = [78127301, 77940470, 77813661, 77718055, 77571797, 77371269, 77191675, 77056116, 76932806, 76807725, 76677865, 76552570, 76452833, 76368052, 76279682, 76208413, 76178610, 76181418, 76184475, 76183003, 76195854, 76195556, 76157212, 76122957, 76129073, 76168579, 76212204, 76229101, 76234967, 76261735, 76308042, 76366055, 76432920, 76492476, 76550061, 76641381, 76752031, 76818377, 76833647, 76859152, 76928455, 77035707, 77154350, 77237582, 77295923, 77376193, 77463937, 77545774, 77655613, 77805632, 77975965, 78149760, 78345114, 78566545, 78753620, 78903764, 79083836, 79289329, 79485196, 79671144, 79849058, 80029082, 80237317, 80473369, 80681533, 80833656, 80962110, 81090671, 81240177, 81427795, 81615037, 81766617, 81936753, 82169855, 82399660, 82535952, 82621884, 82746613, 82884425, 83008099, 83165759, 83378410, 83624870, 83913440, 84253556, 84536374]
3567.3H4536374J37257J19436K02304K52652K63346K68536K83152L30734L74383K77496
3587.7H7045670J28650J75888L02445L30413L21525L23463K97445L13306L96221M14926
3608.1I0049952L43901L12054L14820L46506L82364K81983J86563K91002M99373N25773
3628.5I3534291K26700J03265K08330K67518K95389L20273L54004M64267O02477M97139
3648.8I6873653Q0711p8917Q6671J44220P0881P8535J14418J81466L11708L31629J63102
3671.3I8358077J49590J26600j51396k00760o0255O4123K28977L51840J78814j31237
3691.7I8914373j64235l2896P3106J26814P9358j9735L7682J96958K32821J5241j98018
3714.1I9261469j33640J5992Q5682P2312J7774m9043k8371J37621K78437J86682q9825
$$ y = [84536374, 84673631, 84793067, 84995371, 85248023, 85511369, 85779905, 86063057, 86393791, 86768174, 87045670, 87174320, 87350208, 87652653, 87983066, 88304591, 88628054, 88925499, 89238805, 89635026, 90049952, 90393853, 90705907, 91020727, 91367233, 91749597, 92031580, 92218143, 92509145, 93008518, 93534291, 93760991, 93864256, 94072586, 94340104, 94635493, 94955766, 95309770, 95774037, 96376514, 96873653, 96954364, 96875447, 96962118, 97106338, 97177219, 97255754, 97370172, 97551638, 97863346, 98194975, 98358077, 98507667, 98634267, 98482871, 98282111, 98221856, 98285979, 98514956, 98866796, 99045610, 98914373, 98750138, 98717242, 98790348, 98917162, 98996520, 98976785, 99014467, 99211425, 99444246, 99459487, 99261469, 99127829, 99143821, 99229503, 99301815, 99319589, 99270546, 99242175, 99379796, 99658233, 99844915, 99755090]
3736.5I9755090k12770k4933K27195J69969k0415P1877L3987k27433k14082l0238O485
3759I9534732q3685n3090M6009O6453K0850q8632j21647j1093R9111O5792n2637o0755
3783.5I9361408l0661m1199k6589J4269Q2320J26428J14029J27304L2812j01930o4170
3805.9I9594021j07157j50818L22J68305J54108P9114Q1980r7960k11138r3704q148
3828.3I9408925N3316R4217J19716J35535J3864j37150j58394j44434q1438R6787L19015
3850.8I9719959K80041j78057l25167r9868Q2302J29170M2939K0253O3497l0291j07992
3873.2I9596786r2250o395J09607O9475K0015K331p1091m190L3039p1365k0700J50120
3897.7I9715382J94687Q9931o1053j82539j65051n9051J9932P8332J06126M6927k1016
$$ y = [99755090, 99542320, 99517387, 99744582, 99914551, 99894136, 99966013, 100000000, 99772567, 99558485, 99528247, 99534732, 99451047, 99397957, 99443966, 99510419, 99531269, 99442637, 99320990, 99309897, 99409008, 99474800, 99422163, 99361408, 99330747, 99289548, 99262959, 99277228, 99359548, 99485976, 99600005, 99727309, 99760121, 99658191, 99594021, 99486864, 99336046, 99336368, 99504673, 99658781, 99737895, 99819875, 99721915, 99510777, 99417073, 99408925, 99462241, 99556458, 99676174, 99811709, 99825573, 99688423, 99530029, 99385595, 99304157, 99400944, 99719959, 100000000, 99821943, 99496776, 99396908, 99479210, 99608380, 99651319, 99671572, 99735069, 99704778, 99596786, 99504536, 99498141, 99607748, 99677223, 99697238, 99699569, 99628478, 99624288, 99657327, 99585962, 99565262, 99715382, 99910069, 100000000, 99938947, 99756408, 99591357, 99532306, 99552238, 99630570, 99736696, 99783623, 99762607]
3920.1I9762607l833J6004q965J4514O4737K8371m2843l7384J5795O0421N2089J5181
3944.6I9936694L0094L3212j2463k5452P63K2167L1197K9266O378n269J4973L2198
3969.1A00093758L1018K6071K2114J2433O533J3995K0623J5843J3531J6582J3983J2409
3993.5A00298893J1456N877
3997.6A00316226
$$ y = [99762607, 99758774, 99774778, 99765813, 99780327, 99845064, 99873435, 99830592, 99793208, 99809003, 99869424, 99921513, 99936694, 99966788, 100000000, 99987537, 99962085, 99962848, 99985015, 100016212, 100045478, 100051856, 100046587, 100061560, 100093758, 100124776, 100150847, 100172961, 100185394, 100191927, 100205922, 100226545, 100242388, 100255919, 100272501, 100286484, 100298893, 100310349, 100316226]
##END=$$ End of the data block
