##TITLE=$$ Begin of the data block
##JCAMP-DX=5.00 $$ ACD/SpecManager v 10.08
##SPECTROMETER/DATA SYSTEM=Varian
##DATE=16 Apr 2013 14:16:48
##DATA TYPE=INFRARED SPECTRUM
##DATA CLASS=XYDATA
##ORIGIN=
##OWNER=
##NPOINTS=3735
##FIRSTX=399.26403809
##LASTX=4000.35498047
##MAXX=4000.35498047
##MINX=399.26403809
##MAXY=227.18196106
##MINY=0.53515768
##XFACTOR=1.0000000000
##YFACTOR=0.000001000000000
##FIRSTY=72.54479218
##DELTAX=0.96440572
##XUNITS=1/CM
##YUNITS=TRANSMITTANCE
##XYDATA=(X++(Y..Y))
$$ plain form
399.3 72544792 72544792 63740471 50063904 46123135 63404919 96260391 69348717 43981434 45213638
407.9 45213638 42804447 40161819 42665482 38039772 41885063 44763584 47413967 66115318
415.7 66115318 145555283 227181961 535158 14720195 44116619 58175823 83071426
422.4 83071426 131354279 97297058 55113537 44902035 56252579 77721497 59167107 52385139
430.1 52385139 52088364 48211208 46789459 47423050 48972664 40358150 44522732 57015030 72072227
438.8 72072227 79634239 86805130 94360245 61352604 54454586 61757339 75227890 73223732
446.5 73223732 49349644 48103210 39501194 41943531 56965431 61936501 60472431 56327656
454.2 56327656 61906208 65412109 55006340 42628826 54626644 65474548 61970631 54763580
$$ packed form
399.3G2544792Tq804321j3676567l940769J7281784L2855472k6911674k5367283J232204
407.9D5213638k409191k642628K503663m625710L845291K878521K650383J8701351
415.7F6115318P9439965Q1626678k26646803J4185037K9396424J4059204K4895603
422.4H3071426M8282853l4057221m2183521j0211502J1350544K1468918j8554390o781968
430.1E2385139k96775l877156j421749O33591J549614q614514M164582J2492298J5057197
438.8G2072227P562012P170891P555115l3007641o898018P302753J3470551k004158
446.5G3223732k3874088j246434q602016K442337J5021900M971070j464070m144775
454.2E6327656N578552L505901j0405769j2377514J1997818J0847904l503917p207051
$$ plain form
462 54763580 44983444 39753437 39134129 54905807 58937111 50507221 55406075 54353436 57040768
470.6 57040768 64122032 55310665 40617100 37954823 46178894 55621761 55328449 53574966 61859882
479.3 61859882 72920670 66270035 57370373 55799870 67683456 69904495 58752087 44879642
487 44879642 41823639 59369244 83943527 78847260 63285992 56014462 53613766 56351742
494.7 56351742 62970501 59085037 51136246 47368553 48654484 52519062 55604927 54546928 53705124
503.4 53705124 52887497 51282509 61141361 78875443 75761093 64348740 53271629 49020542
511.1 49020542 52270061 55650539 63849022 68706841 65680344 69159966 68286682 63133587 62923683
519.8 62923683 61005016 60239357 60434521 61467896 65016167 65945168 60471622 57375919 57287384
$$ packed form
462E4763580r780136n230007o19308J5771678M031304q429890M898854j052639K687332
470.6E7040768P081264q811367j4693565k662277Q224071R442867k93312j753483Q284916
479.3F1859882J1060788o650635q899662j570503J1883586K221039j1152408j3872445
487D4879642l056003J7545605K4574283n096267j5561268p271530k400696K737976
494.7E6351742O618759l885464p948791l767693J285931L864578L085865j057999q41804
503.4E3705124q17627j604988R858852J7734082l114350j1412353j1077111m251087
511.1D9020542L249519L380478Q198483M857819l026497L479622q73284n153095k09904
519.8F2923683j918667p65659J95164J033375L548271R29001n473546l095703q8535
$$ plain form
528.5 57287384 58251289 64571823 68551476 63716644 59591167 59601311 62145088 67058533 68924011
537.2 68924011 62352448 58207390 62068241 66788391 65657074 62097408 59808079 59035633 58835937
545.9 58835937 58522419 60538036 64192383 66804710 66150551 62985966 58643841 55532173 60305946
554.5 60305946 65364075 62626324 59274155 60199631 64234535 64561989 62959167 62945007 62237740
563.2 62237740 62789627 65092041 64829971 63391315 61986832 61832653 64454750 63096397 62731865
571.9 62731865 62322353 59920242 64353615 66403107 65037766 63687519 62197193 64695648 64823502
580.6 64823502 64040848 64038406 64257385 65039635 60658932 56761166 59402462 63468727 65607269
589.3 65607269 67072304 65277588 62483528 60831223 59352688 58997204 59277409 60551517 63593288
$$ packed form
528.5E7287384R63905O320534L979653m834832m125477J0144K543777M913445J865478
537.2F8924011o571563m145058L860851M720150j131317l559666k289329p72446j99696
545.9E8835937l13518K015617L654347K612327o54159l164585m342125l111668M773773
554.5F0305946N058129k737751l352169R25476M034904L27454j602822j4160p07267
563.2F2237740N51887K302414k62070j438656j404483j54179K622097j358353l64532
571.9F2731865m09512k402111M433373K049492j365341j350247j490326K498455J27854
580.6F4823502p82654k442K18979P82250m380703l897766K641296M066265K138542
589.3F5607269J465035j794716k794060j652305j478535l55484K80205J274108L041771
$$ plain form
597.9 63593288 67205559 66876724 66056747 66671135 64440445 61272388 60133617 63704964 65872200
606.6 65872200 64556099 63361950 60428974 61420647 66842720 69642685 68572441 67509323 65957695
615.3 65957695 64263924 65566101 65347008 62254139 60621597 62991688 66055794 66161430 65376968
624 65376968 64234520 63200867 62223934 63179535 64229683 61995956 61369095 61651867 60036781
632.7 60036781 60361362 62665268 64544502 64945808 63380356 62618706 62575817 63753746 65111992
641.3 65111992 63114559 61538631 61040768 64254356 68913879 67816711 64484978 62368000 63651291
650 63651291 64395912 63265877 62183781 61485367 62883705 62685471 61413460 58995045 57506916
658.7 57506916 58046131 59151760 60873207 58773315 56764702 56371368 57230366 59134399 58953617
$$ packed form
597.9F3593288L612271l28835q19977O14388k230690l168057j138771L571347K167236
606.6F5872200j316101j194149k932976R91673N422073K799965j070244j063118j551628
615.3F5957695j693771J302177k19093l092869j632542K370091L064106J05636p84462
624F5376968j142448j033653r76933R55601J050148k233727o26861K82772j615086
632.7F0036781L24581K303906J879234M01306j565452p61650m2889J177929J358246
641.3F5111992j997433j575928m97863L213588M659523j097168l331733k116978J283291
650F3651291P44621j130035j082096o98414J398338j98234j272011k418415j488129
658.7E7506916N39215J105629J721447k099892k008613l93334Q58998J904033j80782
$$ plain form
667.4 58953617 58586536 60187428 61134480 59375374 56668816 55246937 56561787 57992344 55929779
676.1 55929779 57064194 60518055 63517204 62997128 59758503 58362534 57739082 59960361 61016041
684.7 61016041 60186440 58915462 57639194 58069542 58275959 57990185 56868412 57407303 57457985 58398518
694.4 58398518 60838562 60356709 60098289 58502434 56847351 56374184 58425457 61070980 59154507
703.1 59154507 57659218 56325558 55657879 56719543 58443970 58805439 57192513 57873325 59367950
711.7 59367950 60906647 61191353 60153152 58859562 57679375 58749985 60351994 61963989 61894524
720.4 61894524 61996384 63377068 63996273 64182266 63143444 62843681 62019501 61933437 62861389 62933254
730.1 62933254 62759457 60683369 60038509 60697525 61229294 61600639 61574753 60881989 58877979 58944965
$$ packed form
667.4E8953617l67081J600892R47052j759106k706558j421879J314850J430557k062565
676.1E5929779J134415L453861K999149n20076l238625j395969o23452K221279J055680
684.7F1016041q29601j270978j276268M30348K06417k85774j121773N38891N0682R40533
694.4E8398518K440044m81853k58420j595855j655083m73167K051273K645523j916473
703.1E9154507j495289j333660o67679J061664J724427L61469j612926O80812J494625
711.7E9367950J538697K84706j038201j293590j180187J070610J602009J611995o9465
720.4F1894524J01860J380684O19205J85993j038822k99763q24180q6064R27952P1865
730.1F2933254j73797k076088o44860O59016N31769L71345k5886o92764k004010O6986
$$ plain form
739.7 58944965 59191673 59428249 60087753 59626839 60193485 60492187 60362995 60050098 59901966 59306110
749.3 59306110 57559742 56791206 57334854 59206360 59884644 58638996 58069050 57720303 57443478
758 57443478 57895927 58645435 58666103 57309952 55819237 55420925 54646740 54193779 54931122 55962856
767.7 55962856 56342884 55407478 54891678 54362476 53570694 53521553 52470619 50256683 48803673 48879971
777.3 48879971 49064060 48964176 48986900 48792793 48278706 47446545 46398315 45143906 44125893 43181633
787 43181633 42522133 42098984 40945431 39178001 38152439 37872990 37145123 36115772 35063786
795.6 35063786 35190292 35143242 33671303 31893967 30814947 31220743 31075157 30814016 30738989 31237997
805.3 31237997 32785618 33501438 34093769 33461788 32143032 32766609 35373753 37143356 38264366
$$ packed form
739.7E8944965K46708K36576O59504m60914N66646K98702j29192l12897j48132n95856
749.3E9306110j746368p68536N43648J871506O78284j245648n69946l48747k76825
758E7443478M52449P49508K0668j356151j490715l98312p74185m52961P37343J031734
767.7E5962856L80028r35406n15800n29202p91782m9141j050934k213936j453010P6298
777.3D8879971J84089r9884K2724j94107n14087q32161j048230j254409j018013r44260
787D3181633o59500m23149j153553j767430j025562k79449p27867j029351j051986
795.6C5063786J26506m7050j471939j777336j079020M05796j45586k61141p5027M99008
805.3C1237997J547621P15820N92331o31981j318756O23577K607144J769603J121010
$$ plain form
814 38264366 39439213 37440250 36393795 37201649 38129944 39681992 40089779 40488548 40751232 41346161
823.6 41346161 41803055 42732937 45222198 46026371 46833904 48866863 49730064 49591801 49920776 49765182
833.3 49765182 49441605 50898422 52681423 53988224 54429302 53964314 53523766 53658020 54124695
841.9 54124695 54517338 54801460 53686924 53774097 54944485 54075100 53719425 54973442 56307732
850.6 56307732 56893158 57125725 56363556 55656963 55721165 54460918 53591015 54021587 54437706 53982967
860.3 53982967 53526962 53594540 54029518 55505325 55351059 53863075 53453762 53212738 52163204 49317078
869.9 49317078 45974022 44452915 44887882 46479633 48723095 50069332 50922916 52117146 52453163
878.6 52453163 53245903 55294312 56436100 56887180 57248066 56643349 56698280 58113636 59120235
$$ packed form
814C8264366J174847j998963j046455Q07854R28295J552048M07787L98769K62684N94929
823.6D1346161M56894R29882K489261Q04173Q07533K032959Q63201j38263L28975j55594
833.3D9765182l23577J456817J783001J306801M41078m64988m40548J34254M66675
841.9E4124695L92643K84122j114536Q7173J170388q69385l55675J254017J334290
850.6E6307732N85426K32567p62169p06593O4202j260247q69903M30572M16119m54739
860.3E3982967m56005O7578M34978J475807j54266j487984m09313k41024j049534k846126
869.9D9317078l343056j521107M34967J591751K243462J346237Q53584J194230L36017
878.6E2453163P92740K048409J141788M51080L60886o04717N4931J415356J006599
$$ plain form
887.3 59120235 59571442 59617962 59313885 59537975 60555191 61195751 60990326 61091667 61587910 61649036
896.9 61649036 61916672 62541576 62240204 62341919 63643162 64369377 64025650 63608597 64004387 64306076
906.5 64306076 64003166 63929420 64539291 65111160 64849915 64553864 64277725 63967457 64294617 65192955
916.2 65192955 65365204 65568741 66513023 66170303 65368752 64445450 64328468 66144875 66968933 66319908
925.8 66319908 65999901 65949646 65258186 65865242 67320839 67078262 66808014 66406540 66043320 65879501
935.5 65879501 65397827 64810646 63719074 63161301 63094349 63935848 65594040 66268608 65364571 64146561
945.1 64146561 63670387 63336895 63690350 63884628 62922482 62206680 62308952 62403099 62278069 62095554
954.8 62095554 61282330 60796093 60545040 61150253 62158962 61343750 60074532 58936581 58672058
$$ packed form
887.3E9120235M51207M6520l04077K24090J017216O40560k05425J01341M96243O1126
896.9F1649036K67636O24904l01372J01715J301243P26215l43727m17053L95790L01689
906.5F4306076l02910p3746O09871N71869k61245k96051k76139l10268L27160Q98338
916.2F5192955J72249K03537R44282l42720q01551r23302j16982J816407Q24058o49025
925.8F6319908l20007n0255o91460O07056J455597k42577k70248m01474l63220j63819
935.5F5879501m81674n87181j091572n57773o6952Q41499J658192O74568r04037j218010
945.1F4146561m76174l33492L53455J94278r62146p15802J02272R4147j25030j82515
954.8F2095554q13224m86237k51053O05213J008709q15212j269218j137951k64523
$$ plain form
963.4 58672058 58802696 58598793 58511242 58060234 57876232 57461246 57528915 58233994 58538837 57930328
973.1 57930328 56637405 55988525 55990925 56660770 55862656 54462093 54171291 53556408 53457005 53500427
982.7 53500427 53581806 53475277 52980324 52835312 52189171 51170044 50500019 50027988 49751297 50167591
992.4 50167591 49507538 48344837 48012417 47355694 46703354 45799145 45790783 46030365 45404148 44791508
1002 44791508 43941853 43118996 41861042 40784672 39975796 39737179 39658802 38600628 37818356 37353802
1011.7 37353802 36886395 35954247 35699749 35564980 34457584 33890396 33547504 33975536 34645985 34651485
1021.3 34651485 34287289 33876266 33773746 33722816 33895054 34156963 34265408 33476761 33413845 34613899
1031 34613899 35460144 36219658 36607475 36543224 35751434 35541866 36453007 36951439 37167797 37008808
$$ packed form
963.4E8672058J30638k03903q7551m51008j84002m14986O7669P05079L04843o08509
973.1E7930328j292923o48880K400O69845p98114j400563k90802o14883r9403M3422
982.7E3500427Q1379j06529m94953j45012o46141j019127o70025m72031k76691M16294
992.4E0167591o60053j162701l32420o56723o52340r04209q362K39582o26217o12640
1002D4791508q49655q22857j257954j076370q08876k38617p8377j058174p82272m64554
1011.7C7353802m67407r32148k54498j34769j107396n67188l42892M28032O70449N500
1021.3C4651485l64196m11023j02520n0930J72238K61909J08445p88647o2916J200054
1031C4613899Q46245P59514L87817o4251p91790k09568R11141M98432K16358j58989
$$ plain form
1040.6 37008808 36828117 36526379 36476608 36827312 37009918 36720860 36364166 36755379 36722980 36939266
1050.2 36939266 37333488 37568390 37933270 37767262 38058609 37878750 37186352 36813828 36988083 37328659
1059.9 37328659 36861340 37140495 38191608 38532413 38132622 37747623 37433971 37780632 38117523 37605740
1069.5 37605740 37637455 37370136 36872238 36307014 35804199 35868343 35959835 36088276 35496914 35526344
1079.2 35526344 36130280 36433731 36198673 35216808 34629562 34054165 33980228 33520275 33061691 33453701
1088.8 33453701 33039158 32819187 33315838 34101719 34281460 33596264 32509872 31858414 32428993 32878719
1098.5 32878719 33119610 33585991 34028385 34172024 34502037 34880085 34471813 34394135 35026058 35804272
1108.1 35804272 36509827 37359314 38001034 38037537 37422550 36722393 37264339 38210194 39190063 39829300
$$ packed form
1040.6C7008808j80691l01738m9771L50704J82606k89058l56694L91213l2399K16286
1050.2C6939266L94222K34902L64880j66008K91347j79859o92398l72524J74255L40576
1059.9C7328659m67319K79155J051113L40805l99791l84999l13652L46661L36891n11783
1069.5C7605740L1715k67319m97898n65224n02815O4144R1492J28441n91362K9430
1079.2C5526344O03936L03451k35058r81865n87246n75397p3937m59953m58584L92010
1088.8C3453701m14543k19971M96651P85881J79741o85196j086392o51458N70579M49726
1098.5C2878719K40891M66381M42394J43639L30013L78048m08272p7678O31923P78214
1108.1C5804272P05555Q49487O41720L6503o14987p00157N41946R45855R79869O39237
$$ plain form
1117.7 39829300 40012417 40757591 41446209 41884148 41572472 40935364 41004227 41516747 42394222 43041420
1127.4 43041420 43678417 44446774 44848999 44970989 45130344 45371136 45380680 45561043 45696815 45483593
1137 45483593 45343559 45460140 45731426 46158531 47081352 47858189 48016766 47909874 47641281 47401394
1146.7 47401394 47203671 47451153 48075314 47916664 47344219 47481777 47998474 48418152 48602421 48839375
1156.3 48839375 49163467 49219273 49328735 49236084 49159710 49356174 49108730 48996986 49448769 49786777
1166 49786777 49773731 49680645 49614155 49631119 49684750 49853001 50255943 50389030 50455135 50459949 50285423
1176.6 50285423 50621075 51068401 51282387 51056507 50574108 50945911 51320423 51086052 50889980 50584049
1186.2 50584049 50769001 51397423 51910664 52350430 52235012 51846188 51497414 51274239 51262108 51355045
$$ packed form
1117.7C9829300J83117P45174O88618M37939l11676o37108O8863N12520Q77475O47198
1127.4D3041420O36997P68357M02225J21990J59355K40792R544J80363J35772k13222
1137D5483593j40034J16581K71286M27105R22821P76837J58577j06892k68593k39887
1146.7D7401394j97723K47482O24161j58650n72445J37558N16697M19678J84269K36954
1156.3D8839375L24092N5806J09462r2651p6374J96464k47444j11744M51783L38008
1166D9786777j3046r3086o6490J6964N3631J68251M02942J33087O6105M814j74526
1176.6E0285423L35652M47326K13986k25880m82399L71803L74512k34371j96072l05931
1186.2E0584049J84952O28422N13241M39766j15418l88824l48774k23175j2131R2937
$$ plain form
1195.9 51355045 51690533 51996094 52117977 52024738 52234016 52619911 52733089 52923153 52739193 52625191
1205.5 52625191 52928341 53149918 53180489 53105549 53200603 52843819 52611683 53115986 53376030 53334339
1215.1 53334339 53112408 52828423 52844509 53074505 53390560 53801781 54021656 54204533 54385014 53976490
1224.8 53976490 53570026 53719624 53767296 53470619 53697426 54348408 54613556 54704670 54483738 54115040
1234.4 54115040 53899826 53985935 54471062 54889385 55063850 54791096 54429752 54088959 54039249 54450600
1244.1 54450600 54414303 54237865 54071980 53866039 53462906 52677132 51728275 50066795 48269253 46622719
1253.7 46622719 44905231 43005882 40968781 39245083 37548359 35735619 34164879 33556633 33362598
1262.4 33362598 33779263 34978310 36472717 38287617 40112823 41908489 43766247 45343174 46433319
$$ packed form
1195.9E1355045L35488L05561J21883r3239K09278L85895J13178J90064j83960j14002
1205.5E2625191L03150K21577L0571p4940R5054l56784k32136N04303K60044m1691
1215.1E3334339k21931k83985J6086K29996L16055M11221K19875J82877J80481m08524
1224.8E3976490m06464J49598M7672k96677K26807O50982K65148R1114k20932l68698
1234.4E4115040k15214Q6109M85127M18323J74465k72754l61344l40793m9710M11351
1244.1E4450600l6297j76438j65885k05941m03133p85774r48857j661480j797542j646534
1253.7D6622719j717488j899349k037101j723698j696724j812740j570740o08246j94035
1262.4C3362598M16665J199047J494407J814900J825206J795666J857758J576927J090145
$$ plain form
1271.1 46433319 47509666 48574638 49678051 50249989 50287239 50811710 51510860 52253441 52529480
1279.8 52529480 52313160 52378723 52505474 52586105 52527290 53074932 53892223 54136929 54209999 53873260
1289.4 53873260 53655281 53845512 54305397 54772114 54840294 54989548 55106655 55258953 55297279 55206699
1299 55206699 55409431 55469055 55450302 55437649 55384468 55505260 55756958 55750847 55594204 55618572 55722622
1309.7 55722622 56024696 56018898 55845600 56052826 56221645 56318775 56408543 56554077 56509365 56269550 56242199
1320.3 56242199 56485722 56745216 56788628 56866745 56865639 56813065 56648201 56456787 56392776 56088493 56106098
1330.9 56106098 56639729 57172375 57292900 57201031 57085709 56706783 56508991 56463852 56696468 56617706
1340.5 56617706 56300812 56532162 56682369 56740643 56699875 56605789 56540676 56575264 56844490 56850826 56719105
$$ packed form
1271.1D6433319J076347J064972J103413N71938L7250N24471O99150P42581K76039
1279.8E2529480k16320O5563J26751Q0631n8815N47642Q17291K44706P3070l36739
1289.4E3873260k17979J90231M59885M66717O8180J49254J17107J52298L8326r0580
1299E5206699K02732N9624j8753j2653n3181J20792K51698o111j56643K4368J04050
1309.7E5722622L02074n798j73298K07226J68819R7130Q9768J45534m4712k39815k7351
1320.3E6242199K43523K59494M3412P8117j106n2574j64864j91414o4011l04283J7605
1330.9E6106098N33631N32646J20525r1869j15322l78926j97792m5139K32616p8762
1340.5E6617706l16894K31350J50207N8274m0768r4086o5113L4588K69226O336j31721
$$ plain form
1351.1 56719105 56281631 55925041 56075706 56252975 56258560 56160152 56027195 55687366 55708546 55851402
1360.8 55851402 55799309 55991375 55696918 55490814 55534752 55437252 55347782 55265549 54960903 54712128 54608067
1371.4 54608067 54290436 54039040 53698498 53459145 53399193 53486389 53924141 53954987 53743561 53246567
1381 53246567 52711380 52583294 52391479 52118244 51778893 51474979 51100849 50998581 50971497 50869926
1390.7 50869926 50774010 50411594 50223583 49760796 48855160 48398426 48044582 47761490 47191711 47290657
1400.3 47290657 47835842 47927639 47527363 47129238 47143402 47179829 47052502 46811543 46291969 45774563
1409.9 45774563 45499184 45557983 45658054 45486607 45387608 45178772 44722015 44778336 45251587 44852394
1419.6 44852394 44301456 44270573 44163490 43959579 43687824 43699280 43679516 43463413 43555473 43660603
$$ packed form
1351.1E6719105m37474l56590J50665J77269N585r8408j32957l39829K1180J42856
1360.8E5851402n2093J92066k94457k06104M3938r7500q9470q2233l04646k48775j04061
1371.4E4608067l17631k51396l40542k39353n9952Q7196M37752L0846k11426m96994
1381E3246567n35187j28086j91815k73235l39351l03914l74130j02268k7084j01571
1390.7E0869926r5916l62416j88011m62787r05636m56734l53844k83092n69779R8946
1400.3D7290657N45185R1797m00276l98125J4164L6427j27327k40959n19574n17406
1409.9D5774563k75379N8799J00071j71447r8999k08836m56757N6321M73251l99193
1419.6D4852394n50938l0883j07083k03911k71755J1456j9764k16103R2060J05130
$$ plain form
1429.2 43660603 43498589 43176693 42926693 42883549 42676510 42585468 42712265 42504040 42344856 42238422
1438.9 42238422 41982880 41977730 42078133 41870564 41588238 41286961 41193344 41404621 41649830 41297855
1448.5 41297855 40812836 40877338 40913891 40789429 40850590 40874989 40678356 40436134 40161942 39548470
1458.2 39548470 39447601 39653934 40135880 40292866 40175201 40443718 40537605 40564926 40694088 40790642
1467.8 40790642 41037083 41351479 41631374 41462471 40930092 40965664 41330570 41644199 41662601 41892311
1477.5 41892311 42247078 42259663 42385109 42737782 42634003 42751865 43049728 43112732 43163853 43290150
1487.1 43290150 43397205 43202450 43023537 43252220 43633175 43862652 43885860 44145294 44430786 44352585
1496.7 44352585 44600891 45017078 45009895 45232574 45556934 45613335 45961605 46329193 46246880 44825050
$$ packed form
1429.2D3660603j62014l21896k50000m3144k07039r1042J26797k08225j59184j06434
1438.9D2238422k55542n150J00403k07569k82326l01277r3617K11277K45209l51975
1448.5D1297855m85019O4502L6553j24462O1161K4399j96633k42222k74192o13472
1458.2C9548470j00869K06333M81946J56986j17665K68517R3887K7321J29162R6554
1467.8D0790642K46441L14396K79895j68903n32379L5572L64906L13629J8402K29710
1477.5D1892311L54767J2585J25446L52673j03779J17862K97863O3004N1121J26297
1487.1D3290150J07055j94755j78913K28683L80955K29477K3208K59434K85492p8201
1496.7D4352585K48306M16187p183K22679L24360N6401L48270L67588q2313j421830
$$ plain form
1506.4 44825050 45274837 45897362 46298454 46851387 47020969 47527962 47728985 47739429 47913948 48142483
1516 48142483 48613438 48265377 48482441 48773022 49023987 48912685 48956467 49284443 48749794 48391525
1525.7 48391525 49292210 50164860 49935009 49497391 49648556 49889542 50574120 50545788 50064705 50461369
1535.3 50461369 50710155 51077110 51224388 50037815 48857971 49680573 49693058 50612537 51722946
1544 51722946 52259060 52303196 52332188 52474266 52282986 52221375 52323265 52489552 52847095 52845222 52446209
1554.6 52446209 52345715 52972679 53633034 52632839 51925949 52264904 53223610 53325352 53337383 53376244
1564.2 53376244 53219727 53402317 53679317 53949001 53261745 52628147 53580090 54051830 54057610 53720669
1573.9 53720669 53740269 53554375 53040482 53346111 53456581 53648907 53725403 53773060 53908432 53890751
$$ packed form
1506.4D4825050M49787O22525M01092N52933J69582N06993K01023J0444J74519K28535
1516D8142483M70955l48061K17064K90581K50965j11302M3782L27976n34649l58269
1525.7D8391525R00685Q72650k29851m37618J51165K40986O84578k8332m81083L96664
1535.3E0461369K48786L66955J47278j186573j179844Q22602J2485R19479J110409
1544E1722946N36114M4136K8992J42078j91280o1611J01890J66287L57543j873l99013
1554.6E2446209j00494O26964O60355j000195p06890L38955R58706J01742J2031L8861
1564.2E3376244j56517J82590K77000K69684o87256o33598R51943M71740N780l36941
1573.9E3720669J9600j85894n13893L05629J10470J92326P6496M7657J35372j7681
$$ plain form
1583.5 53890751 53790363 53878857 53970646 53912228 53837162 53757744 53718742 53470482 53154522 53296814 53589840
1594.1 53589840 53638016 53638134 53548580 53286438 53209621 53371731 53463570 53288734 52968056 52676083 52640808
1604.7 52640808 52846527 52882931 52711529 52641102 52592709 52727432 52933624 52992859 52867569 52317856
1614.4 52317856 51998997 52395775 52299629 52165928 52006695 51708412 51691818 51845154 51969490 51914417
1624 51914417 51945301 51903393 51767120 51467510 51471611 51775696 51751457 51638226 51527287 51618946 52105343
1634.6 52105343 52339890 51956448 51498501 51661137 52116959 52294304 52558540 52516907 52214420 52222424
1644.3 52222424 52278992 51879139 51947578 52464767 52585762 52923981 53621361 54767117 55199810 52313652
1653.9 52313652 53098446 53504620 53887184 54133720 54375427 54397038 54347794 54664196 54692181 54721455
$$ packed form
1583.5E3890751j00388Q8494R1789n8418p5066p9418l9002k48260l15960J42292K93026
1594.1E3589840M8176J18q9554k62142p6817J62110R1839j74836l20678k91973l5275
1604.7E2640808K05719L6404j71402p0427m8393J34723K06192N9235j25290n49713
1614.4E2317856l18859L96778r6146j33701j59233k98283j6594J53336J24336n5073
1624E1914417L0884m1908j36273k99610M101L04085k4239j13231j10939R1659M86397
1634.6E2105343K34547l83442m57947J62636M55822J77345K64236m1633l02487Q004
1644.3E2222424N6568l99853O8439N17189J20995L38219O97380J145756M32693k886158
1653.9E2313652P84794M06174L82564K46536K41707K1611m9244L16402K7985K9274
$$ plain form
1663.6 54721455 55124752 55384304 55181129 55002762 55025860 54866943 55245480 55131168 54708317 55138367
1673.2 55138367 56149502 56523109 55442924 55605797 55726860 55886883 55919895 55671928 55785618 56183212
1682.9 56183212 56695679 55106621 55655373 56298725 56634388 56634388 56654411 56783428 56792603 56962074 56852448
1693.5 56852448 56714169 56133072 55105629 55964848 56384979 56650330 56091541 55536873 56431465 57162712
1703.1 57162712 57426449 57023605 56641087 56168571 56378075 56787819 56834202 56582649 56543671 56652870
1712.8 56652870 56735065 56756931 56727024 57227715 57420521 56605923 56633205 56705795 56843956 56805481 56672031
1723.4 56672031 56645760 56730377 56800583 56860710 57041595 57046555 56872250 56848595 57195389 57777538 57704048
1734 57704048 56294525 56475567 56909832 56993973 57157742 56921970 56621918 57026493 57013340 56859692
$$ packed form
1663.6E4721455M03297K59552k03175j78367K3098j58917L78537j14312m22851M30050
1673.2E5138367J011135L73607j080185J62873J21063J60023L3012k47967J13690L97594
1682.9E6183212N12467j589058N48752O43352L35663%K0023J29017R175J69471j09626
1693.5E6852448j38279n81097j027443Q59219M20131K65351n58789n54668Q94592P31247
1703.1E7162712K63737m02844l82518m72516K09504M09744M6383k51553l8978J09199
1712.8E6652870Q2195K1866k9907N00691J92806q14598K7282P2590J38161l8475j33450
1723.4E6672031k6271Q4617P0206O0127J80885M960j74305k3655L46794N82149p3490
1734E7704048j409523J81042M34265Q4141J63769k35772l00052M04575j3153j53648
$$ plain form
1743.6 56859692 57209015 57691013 57981915 57989532 57678013 57467865 57840855 57732502 57603447 57854485
1753.3 57854485 57964611 58097424 58154190 57816914 57788822 58073109 58151291 58223362 57865665 57723198
1762.9 57723198 58040482 57945072 57793091 57931767 58022907 57839504 58196045 58432304 57851051 57443810
1772.5 57443810 57524937 58022434 58300526 58280949 58417187 58382690 58376030 58330631 58281246 58292072 58345222
1783.2 58345222 58366291 58082943 57829628 57758591 57656715 57613361 57881165 57960163 57762104 57212315
1792.8 57212315 56909222 57229984 57175648 57027287 57111023 57249840 57218628 57043743 57277760 57518822
1802.4 57518822 57976624 58197182 58159599 58214497 58109085 58142021 58289703 58541111 58548828 58416626 58470680
1813 58470680 58357471 58214012 58157669 58404057 58718655 58858692 58801994 58564018 58434753 58575565
$$ packed form
1743.6E6859692L49323M81998K90902P617l11519k10148L72990j08353j29055K51038
1753.3E7854485J10126J32813N6766l37276k8092K84287P8182P2071l57697j42467
1762.9E7723198L17284r5410j51981J38676R1140j83403L56541K36259n81253m07241
1772.5E7443810Q1127M97497K78092j9577J36238l4497o660m5399m9385J0826N3150
1783.2E8345222K1069k83348k53315p1037j01876m3354K67804P8998j98059n49789
1792.8E7212315l03093L20762n4336j48361Q3736J38817l1212j74885K34017K41062
1802.4E7518822M57802K20558l7583N4898j05412L2936J47682K51408P717j32202N4054
1813E8470680j13209j43459n6343K46388L14598J40037n6698k37976j29265J40812
$$ plain form
1822.7 58575565 58970650 58946587 58409771 58257812 58391441 58508167 58426083 58366066 58433838 58652554
1832.3 58652554 58698471 58695801 58839394 58831146 58739960 58684338 58749500 58603771 58489101 58513844 58729080
1842.9 58729080 59113567 58659866 58712990 58918964 58839733 58852165 58968155 59111988 59030624 58922657
1852.6 58922657 58830051 58738564 58596142 58484474 58565300 58637325 58776920 58888012 59009590 59014629 58939365
1863.2 58939365 58964218 58856922 58692333 58597610 58642654 58428879 58394012 58686493 58671673 58573441 58645432
1873.8 58645432 58904827 59052742 58943962 58787933 58829395 58857185 58643753 58620846 58677177 58767029 58880074
1884.4 58880074 58811798 58725224 58746365 58952946 58879326 58537796 58661938 58874683 58960583 58982460 58908691
1895 58908691 58877396 58954746 58891315 58750484 58671940 58526253 58388584 58453983 58535492 58643822 58836861
$$ packed form
1822.7E8575565L95085k4063n36816j51959J33629J16726q2084o0017O7772K18716
1832.3E8652554M5917k670J43593q248r1186n5622O5162j45729j14670K4743K15236
1842.9E8729080L84487m53701N3124K05974p9231J2432J15990J43833q1364j07967
1852.6E8922657r2606r1487j42422j11668Q0826P2025J39595J11092J21578N039p5264
1863.2E8939365K4853j07296j64589r4723M5044k13775l4867K92481j4820r8232P1991
1873.8E8645432K59395J47915j08780j56029M1462K7790k13432k2907N6331Q9852J13045
1884.4E8880074o8276q6574K1141K06581p3620l41530J24142K12745Q5900K1877p3769
1895E8908691l1295P7350o3431j40831p8544j45687j37669O5399Q1509J08330J93039
$$ plain form
1905.6 58836861 58886089 58928879 58897289 58909542 58980217 58977226 58940403 58665180 58585697 58455845 58306839
1916.2 58306839 58523281 58420948 58375568 58638123 58718624 58568100 58519650 58616779 58643021 58664009 58621109
1926.8 58621109 58586262 58446541 58410587 58519760 58619041 58789078 58679073 58464027 58340500 58346222 58443722
1937.5 58443722 58462158 58474838 58415146 58355679 58200264 58014923 58012856 58087467 58162872 58191795 58301510
1948.1 58301510 58423340 58431450 58297855 58257549 58194382 58237602 58489559 58470020 58316547 58072323 58042595
1958.7 58042595 58269573 58417839 58445992 58308781 58326763 58321846 58341141 58404648 58342651 58325478 58252110
1969.3 58252110 58305065 58410122 58442684 58365982 58358807 58453701 58436649 58459888 58355202 58310337 58478058
1979.9 58478058 58671745 58660679 58605068 58743755 58579086 58361168 58335110 58311474 58249111 58222546 58344810
$$ packed form
1905.6E8836861M9228M2790l1590J2253P0675k991l6823k75223p9483j29852j49006
1916.2E8306839K16442j02333m5380K62555Q0501j50524m8450R7129K6242K0988m2900
1926.8E8621109l4847j39721l5954J09173R9281J70037j10005k15046j23527N722R7500
1937.5E8443722J8436J2680n9692n9467j55415j85341k067P4611P5405K8923J09715
1948.1E8301510J21830Q110j33595m0306o3167M3220K51957j9539j53473k44224k9728
1958.7E8042595K26978J48266K8153j37211J7982m917J9295O3507o1997j7173p3368
1969.3E8252110N2955J05057L2562p6702p175R4894j7052K3239j04686m4865J67721
1979.9E8478058J93687j1066n5611J38687j64669k17918k6058k3636o2363k6565J22264
$$ plain form
1990.5 58344810 58459560 58438519 58230408 58303844 58490498 58467129 58349236 58259323 58487728 58576080 58534573
2001.1 58534573 58464348 58368496 58443325 58405094 58455326 58461376 58424526 58465096 58418179 58424530 58408329 58430645
2012.7 58430645 58481667 58545567 58558773 58507118 58597889 58707687 58602379 58321064 58272358 58390450 58380116
2023.3 58380116 58364086 58405083 58465427 58495197 58414513 58425945 58554008 58499981 58475677 58496552 58465149
2033.9 58465149 58414486 58356102 58309872 58083630 58028313 58131523 58233841 58372150 58442429 58539341 58461277
2044.5 58461277 58413910 58383514 58265774 58158234 58131290 58222061 58076317 58083382 58219254 58200283 58102104
2055.1 58102104 57970573 58080875 58143078 58208260 58402187 58430466 58171089 58037315 58267483 58389587
2064.7 58389587 58390335 58349415 58303841 58229195 58262852 58314869 58162819 58114250 58047729 58171326 58375038
$$ packed form
1990.5E8344810J14750k1041k08111P3436J86654k3369j17893q9913K28405Q8352m1507
2001.1E8534573p0225r5852P4829l8231N0232O050l6850M0570m6917O351j6201K2316
2012.7E8430645N1022O3900J3206n1655R0771J09798j05308k81315m8706J18092j0334
2023.3E8380116j6030M0997O0344K9770q0684J1432J28063n4027k4304K0875l1403
2033.9E8465149n0663n8384m6230k26242n5317J03210J02318J38309P0279R6912p8064
2044.5E8461277m7367l0396j17740j07540k6944R0771j45744P065J35872j8971r8179
2055.1E8102104j31531J10302O2203O5182J93927K8279k59377j33774K30168J22104
2064.7E8389587P48m0920m5574p4646L3657N2017j52050m8569o6521J23597K03712
$$ plain form
2075.4 58375038 58461494 58475193 58228916 58111904 58104004 58151752 58165398 58191574 58333763 58381786 58282497
2086 58282497 58115032 58321411 58368282 58161343 58158585 58147041 58208759 58233032 58270889 58263412 58327496 58418980
2097.5 58418980 58391205 58522953 58587147 58565651 58350830 58146591 58178234 58192963 58124931 58093697 58295502
2108.1 58295502 58322720 58247658 58273525 58330910 58434273 58419514 58363750 58245304 58242290 58234055 58235996 58295120
2119.7 58295120 58237366 58350002 58499485 58597183 58431526 58182053 58209076 58255577 58358860 58430531 58405807
2130.3 58405807 58286762 58242493 58278759 58196915 58139984 58196297 58337654 58265224 58135979 58147816 58197365
2140.9 58197365 58247776 58202866 58204041 58186775 58220673 58359455 58326618 58155659 58222919 58390629 58342777
2151.5 58342777 58343838 58320076 58334625 58335670 58197723 58191990 58252377 58360321 58299000 58180290 58145485 58159313
$$ packed form
2075.4E8375038Q6456J3699k46277j17012p900M7748J3646K6176J42189M8023r9289
2086E8282497j67465K06379M6871k06939k758j1544O1718K4273L7857p477O4084R1484
2097.5E8418980k7775J31748O4194k1496k14821k04239L1643J4729o8032l1234K01805
2108.1E8295502K7218p5062K5867N7385J03363j4759n5764j18446l014q235J941N9124
2119.7E8295120n7754J12636J49483R7698j65657k49473K7023M6501J03283P1671k4724
2130.3E8405807j19045m4269L6266q1844n6931N6313J41357p2430j29245J1837M9549
2140.9E8197365N0411m4910J175j7266L3898J38782l2837j70959O7260J67710m7852
2151.5E8342777J061k3762J4549J045j37947n733O0387J07944o1321j18710l4805J3828
$$ plain form
2163.1 58159313 58445652 58608738 58522186 58431854 58286476 58167545 58255798 58350803 58396259 58529896 58567223
2173.7 58567223 58470100 58204147 58141273 58249435 58149483 58152073 58168144 58284206 58438702 58289627 58153450
2184.3 58153450 58106014 58126186 58267517 58363190 58343372 58224129 58158615 58289795 58319855 58161552 58108841
2194.9 58108841 58221886 58338310 58311905 58297127 58278976 58281689 58374771 58372929 58347885 58361313 58437218 58495125
2206.5 58495125 58435017 58287151 58179516 58132439 58075108 58237518 58426235 58429687 58299843 58201778 58336029
2217.1 58336029 58312408 58121899 58123367 58255550 58309956 58279797 58176659 58039757 57992813 58023724 58173954
2227.7 58173954 58182320 58085018 58200722 58389797 58481503 58407352 58280945 58212708 58305439 58351997 58215229
2238.3 58215229 58137421 58236832 58456577 58415764 58225746 58152126 58172932 58187462 58170109 58224888 58141899
$$ packed form
2163.1E8159313K86339J63086q6552r0332j45378j18931Q8253R5005M5456J33637L7327
2173.7E8567223r7123k65953o2874J08162r9952K590J6071J16062J54496j49075j36177
2184.3E8153450m7436K0172J41331R5673j9818j19243o5514J31180L0060j58303n2711
2194.9E8108841J13045J16424k6405j4778j8151K713R3082j842k5044J3428P5905N7907
2206.5E8495125o0108j47866j07635m7077n7331J62410J88717L452j29844r8065J34251
2217.1E8336029k3621j90509J468J32183N4406l0159j03138j36902m6944L0911J50230
2227.7E8173954Q366r7302J15704J89075R1706p4151j26407o8237R2731M6558j36768
2238.3E8215229p7808R9411K19745m0813j90018p3620K0806J4530j7353N4779q2989
$$ plain form
2248.9 58141899 58176861 58262421 58093472 57989887 58075611 58220119 58207985 58094925 57991348 58071045 58173759
2259.5 58173759 58090714 58058002 58065975 58176811 58222950 58146931 57984489 57827843 57913380 58021233 58119808
2270.2 58119808 58153397 58152779 58158703 58091137 58037022 58122074 58241711 58090836 57958130 57915672 57978558 58091251
2281.7 58091251 58170906 58307076 58151230 58095791 58255531 58293827 58166550 58017891 58046482 57925568
2291.4 57925568 57957447 58159607 58207417 58069859 57869450 57884453 57924793 58033703 57972687 57776287 57710178
2302 57710178 57709919 57773613 57675591 57702290 57941357 58161854 58010380 57718533 57799709 57861080 57878685 57771988
2313.5 57771988 57554146 57481270 57702049 57923435 57753979 57545975 57501816 57841148 58172665 58257332
2323.2 58257332 57935333 57554764 57637222 57499298 57569035 57632042 57479942 57229050 56850933 56731277
$$ packed form
2248.9E8141899L4962Q5560j68949j03585Q5724J44508j2134j13060j03577P9697J02714
2259.5E8173759q3045l2712P973J10836M6139p6019j62442j56646Q5537J07853R8575
2270.2E8119808L3589o18N924o7566n4115Q5052J19637j50875j32706m2458O2886J12693
2281.7E8091251P9655J36170j55846n5439J59740L8296j27277j48659K8591j20914
2291.4E7925568L1879K02160M7810j37558k00409J5003M0340J08910o1016j96400o6109
2302E7710178k59O3694r8022K6699K39067K20497j51474k91847Q1176O1371J7605j06697
2313.5E7771988k17842p2876K20779K21386j69456k08004m4159L39332L31517Q4667
2323.2E8257332l21999l80569Q2458j37924O9737O3007j52100k50892l78117j19656
$$ plain form
2332.8 56731277 56526848 56924107 57297497 57486774 57957035 58068161 57725895 57134583 57237221 57321358
2342.5 57321358 56966595 57029545 57445496 57501484 57221462 57284855 57494045 57804272 57848564 57564579
2352.1 57564579 57383419 57283691 57550056 57669167 57659367 57426762 57260597 57065247 56793247 56848549
2361.8 56848549 56305580 56025414 56163013 56482864 56844311 57126373 57394142 57296349 57469063 57578751
2371.4 57578751 57589924 57621784 57523663 57446487 57251019 57124538 57149265 57315434 57493408 57681416 57821781
2382 57821781 57746056 57684723 57694397 57644386 57658195 57767872 57649158 57587032 57751152 57862732 57975544
2392.6 57975544 57936329 57827854 57714115 57668533 57662159 57611446 57674633 57680294 57791748 57874870 57847954
2403.2 57847954 57784294 57552345 57507175 57619003 57714943 57619747 57504101 57533260 57448135 57454079 57554390
$$ packed form
2332.8E6731277k04429L97259L73390J89277M70261J11126l42266n91312J02638Q4137
2342.5E7321358l54763O2950M15951N5988k80022O3393K09190L10227M4292k83985
2352.1E7564579j81160r9728K66365J19111r800k32605j66165j95350k72000N5302
2361.8E6848549n42969k80166J37599L19851L61447K82062K67769r7793J72714J09688
2371.4E7578751J1173L1860r8121p7176j95468j26481K4727J66169J77974J88008J40365
2382E7821781p5725o1333R674n0011J3809J09677j18714o2126J64120J11580J12812
2392.6E7975544l9215j08475j13739m5582o374n0713O3187N661J11454Q3122k6916
2403.2E7847954o3660k31949m5170J11828R5940r5196j15646K9159q5125N944J00311
$$ plain form
2413.8 57554390 57639080 57758694 57883854 57792645 57559559 57455997 57437019 57595692 57715969 57632706
2423.5 57632706 57462635 57408646 57515251 57555466 57540524 57410336 57323303 57323067 57282524 57285393 57418827
2434.1 57418827 57649872 57693657 57623718 57538654 57428986 57317627 57305519 57457951 57529610 57612877 57693283
2444.7 57693283 57606014 57423260 57348869 57394775 57377934 57356350 57250103 57137638 57145901 57295410 57448540
2455.3 57448540 57431896 57460373 57521774 57608711 57587780 57414963 57334068 57288227 57256992 57201736 57205807 57321922
2466.9 57321922 57367622 57257664 57158756 57224583 57315086 57373337 57310177 57116047 56983997 57012657 57206104
2477.5 57206104 57361057 57185688 56940807 56998222 57012402 56905811 56847157 56830894 56940914 57050224
2487.1 57050224 57096855 57048935 56936527 56770752 56629303 56657352 56680214 56666775 56628548 56542805 56429935
$$ packed form
2413.8E7554390Q4690J19614J25160r1209k33086j03562j8978J58673J20277q3263
2423.5E7632706j70071n3989J06605M0215j4942j30188q7033k36m0543K869J33434
2434.1E7418827K31045M3785o9939q5064j09668j11359j2108J52432P1659Q3267Q0406
2444.7E7693283q7269j82754p4391M5906j6841k1584j06247j12465Q263J49509J53130
2455.3E7448540j6644K8477O1401Q6937k0931j72817q0895m5841l1235n5256M071J16115
2466.9E7321922M5700j09958r8908O5827R0503N8251o3160j94130j32050K8660J93447
2477.5E7206104J54953j75369k44881N7415J4180j06591n8654j6263J10020J09310
2487.1E7050224M6631m7920j12408j65775j41449K8049K2862j3439l8227q5743j12870
$$ plain form
2497.7 56429935 56338631 56352661 56454250 56531258 56366760 56134930 56103107 56183468 56241650 56205513 56051357
2508.3 56051357 55950539 56045914 56107349 56130207 56190125 56179420 56117771 56104370 56211235 56282413 56252415
2519 56252415 56133999 56049824 56145367 56257542 56269161 56174465 56089539 56138340 56304810 56448250 56434189
2529.6 56434189 56327709 56300713 56352280 56400444 56497154 56527626 56493774 56442703 56417767 56544949 56627907
2540.2 56627907 56581871 56449165 56350460 56418884 56569942 56624054 56575813 56518665 56392769 56431778 56635075
2550.8 56635075 56775013 56701519 56444885 56395775 56506275 56680180 56740028 56615715 56548527 56568760 56699799
2561.4 56699799 56726341 56651035 56596062 56543499 56416172 56256416 56322746 56419548 56405228 56332085 56354942
2572 56354942 56524704 56629707 56620041 56546879 56553493 56536892 56473579 56445271 56480328 56519409 56417889 56357239
$$ packed form
2497.7E6429935r1304J4030J01589P7008j64498k31830l1823Q0361N8182l6137j54156
2508.3E6051357j00818R5375O1435K2858N9918j0705o1649j3401J06865P1178k9998
2519E6252415j18416q4175R5543J12175J1619r4696q4926M8801J66470J43440j4061
2529.6E6434189j06480k6996N1567M8164R6710L0472l3852n1071k4936J27182Q2958
2540.2E6627907m6036j32706r8705O8424J51058N4112m8241n7148j25896L9009K03297
2550.8E6635075J39938p3494k56634m9110J10500J73905N9848j24313o7188K0233J31039
2561.4E6699799K6542p5306n4973n2563j27327j59756O6330R6802j4320p3143K2857
2572E6354942J69762J05003r666p3162O614j6601o3313k8308L5057L9081j01520o0650
$$ plain form
2583.6 56357239 56393265 56503880 56527058 56413036 56282452 56227814 56433887 56653667 56656731 56474384 56432251
2594.2 56432251 56484947 56389122 56380100 56342548 56280800 56232170 56199360 56182407 56199551 56411728 56585995
2604.8 56585995 56716759 56744213 56702232 56667850 56454403 56215038 56043148 56051746 56196114 56322105 56355076
2615.4 56355076 56283318 56323002 56569031 56782867 56664326 56464298 56381969 56360790 56380154 56393536 56343853
2626 56343853 56228184 56254807 56339901 56442680 56485603 56436520 56427372 56341042 56322319 56365528 56423717 56391655
2637.6 56391655 56240337 56129204 56009434 56066212 56255978 56440132 56399792 56240517 56328018 56406223
2647.2 56406223 56405190 56253487 56012230 55968708 56051987 56059525 55989326 56031662 56076817 56094608 56196342
2657.8 56196342 56313698 56341122 56277111 56186726 56116322 56118599 56187759 56279560 56223488 56153072 56158787 56102341
$$ packed form
2583.6E6357239L6026J10615K3178j14022j30584n4638K06073K19780L064j82347m2133
2594.2E6432251N2696r5825r022l7552o1748m8630l2810j6953J7144K12177J74267
2604.8E6585995J30764K7454m1981l4382k13447k39365j71890Q598J44368J25991L2971
2615.4E6355076p1758L9684K46029K13836j18541k00028q2329k1179J9364J3382m9683
2626E6343853j15669K6623Q5094J02779M2923m9083r148q6330j8723M3209N8189l2062
2637.6E6391655j51318j11133j19770N6778J89766J84154m0340j59275Q7501P8205
2647.2E6406223j033j51703k41257m3522Q3279P538p0199M2336M5155J7791J01734
2657.8E6196342J17356K7424o4011r0385p0404K277O9160R1801n6072p0416N715n6446
$$ plain form
2669.4 56102341 56010086 55949142 55976440 55977325 56142841 56275635 56183666 56151264 56146671 56203907 56085567 56042168
2681 56042168 56145565 56093243 56092560 56019905 56011116 55994343 55944134 55998257 56006016 56022129 56050354 56182205
2692.5 56182205 56127369 55895218 55801083 55878227 56027920 56070343 56160179 56112965 56023781 56019978 55923698
2703.1 55923698 55949364 56111855 56193451 56025467 55895802 55882271 55845337 55761833 55662991 55787033 55935425
2713.8 55935425 55971760 55906147 55846375 55842968 55816757 55782993 55731750 55837666 55857616 55820072 55861183 55873005
2725.3 55873005 55857742 55787560 55911991 55850113 55686081 55729218 55765762 55928711 55912098 55815506 55778778
2735.9 55778778 55655930 55596451 55633453 55873360 56046787 56010571 55893463 55747616 55710171 55703430 55650204
2746.5 55650204 55694752 55821098 55791378 55744438 55768021 55713200 55609127 55536861 55598129 55649132 55593224
$$ packed form
2669.4E6102341r2255o0944K7298Q85J65516J32794r1969l2402m593N7236j18340m3399
2681E6042168J03397n2322o83p2655q789j6773n0209N4123P759J6113K8225J31851
2692.5E6182205n4836k32151r4135P7144J49693M2423Q9836m7214q9184l803r6280
2703.1E5923698K5666J62491Q1596j67984j29665j3531l6934q3504r8842J24042J48392
2713.8E5935425L6335o5613n9772l407k6211l3764n1243J05916J9950l7544M1111J1822
2725.3E5873005j5263p0182J24431o1878j64032M3137L6544J62949j6613r6592l6728
2735.9E5778778j22848n9479L7002K39907J73427l6216j17108j45847l7445o741n3226
2746.5E5650204M4548J26346k9720m6940K3583n4821j04073p2266O1268N1003n5908
$$ plain form
2757.2 55593224 55576973 55579926 55562946 55653759 55721058 55694305 55781273 55803749 55669006 55511490 55479427
2767.8 55479427 55574314 55543739 55442810 55334633 55279099 55336914 55432941 55551781 55513428 55463837 55593140
2778.4 55593140 55488773 55182522 55151661 55241974 55280273 55356045 55296307 55169785 55203350 55224236 55077869
2789 55077869 55020351 55150288 55147812 55020271 55004261 55061447 55144211 55081562 54920551 54930073 54895634 54882050
2800.5 54882050 55002247 55044525 55085655 55071625 54995705 54862885 54727020 54815449 54920883 54836357 54706348
2811.2 54706348 54691204 54822929 54964607 54911209 54810390 54829735 54913952 55025013 54969013 54815483 54703346
2821.8 54703346 54732079 54803547 54701588 54629150 54591454 54672966 54758926 54676517 54643318 54563004 54400974
2832.4 54400974 54276184 54377098 54494816 54456688 54506424 54520386 54444485 54354504 54309788 54251995 54180706
$$ packed form
2757.2E5593224j6251K953j6980R0813O7299k6753Q6968K2476j34743j57516l2063
2767.8E5479427R4887l0575j00929j08177n5534N7815R6027J18840l8353m9591J29303
2778.4E5593140j04367l06251l0861R0313L8299P5772n9738j26522L3565K0886j46367
2789E5077869n7518J29937k476j27541j6010N7186Q2764o2649j61011R522l4439j3584
2800.5E4882050J20197M2278M1130j4030p5920j32820j35865Q8429J05434q4526j30009
2811.2E4706348j5144J31725J41678n3398j00819J9345Q4217J11061n6000j53530j12137
2821.8E4703346K8733P1468j01959p2438l7696Q1512Q5960q2409l3199q0314j62030
2832.4E4400974j24790J00914J17718l8128M9736J3962p5901q9981m4716n7793p1289
$$ plain form
2843 54180706 54093178 54010483 54008514 53838699 53690273 53654106 53675911 53776085 53815639 53754356 53432678
2853.6 53432678 53277859 53329273 53254826 53277664 53435577 53611225 53621861 53527905 53462196 53549755 53653198
2864.2 53653198 53597507 53584206 53533993 53518204 53569973 53600224 53513050 53381092 53442570 53449318 53504337 53514938
2875.8 53514938 53284683 53238468 53293987 53332275 53429173 53385487 53279026 53262215 53183567 53114227 53162586
2886.4 53162586 53148888 53036793 52946495 52934647 52906410 52858482 52829372 52739178 52633942 52521206 52378548
2897 52378548 52303940 52274693 52245922 52125813 51829082 51653595 51640976 51566208 51378719 51255825 51425114
2907.6 51425114 51541187 51545025 51594269 51608463 51690430 51798382 51808933 51661461 51628071 51686802 51805870
2918.2 51805870 51940784 51713573 51561752 51486351 51451073 51585106 51566341 51603901 51589760 51510162 51540005
$$ packed form
2843E4180706q7528q2695j969j69815j48426l6167K1805J00174L9554o1283l21678
2853.6E3432678j54819N1414p4447K2838J57913J75648J0636r3956o5709Q7559J03443
2864.2E3653198n5691j3301n0213j5789N1769L0251q7174j31958O1478O748N5019J0601
2875.8E3514938k30255m6215N5519L8288R6898m3686j06461j6811p8648o9340M8359
2886.4E3162586j3698j12095r0298j1848k8237m7928k9110r0194j05236j12736j42658
2897E2378548p4608k9247k8771j20109k96731j75487j2619p4768j87489j22894J69289
2907.6E1425114J16073L838M9244J4194Q1967J07952J0551j47472l3390N8731J19068
2918.2E1805870J34914k27211j51821p5401l5278J34033j8765L7560j4141p9598K9843
$$ plain form
2928.8 51540005 51605473 51694904 51709011 51619667 51571384 51630302 51587582 51615765 51675591 51605976 51573765 51497841
2940.4 51497841 51481560 51471905 51351257 51213230 51078167 50918255 50737312 50556221 50323406 50035942
2950 50035942 49680260 49408836 49040390 48501369 48019955 47473492 46915134 46272514 45508965 44745049
2959.7 44745049 44215649 43916504 43635788 43494877 43354588 43331146 43435822 43646690 44155220 44735203
2969.3 44735203 45379482 45940193 46352951 46748425 47202225 47713139 48093357 48455116 48767231 49057373
2979 49057373 49375530 49639336 49838444 50062302 50328812 50371220 50469559 50697197 50823147 50947590
2988.6 50947590 51038113 51094799 51166847 51319160 51402309 51437851 51575039 51716896 51861382 52063801 52226364
2999.2 52226364 52082169 51849255 51833389 51984249 52144314 52196960 52181000 52133373 52213223 52375240 52537918
$$ packed form
2928.8E1540005O5468Q9431J4107q9344m8283N8918m2720K8183N9826o9615l2211p5924
2940.4E1497841j6281r655j20648j38027j35063j59912j80943j81091k32815k87464
2950E0035942l55682k71424l68446n39021m81414n46463n58358o42620p63549p63916
2959.7D4745049n29400k99145k80716j40911j40289k3442J04676K10868N08530N79983
2969.3D4735203O44279N60711M12758L95474M53800N10914L80218L61759L12115K90142
2979D9057373L18157K63806J99108K23858K66510M2408R8339K27638J25950J24443
2988.6E0947590R0523N6686P2048J52313Q3149L5542J37188J41857J44486K02419J62563
2999.2E2226364j44195k32914j5866J50860J60065N2646j5960m7627P9850J62017J62678
$$ plain form
3009.8 52537918 52520668 52370464 52413010 52402679 52371075 52424995 52463825 52438442 52338547 52316830 52376144
3020.4 52376144 52517471 52551620 52495136 52469063 52377983 52361366 52510677 52666298 52525539 52308201 52381599
3031 52381599 52572548 52650665 52595234 52486301 52459763 52554993 52523815 52408718 52422695 52610813 52783192
3041.6 52783192 52609180 52330307 52267750 52382233 52411701 52393131 52488083 52520535 52515182 52467514 52380150
3052.2 52380150 52309792 52330086 52440365 52465496 52423531 52317883 52239529 52233810 52217110 52275658 52429607
3062.9 52429607 52463829 52417263 52418465 52277927 52129585 52082367 52180614 52359573 52363510 52289791 52168991
3073.5 52168991 52108200 52183697 52346535 52342083 52068172 51935848 51935535 51937740 52014076 52186008 52203457 52117393
3085 52117393 52203075 52218857 52117210 52059860 52137978 52115875 51963875 51849968 51755501 51828793 51782352
$$ packed form
3009.8E2537918j7250j50204M2546j0331l1604N3920L8830k5383r9895k1717N9314
3020.4E2376144J41327L4149n6484k6073r1080j6617J49311J55621j40759k17338P3398
3031E2381599J90949P8117n5431j08933k6538R5230l1178j15097J3977J88118J72379
3041.6E2783192j74012k78873o2557J14483K9468j8570R4952L2452n353m7668q7364
3052.2E2380150p0358K0294J10279K5131m1965j05648p8354n719j6700N8548J53949
3062.9E2429607L4222m6566J202j40538j48342m7218R8247J78959L937p3719j20800
3073.5E2168991o0791P5497J62838m452k73911j32324l13K205P6336J71932J7449q6064
3085E2117393Q5682J5782j01647n7350P8118k2103j52000j13907r4467P3292m6441
$$ plain form
3095.6 51782352 51673088 51726826 51899971 52146584 52148277 51978237 51852779 51842789 51767414 51688805 51742180
3106.2 51742180 51761684 51791252 51791027 51832573 51846210 51818253 51729507 51604530 51641796 51597363 51570145 51596012
3117.8 51596012 51589130 51563847 51542206 51647572 51655640 51563236 51474266 51444614 51445511 51427799 51303711 51169224
3129.4 51169224 51260139 51334988 51514286 51491974 51267467 51353043 51350166 51331470 51342236 51289314 51212017
3140 51212017 51170506 51280109 51237560 51105949 51054501 51084663 51039898 51013351 51185329 51228928 51181004
3150.6 51181004 51184795 51183472 51065502 50938385 50929863 50886715 50815941 50729523 50727695 50827263 50865208 50778534
3162.2 50778534 50691208 50594547 50495659 50630280 50673538 50500771 50444794 50490135 50504368 50399624 50269157
3172.8 50269157 50256912 50345402 50424683 50400623 50183620 49939659 49948654 50119652 50180298 50119999 50154137
$$ packed form
3095.6E1782352j09264N3738J73145K46613J693j70040j25458r990p5375p8609N3375
3106.2E1742180J9504K9568k25M1546J3637k7957q8746j24977L7266m4433k7218K5867
3117.8E1596012o882k5283k1641J05366Q068r2404q8970k9652Q97j7712j24088j34487
3129.4E1169224R0915P4849J79298k2312k24507Q5576k877j8696J0766n2922p7297
3140E1212017m1511J09603m2549j31611n1448L0162m4765k6547J71978M3599m7924
3150.6E1181004L791j323j17970j27117q522m3148p0774q6418j828R9568L7945q6674
3162.2E0778534q7326r6661r8888J34621M3258j72767n5977M5341J4233j04744j30467
3172.8E0269157j2245Q8490P9281k4060k17003k43961Q995J70998O0646o0299L4138
$$ plain form
3183.4 50154137 50066120 49856621 49791035 49809849 49908932 50029774 50102467 50061035 49898575 49646275 49584465
3194 49584465 49728416 49703728 49726711 49792149 49776699 49664906 49383152 49141781 49085579 49321629 49528137
3204.6 49528137 49528080 49406815 49192520 49089535 48978401 48914169 48964787 48967148 48954483 48884308 48715130
3215.2 48715130 48649208 48773437 48830853 48749298 48698929 48739243 48750080 48711563 48569862 48295898 48242634
3225.8 48242634 48384968 48440563 48472187 48518139 48461048 48411579 48420979 48402756 48356667 48026432 47753712
3236.4 47753712 47900921 48101860 48216839 48170372 48006767 47872643 47857677 47835720 47781593 47861481 47817036
3247 47817036 47560623 47359383 47427776 47481693 47429691 47528343 47583771 47514805 47435936 47497131 47510838 47349827
3258.6 47349827 47275711 47228245 47152023 47140446 47223923 47144146 46939312 46881626 46857422 46834873 46903042
$$ packed form
3183.4E0154137q8017k09499o5586J8814R9083J20842P2693m1432j62460k52300o1810
3194D9584465J43951k4688K2983O5438j5450j11793k81754k41371n6202K36050K06508
3204.6D9528137n7j21265k14295j02985j11134o4232N0618K361j2665p0175j69178
3215.2D8715130o5922J24229N7416q1555n0369M0314J0837l8517j41701k73964n3264
3225.8D8242634J42334N5595L1624M5952n7091m9469R400j8223m6089l30235k72720
3236.4D7753712J47209K00939J14979m6467j63605j34124j4966k1957n4127P9888m4445
3247D7817036k56413k01240O8393N3917n2002R8652N5428o8966p8869O1195J3707j61011
3258.6D7349827p4116m7466p6222j1577Q3477p9777k04834n7686k4204k2549O8169
$$ plain form
3269.2 46903042 47095711 47129799 47043118 47049458 46943001 46767967 46663303 46669521 46648666 46539486 46437111
3279.8 46437111 46401981 46453640 46480709 46467468 46378227 46343876 46380722 46423363 46555172 46564774 46419361
3290.4 46419361 46184456 45986710 45980011 46034515 46103157 46059612 45941986 45985077 46002518 45904964 45806602
3301 45806602 45707375 45720757 45694111 45617222 45619881 45476181 45347301 45376945 45388992 45343613 45293537 45179863
3312.6 45179863 44950722 44851788 44930996 45036835 45032131 44888725 44667847 44468750 44409771 44422901 44496620
3323.2 44496620 44397697 44155518 44164570 44200249 44117985 44168747 44184425 43981972 43852615 43801956 43780907
3333.8 43780907 43798180 43661160 43406570 43156544 43134701 43209877 43154476 43018139 42967678 43106426 43090706
3344.4 43090706 42974632 42835186 42549702 42347137 42335159 42349888 42245903 42132145 42014549 42012321
$$ packed form
3269.2D6903042J92669L4088q6681O340j06457j75034j04664O218k0855j09180j02375
3279.8D6437111l5130N1659K7069j3241q9241l4351L6846M2641J31809R602j45413
3290.4D6419361k34905j97746o699N4504O8642m3545j17626M3091J7441r7554r8362
3301D5806602r9227J3382k6646p6889K659j43700j28880K9644J2047m5379n0076j13674
3312.6D5179863k29141r8934P9208J05839m704j43406k20878j99097n8979J3130P3719
3323.2D4496620r8923k42179R052L5679q2264N0762J5678k02453j29357n0659k1049
3333.8D3780907J7273j37020k54590k50026k1843P5176n5401j36337n0461J38748j5720
3344.4D3090706j16074j39446k85484k02565j1978J4729j03985j13758j17596k228
$$ plain form
3354.1 42012321 41950859 41713734 41634956 41560017 41483593 41385983 41299835 41261364 41199036 41203465 41015854
3364.7 41015854 40808113 40671913 40535664 40530430 40485260 40386135 40245075 40166874 40178696 40146729 40024357
3375.3 40024357 39856594 39756500 39756500 39827141 39742500 39410679 39054554 38992588 39121151 39155956 39102085
3385.9 39102085 39018246 39099720 39159946 39009174 38835308 38806835 38919712 38871895 38648537 38434219 38426235
3396.5 38426235 38537899 38444275 38212765 38114124 38132812 38075314 38081413 38050537 37984001 38033134 38045589
3407.1 38045589 37935764 37723866 37710968 37753624 37746174 37780151 37654133 37540894 37484547 37490726 37461483
3417.7 37461483 37307465 37284492 37366890 37399773 37405132 37347359 37113892 36947582 36963001 37015011 37088066
3428.3 37088066 37182938 37200741 37091816 37120995 37102077 37007370 36958916 36778423 36785393 36877056 36805187
$$ packed form
3354.1D2012321o1462k37125p8778p4939p6424r7610q6148l8471o2328M429j87611
3364.7D1015854k07741j36200j36249n234m5170r9125j41060p8201J1822l1967j22372
3375.3D0024357j67763j00094%P0641q4641l31821l56125o1966J28563L4805n3871
3385.9C9102085q3839Q1474O0226j50772j73866k8473J12877m7817k23358k14318p984
3396.5C8426235J11664r3624k31510r8641J8688n7498O099l0876o6536M9133J2455
3407.1C8045589j09825k11898j2898M2656p450L3977j26018j13239n6347O179k9243
3417.7C7461483j54018k2973Q2398L2883N359n7773k33467j66310J5419N2010P3055
3428.3C7088066R4872J7803j08925K9179j8918r4707m8454j80493O970R1663p1869
$$ plain form
3439 36805187 36697472 36680031 36680149 36565571 36575222 36738613 37014534 37062775 36718803 36593891 36644817
3449.6 36644817 36635906 36641087 36688126 36663307 36697128 36806709 36802849 36829552 36811901 36758617 36913742 37042370
3461.1 37042370 36906101 36826542 36929390 36991550 37021442 37008545 37035297 37245346 37321194 37072098 37036896
3471.7 37036896 37276390 37421768 37488773 37364254 37267410 37307400 37324661 37436951 37588074 37688183
3481.4 37688183 37663258 37674648 37764755 37730976 37762646 37994061 38145493 38111412 38137474 38206047 38309761
3492 38309761 38275143 38111095 38207592 38391102 38532558 38605755 38646786 38726955 38811817 38912254 38743446
3502.6 38743446 38578930 38570015 38542198 38730019 38882149 38890911 38820057 38725368 38842949 39036869 39157810
3513.2 39157810 39192924 39187973 39226227 39208363 39109604 39062443 39061047 39259521 39532433 39432873 39206543
$$ packed form
3439C6805187j07715j7441J18j14578R651J63391K75921M8241l43972j24912N0926
3449.6C6644817q911N181M7039k4819L3821J09581l860K6703j7651n3284J55125J28628
3461.1C7042370j36269p9559J02848O2160K9892j2897K6752K10049P5848k49096l5202
3471.7C7036896K39494J45378O7005j24519r6844L9990J7261J12290J51123J00109
3481.4C7688183k4925J1390R0107l3779L1670K31415J51432l4081K6062O8573J03714
3492C8309761l4618j64048R6497J83510J41456P3197M1031Q0169Q4862J00437j68808
3502.6C8743446j64516q915k7817J87821J52130Q762p0854r4689J17581J93920J20941
3513.2C9157810L5114m951L8254j7864r8759m7161j396J98474K72912r9560k26330
$$ plain form
3523.8 39206543 39167580 39271427 39531445 39804279 39936977 39835468 39759918 39809990 39856403 39955696 40161507
3534.4 40161507 40473030 40454266 40158131 40205425 40367744 40541908 40821301 41050327 41171749 41337193
3544.1 41337193 41407658 41240395 41155624 41021164 41077194 41348076 41554161 41630325 41523327 41719982
3553.7 41719982 41844334 41844639 41954487 41951805 42227428 42450504 42320827 42145481 42208992 42338501 42316677
3564.3 42316677 42659256 42860279 42858093 42806385 42642727 42936298 43030582 43076023 43218845 43278980 43251179
3574.9 43251179 43295544 43499432 43490150 43683014 43921177 43929413 43883545 43927082 44134083 44276054 44764366
3585.5 44764366 44922848 44428280 44345726 44205536 44363731 44496578 44698719 44869442 45079559 45403152
3595.2 45403152 45090126 45044930 45125523 45119560 45499901 45738796 45663158 45601219 45546665 45480518 45664188
$$ packed form
3523.8C9206543l8963J03847K60018K72834J32698j01509p5550N0072M6413R9293K05811
3534.4D0161507L11523j8764k96135M7294J62319J74164K79393K29026J21422J65444
3544.1D1337193P0465j67263q4771j34460N6030K70882K06085P6164j06998J96655
3553.7D1719982J24352L05J09848k682K75623K23076j29677j75346O3511J29509k1824
3564.3D2316677L42579K01023k186n1708j63658K93571R4284M5441J42822O0135k7801
3574.9D3251179M4365K03888r282J92864K38163Q236m5868M3537K07001J41971M88312
3585.5D4764366J58482m94568q2554j40190J58195J32847K02141J70723K10117L23593
3595.2D5403152l13026m5196Q0593n963L80341K38895p5638o1939n4554o6147J83670
$$ plain form
3605.8 45664188 45899128 46154930 46636871 46217957 45912785 46567562 46613338 46175533 46433151 46459145
3615.4 46459145 46828876 47173458 46838825 46605736 46329250 46429924 46619350 46733177 46941395 47154900
3625.1 47154900 47216267 47280037 47986958 47972977 46691845 46974911 47448536 47980556 47938129 47551800
3634.7 47551800 47665138 47976994 48160187 48090092 48127026 48179825 48190559 47976959 47778980 47943123
3644.4 47943123 48375763 48916874 48658554 48458305 48869041 48797680 48333706 48005161 48477119 48940628
3654 48940628 49420254 49881420 48926052 48876606 49332165 49394169 49417664 49418335 49585289 49488697 49336330
3664.6 49336330 49365147 49274857 49614410 49737698 49452446 49532085 49017292 49193935 49960503 51222191
3674.3 51222191 52048203 49535576 48844032 49336811 49853531 49559551 49525288 49717072 49688007 49682484
$$ packed form
3605.8D5664188K34940K55802M81941m18914l05172O54777M5776m37805K57618K5994
3615.4D6459145L69731L44582l34633k33089k76486J00674J89426J13827K08218K13505
3625.1D7154900O1367O3770P06921j3981j281132K83066M73625N32020m2427l86329
3634.7D7551800J13338L11856J83193p0095L6934N2799J0734k13600j97979J64143
3644.4D7943123M32640N41111k58320k00249M10736p1361m63974l28545M71958M63509
3654D8940628M79626M61166r55368m9446M55559O2004K3495O71J66954r6592j52367
3664.6D9336330K8817r0290L39553J23288k85252P9639n14793J76643P66568J261688
3674.3E1222191Q26012k512627o91544M92779N16720k93980l4263J91784k9065n523
$$ plain form
3683.9 49682484 49703056 49911942 50275623 50789490 49675480 49274174 50190376 49478733 49241199 49562542
3693.5 49562542 49763741 49952042 49834126 49819492 50019981 50320534 50511837 50516792 49809822 49702511
3703.2 49702511 50289013 50282631 50188995 50101116 50323914 50663624 49719425 50019070 50475677 49357338
3712.8 49357338 49730324 50233547 50220695 50209324 50457661 50557404 49953072 49809410 50457970 50259922
3722.5 50259922 49919884 50341957 50124252 49806755 49777912 50146603 50530037 50642769 51136623 50699242
3732.1 50699242 49814716 50566589 50644566 49565414 49695183 49866623 49909451 50288845 50605530 50206848
3741.8 50206848 50272030 51152702 49561054 48735920 50205627 50720108 50943596 49870041 49059307
3750.4 49059307 50495872 50161201 49305141 49780582 50222149 50483952 50013733 50218536 50846638 50130714
$$ packed form
3683.9D9682484K0572K08886L63681N13867j114010m01306R16202p11643k37534L21343
3693.5D9562542K01199J88301j17916j4634K00489L00553J91303M955p06970j07311
3703.2D9702511N86502o382r3636q7879K22798L39710r44199K99645M56607j118339
3712.8D9357338L72986N03223j2852j1371K48337R9743o04332j43662O48560j98048
3722.5E0259922l40038M22073k17705l17497k8843L68691L83434J12732M93854m37381
3732.1E0699242q84526P51873P7977j079152J29769J71440M2828L79394L16685l98682
3741.8E0206848O5182Q80672j591648q25134J469707N14481K23488j073555q10734
3750.4D9059307J436565l34671q56060M75441M41567K61803m70219K04803O28102p15924
$$ plain form
3760.1 50130714 49760738 50028286 49995186 50036491 50428284 50294857 49936157 50369862 51063400 51158218
3769.7 51158218 50090923 49968826 50198208 50149925 50162720 50253658 50380718 50270985 50310253 50185524
3779.4 50185524 49663219 50111965 50361328 50365231 50459114 50194515 50149357 50144188 50149452 50214172 50304951
3790 50304951 50421822 50394142 50408333 50252350 50402527 50908123 50453342 49964691 50269432 50591301
3799.6 50591301 51043533 50682301 49554680 49876514 50226051 50742645 51447132 50399971 49647030
3808.3 49647030 49946312 50100666 50138645 50254982 50333332 50450092 51140408 50989403 49297337 49746353
3817.9 49746353 50455399 51131500 51555180 49522964 49140209 49639820 49876129 50230186 50413162 50048473
3827.6 50048473 50071899 50238613 50619587 50773304 49761101 49977489 50683292 50073605 50032829 50832237
$$ packed form
3760.1E0130714l69976K67548l3100M1305L91793j33427l58700M33705O93538R4818
3769.7E1158218j067295j22097K29382m8283J2795R0938J27060j09733L9268j24729
3779.4E0185524n22305M48746K49363L903R3883k64599m5158n169N264O4720R0779
3790E0304951J16871k7680J4191j55983J50177N05596m54781m88651L04741L21869
3799.6E0591301M52232l61232j127621L21834L49537N16594P04487j047161p52941
3808.3D9647030K99282J54354L7979J16337P8350J16760O90316j51005j692066M49016
3817.9D9746353P09046O76101M23680k032216l82755M99611K36309L54057J82976l64689
3827.6E0048473K3426J66714L80974J53717j012203K16388P05803o09687m0776P99408
$$ plain form
3837.2 50832237 49885445 49561455 50292297 49732132 49829845 50551338 50303642 49825581 50076397 50269855
3846.9 50269855 50222359 50335239 50318295 50631912 51276562 50807411 50467381 48586536 48770233 49807110
3856.5 49807110 49792538 49672043 49974449 50319386 50653576 50088863 49995472 50758778 50234367 49526661
3866.2 49526661 49873627 50316734 50921879 50285210 49080597 49434689 50205219 50559872 49658569 49795242
3875.8 49795242 50193310 50050083 50197399 50769154 50418404 49713196 50151314 50106956 50341240 51020435
3885.4 51020435 49659943 49616829 50027626 50159164 50637455 50427803 49530926 49739147 50089157 49871555
3895.1 49871555 49973175 50217171 50506058 50545574 49419132 49831482 49940086 49423729 49864391 49646412
3904.7 49646412 49781673 49838085 49817108 50097092 50151245 50125195 50059151 50114967 50018677 49926056 50210819
$$ packed form
3837.2E0832237r46792l23990P30842n60165R7713P21493k47696m78061K50816J93458
3846.9E0269855m7496J12880j6944L13617O44650m69151l40030j880845J83697J036877
3856.5D9807110j4572j20495L02406L44937L34190n64713r3391P63306n24411p07706
3866.2D9526661L46966M43107O05145o36669j204613L54092P70530L54653r01303J36673
3875.8D9795242L98068j43227J47316N71755l50750p05208M38118m4358K34284O79195
3885.4E1020435j360492m3114M10797J31538M78291k09652q96877K08221L50010k17602
3895.1D9871555J01620K43996K88887L9516j126442M12350J08604n16357M40662k17979
3904.7D9646412J35261N6412k0977K79984N4153k6050o6044N5816r6290r2621K84763
$$ plain form
3915.3 50210819 50424042 49915924 49511208 50136925 50400677 50044140 50189125 50310501 50340256 50104111
3925 50104111 49672913 49582066 49702194 49910652 49880684 49865276 49979279 49685314 49575264 49777355 49838642
3935.6 49838642 49939232 50053032 50106827 50069847 49952175 50030018 50015953 49635605 49539478 49650509 49895676
3946.2 49895676 50140324 49897858 49929707 50071892 49825310 49860863 49759933 49706455 49897152 49975056
3955.8 49975056 49935200 49762291 49839958 49877110 49911575 49978806 49858299 50036667 50083996 49825645 49633125
3966.5 49633125 49572216 49566277 49576485 49792179 50014618 49931229 49761959 49889458 49908573 49721363 49698055
3977.1 49698055 49786999 49794106 49675552 49736595 49723824 49701435 49831490 49830353 49958836 50026569 49955036
3987.7 49955036 49849773 49653717 49551182 49521332 49352032 49195553 49431629 49621212 49568619 49625671
$$ packed form
3915.3E0210819K13223n08118m04716O25717K63752l56537J44985J21376K9755k36145
3925E0104111m31198r0847J20128K08458k9968j5408J14003k93965j10050K02091O1287
3935.6D9838642J00590J13800N3795l6980j17672P7843j4065l80348r6127J11031K45167
3946.2D9895676K44648k42466L1849J42185k46582L5553j00930n3478J90697P7904
3955.8D9975056l9856j72909P7667L7152L4465O7231j20507J78368M7329k58351j92520
3966.5D9633125o0909n939J0208K15694K22439q3389j69270J27499J9115j87210k3308
3977.1D9698055Q8944P107j18554O1043j2771k2389J30055j137J28483O7733p1533
3987.7D9955036j05263j96056j02535k9850j69300j56479K36076J89583n2593N7052
$$ plain form
3997.3 49625671 49808689 49920994 49797375
4000.2 49797375
$$ packed form
3997.3D9625671J83018J12305j23619
4000.2D9797375
##END=$$ End of the data block
