##TITLE=Igor e Carol - Epoxido $$ Begin of the data block
##JCAMP-DX=5.00 $$ ACD/SpecManager v 10.08
##SPECTROMETER/DATA SYSTEM=Alpha
##DATE=28 Apr 2015 09:23:26
##DATA TYPE=INFRARED SPECTRUM
##DATA CLASS=XYDATA
##ORIGIN=
##OWNER=
##NPOINTS=1765
##FIRSTX=399.76428223
##LASTX=3997.64306641
##MAXX=3997.64306641
##MINX=399.76428223
##MAXY=1.00519562
##MINY=0.35582089
##XFACTOR=1.0000000000
##YFACTOR=0.000000010000000
##FIRSTY=1.00000000
##DELTAX=2.03961372
##XUNITS=1/CM
##YUNITS=ARBITRARY UNITS
##XYDATA=(X++(Y..Y))
399.8A00000000k846092l703612l400683r746L751600L681135J602149N30887L94362
$$ 100000000 97153908 93450296 90049613 90039867 93791467 97472602 99074751 99605638 100000000
418.1A00000000N19562k90454j302212j869708j639003o21152Q83830J917630J820648
$$ 100000000 100519562 100229108 98926896 97057188 95418185 94797033 95680863 97598493 99419141
436.5I9419141P98714r4998j45894J25235j02198l36999j92755O5750j56772m98015
$$ 99419141 100217855 100122857 99976963 100102198 100000000 99663001 99470246 99535996 99379224 98881209
456.9I8881209l20351o6889l55482o37757m16285j49894k47580k16847K09957L47185
$$ 98881209 98560858 98493969 98138487 97500730 97084445 96934551 96686971 96470124 96680081 97027266
477.3I7027266l0065k84653j15312p4851l82859m74280j82533q1670l68280m85217
$$ 97027266 96997201 96712548 96597236 96522385 96139526 95665246 95482713 95401043 95032763 94547546
497.7I4547546k88546k88618n58519o11377m57483n44507r16975j148040j259988j758069
$$ 94547546 94259000 93970382 93411863 92800486 92343003 91798496 90881521 89733481 88473493 86715424
518.1H6715424k728331l905249n602657p479948n325067L350895J1790806J2072581
$$ 86715424 83987093 80081844 74479187 66999239 61674172 65025067 76815873 88888454
534.4H8888454O699872K300692L78239m68850j131684j736623k557849m067940m855746
$$ 88888454 95588326 97889018 98267257 97798407 96666723 94930100 92372251 88304311 83448565
552.7H3448565j212496N388684P421547M025250R07767o4379k97820m80372m83829
$$ 83448565 82236069 87624753 95046300 99071550 99979317 99914938 99617118 99136746 98652917
571.1I8652917l26377l17115m43011m41629k72596k19142l22372l30680k03139j99300
$$ 98652917 98326540 98009425 97566414 97124785 96852189 96633047 96310675 95979995 95776856 95577556
591.5I5577556l28773l27146k04939j94740l30067l58760k70278k88325m80670o03294
$$ 95577556 95248783 94921637 94716698 94521958 94191891 93833131 93562853 93274528 92793858 92190564
611.9I2190564o27077n27322j32543R3919o3545k79754m49538m87423l65693m16624
$$ 92190564 91563487 91036165 90903622 90997541 90933996 90654242 90204704 89717281 89351588 88934964
632.3H8934964p34711q04096l84724k02889n76055q51148q71247j028955j435262j734060
$$ 88934964 88200253 87396157 87011433 86808544 86232489 85381341 84510094 83481139 82045877 80311817
652.7H0311817j849842k202553l146720m626047o636542o637413J672477J4905924
$$ 80311817 78461975 76259422 73112702 68486655 61850113 55212700 56885177 71791101
669G1791101Q288705k636796o049925l093321J756382J602662l196865p691300r280813
$$ 71791101 80079806 77443010 71393085 68299764 70056146 71658808 68461943 60770643 51489830
687.3E1489830o154612J757691R591800J2203806R820885O202537L776210K557862
$$ 51489830 45335218 47092909 56684709 68888515 78709400 84911937 88688147 91246009
703.7I1246009J682025P70229J10895l14159j031750j491427j16683J780171J471609
$$ 91246009 92928034 93698263 93809158 93494999 92463249 90971822 90855139 92635310 94106919
722I4106919j26362q03441n67997m44358p68185j084608j228946j595217k331752l247863
$$ 94106919 93980557 93177116 92609119 92164761 91396576 90311968 89083022 87487805 85156053 81908190
742.4H1908190m465776o274224p558852n395049J003396O989098Q089286N776918L476763
$$ 81908190 77442414 71168190 63609338 58214289 59217685 66206783 74296069 80072987 83549750
760.8H3549750K015567Q55839l3748n03940q63051j415122j977008k488703l357953
$$ 83549750 85565317 86421156 86387408 85883468 85020417 83605295 81628287 79139584 75781631
779.1G5781631m866182o685984o999988k056140P626111J3004887Q894181J260167
$$ 75781631 70915449 64229465 57229477 55173337 62799448 75804335 84698516 85958683
795.4H5958683m014354o694365p592881o041378j613700K927268L924554J689250r88520
$$ 85958683 81944329 75249964 67657083 61615705 60002005 62929273 66853827 68543077 67554557
813.8F7554557k299177j017261K678633N649626N301279K771121K74688j279622j727295
$$ 67554557 65255380 64238119 66916752 72566378 77867657 80638778 80913466 79633844 77906549
832.2G7906549j319033o10232M37098K279860L855592L146154J67394k465767j515913
$$ 77906549 76587516 75977284 76414382 78694242 82549834 85695988 85863382 83397615 81881702
850.5H1881702K150351L245646J113009L4893L79788k00647j610285k666229l287732
$$ 81881702 84032053 87277699 88390708 88425601 88805389 88604742 86994457 84328228 81040496
868.9H1040496l730661l662860k993983k784938l805643m989511m575634j785451K630698
$$ 81040496 77309835 73646975 70652992 67868054 64062411 59072900 54497266 52711815 55342513
887.2E5342513O849701R143161R032888P331705N167883L350830K121860J215220M47601
$$ 55342513 62192214 71335375 80368263 87699968 92867851 96218681 98340541 99555761 100003362
905.6A00003362l362j03718k61760n60963p22140o46359n91439o36869n95969n38248
$$ 100003362 100000000 99896282 99634522 99073559 98351419 97705060 97113621 96476752 95880783 95342535
926I5342535r29398k077096l534907l357882j13493L317648L560776J905757N91242
$$ 95342535 94413137 92336041 88801134 85443252 85329759 88647407 92208183 94113940 94705182
944.3I4705182j84929o09326o98948m62622N3418M53693L58957m6337m40747o41161
$$ 94705182 94520253 93910927 93211979 92749357 92802775 93256468 93615425 93569088 93128341 92487180
964.7I2487180o79892q10748r05675o25062k80851m40651r52280j372135j626479j799953
$$ 92487180 91807288 90996540 90090865 89465803 89184952 88744301 87792021 86419886 84793407 82993454
985.1H2993454j656729j260555j442832k201336k664221k913964k723223j530516j389914
$$ 82993454 81336725 80076170 78633338 76432002 73767781 70853817 68130594 66600078 65210164
1003.5F5210164j818300J807922P533366Q996707N957532J373166j466435N64134L818929
$$ 65210164 63391864 65199786 72733152 81729859 87687391 89060557 87594122 88158256 91977185
1021.8I1977185L132015O02472q76242j266276p01631p2771k98560q15802q94320o92422
$$ 91977185 95109200 95711672 94835430 93569154 92867523 92794752 92496192 91680390 90786070 90093648
1042.2I0093648m66030j64831K19792M08340K26926j33603m57156q17186j395422k244973
$$ 90093648 89627618 89462787 89682579 90090919 90317845 90184242 89727086 88909900 87514478 85269505
1062.6H5269505l404904m474300l646344N59753N318857O228131L826129J553059N51629
$$ 85269505 81864601 77390301 73743957 74303710 79622567 85850698 89676827 91229886 91781515
1081I1781515J50478j20443k90346k98828k36589k87640m50403n71578o15120o39534
$$ 91781515 91931993 91811550 91521204 91222376 90985787 90698147 90247744 89676166 89061046 88421512
1101.4H8421512p47055j130712j896048k659964k166897L62163K645046J874852p52175
$$ 88421512 87674457 86543745 84647697 81987733 79820836 80182999 82828045 84702897 83950722
1119.8H3950722j486957Q69334K902996K210838P19500N9241r2894j21838j03045j05124
$$ 83950722 82463765 83333099 86236095 88446933 89166433 89225674 89132780 89010942 88907897 88802773
1140.1H8802773j92118l20762l98934m35811n32401o96564q54605j038319j397121
$$ 88802773 88610655 88289893 87890959 87455148 86922747 86226183 85371578 84333259 82936138
1158.5H2936138j808524j567298o30677m10289j469016k793604l411996k174652J159012
$$ 82936138 81127614 79560316 78929639 78519350 77050334 74256730 70844734 68670082 69829094
1176.9F9829094M117620M394859K450669l2663j512736j152438L31640J303035J154244
$$ 69829094 73946714 78341573 80792242 80759579 79246843 78094405 78426045 79729080 80883324
1195.2H0883324N51248K5928m02278p96139j204592j762641k341586k187711j234281
$$ 80883324 81434572 81460500 81058222 80262083 79057491 77294850 74953264 72765553 71531272
1213.6G1531272q60864j515275k228397k674079l128594l624201l990758m056287l623351
$$ 71531272 70670408 69155133 66926736 64252657 61124063 57499862 53509104 49452817 45829466
1231.9D5829466k508071o40121J859516M264682N569539N872547O098032O332362N994660
$$ 45829466 43321395 42681274 44540790 48805472 54375011 60247558 66345590 72677952 78672612
1250.3G8672612N015260L852528K871084K112597J449043Q58015M26030J34701r0474
$$ 78672612 83687872 87540400 90411484 92524081 93973124 94831139 95257169 95391870 95301396
1268.6I5301396k78986m33564n62727o36453o38556o15669o07574n68592m06045j18399
$$ 95301396 95022410 94588846 94026119 93389666 92751110 92135441 91527867 90959275 90553230 90434831
1289I0434831J44869K94805L85076L22765n7721o86372j400202k150095k610814j931393
$$ 90434831 90579700 90874505 91259581 91582346 91524625 90838253 89438051 87287956 84677142 82745749
1309.4H2745749L24702K662528K762293J034403j45840J3798M24945K91658j68592
$$ 82745749 83070451 85732979 88495272 89529675 89383835 89397633 89822578 90114236 89945644
1327.8H9945644n57434q20858j107639j509177k082527k763087l105008k756143j467669
$$ 89945644 89388210 88567352 87459713 85950536 83868009 81104922 77999914 75243771 73776102
1346.2G3776102O41787K354562K625686J759124O27923j36256l70091m16696p01684
$$ 73776102 74417889 76772451 79398137 81157261 81785184 81648928 81278837 80862141 80160457
1364.5H0160457j192385j490945j165956o36148o89948j056182q56662k50459j95157
$$ 80160457 78968072 77477127 76311171 75675023 74985075 73928893 73072231 72821772 72626615
1382.9G2626615j175380k950698m343212m127753k400374J158088N004317O581282
$$ 72626615 71451235 68500537 64157325 60029572 57629198 58787286 63791603 70372885
1399.2G0372885N299718K980321J466042O02883J24407k23923o04540j030493j665139
$$ 70372885 75672603 78652924 80118966 80721849 80846256 80622333 80017793 78987300 77322161
1417.5G7322161k286452j890719j077264l18069M87280J283562J849705J910514J813525
$$ 77322161 75035709 73144990 72067726 71749657 72236937 73520499 75370204 77280718 79094243
1435.9G9094243J136237k89154j665264l072447n429244p875937l929216N422116J0802883
$$ 79094243 80230480 79941326 78276062 75203615 69774371 61898434 57969218 63391334 74194217
1454.3G4194217J0520166O318158J767796L05379j7977j10710j13606j39046j47140
$$ 74194217 84714383 91032541 92800337 93105716 93087739 92977029 92863423 92724377 92577237
1472.6I2577237o0874j2017q0317j97846k85732k93303l83395r38523j800292j223630
$$ 92577237 92516363 92504346 92424029 92226183 91940451 91647148 91263753 90325230 88524938 87301308
1493H7301308P19064J995099R00698m33421p96491j306701k436280k339423k256787
$$ 87301308 88020372 90015471 90916169 90482748 89686257 88379556 85943276 83603853 81347066
1511.4H1347066l085977k629023J145142N521756O462062L517067R40967J89924q7154
$$ 81347066 78261089 75632066 76777208 82298964 88761026 92278093 93219060 93408984 93321830
1529.7I3321830l35538n67562n10037m91923q88806j016647o46830m45455l37052k59042
$$ 93321830 92986292 92418730 91908693 91416770 90527964 89511317 88864487 88419032 88081980 87822938
1550.1H7822938q6302Q1212J00159n0521j56378j51456l20983n08451p81775j257819
$$ 87822938 87736636 87817848 87918007 87867486 87711108 87559652 87238669 86730218 85948443 84690624
1570.5H4690624j402169j883322l816980m940397k209371L556305O070090K171397
$$ 84690624 83288455 81405133 77588153 72647756 70438385 73994690 80064780 82236177
1586.8H2236177k013755m031205n830920o310815j564133O417018R606743O142044
$$ 82236177 80222422 76191217 70360297 64049482 62485349 68902367 78509110 84651154
1603.2H4651154J640988o90055j772094j993221j032466P85131J992231J126486Q6224
$$ 84651154 86292142 85602087 83829993 81836772 80804306 81589437 83581668 84708154 84794378
1621.5H4794378l44258m31413m56100n19735n17237n99277j019669j043749m46129
$$ 84794378 84450120 84018707 83562607 83042872 82525635 81926358 80906689 79862940 79416811
1639.9G9416811Q7363J23626m95863j016939p85166j081913k023662j594328j447636
$$ 79416811 79504174 79627800 79131937 78114998 77329832 76247919 74224257 72629929 71182293
1658.2G1182293j873219k522230k694798k314854k716207l512120l467411m642016
$$ 71182293 69309074 66786844 64092046 61777192 59060985 55548865 52081454 47439438
1674.5D7439438o284284m652697r20368N033938J2134572J0528398O998271O165480
$$ 47439438 41155154 36502457 35582089 40616027 52750599 63278997 70277268 76442748
1690.9G6442748M792542L893858L289240K798432L095669K169710J248301R65052O49423
$$ 76442748 81235290 85129148 88418388 91216820 94312489 96482199 97730500 98695552 99344975
1709.2I9344975M30786K24239K1315j57953k06780j69599j66196n9181M6748P3820
$$ 99344975 99775761 100000000 100021315 99863362 99656582 99486983 99320787 99261606 99308354 99382174
1729.6I9382174M8548R9629J77062J10006j1009p5424p7402j16432j52558j61147j02198
$$ 99382174 99430722 99530351 99707413 99817419 99806410 99730986 99653584 99537152 99384594 99223447 99121249
1752I9121249j08058j95473k33096j78772j42187r4175n4735o0326q6957j69474j75870
$$ 99121249 99013191 98817718 98584622 98405850 98263663 98169488 98114753 98054427 97967470 97797996 97622126
1774.5I7622126j63763k15376k22337q9127L4708K4754m5973r0254m3422J9318J8853
$$ 97622126 97458363 97242987 97020650 96931523 96966231 96990985 96945012 96854758 96811336 96830654 96849507
1796.9I6849507l433M721j2064r1494j87844k59524l08675l33476l42339l27182j72764
$$ 96849507 96846074 96850795 96838731 96747237 96559393 96299869 95991194 95657718 95315379 94988197 94815433
1819.4I4815433J14971L83634M62693L09866J10621L6031M5192K8491K402M47J2767
$$ 94815433 94930404 95314038 95776731 96086597 96197218 96233249 96278441 96306932 96309334 96309781 96322548
1841.8I6322548J306m208J1557M9406Q0151N6570J4431N513P743l1346q6820j18000
$$ 96322548 96323854 96319646 96331203 96380609 96460760 96517330 96531761 96537274 96545017 96513671 96426851 96308851
1866.3I6308851j13082q3404o3622o7914p7087r5534j07026p8321m7344o2429j01036
$$ 96308851 96195769 96112365 96048743 95980829 95903742 95808208 95701182 95622861 95575517 95513088 95412052
1888.7I5412052p8690l4255o0398j07318j07616j00851j37579j96958k37691k91562
$$ 95412052 95333362 95299107 95238709 95131391 95023775 94922924 94785345 94588387 94350696 94059134
1909.1I4059134m22353n59151n33599l55172k79403l98755l13628K61879Q47930R63503
$$ 94059134 93636781 93077630 92544031 92188859 91909456 91510701 91197073 91458952 92306882 93270385
1929.5I3270385P33078M53132K16675M9031r30M5723J15960J53202J58656J40667P2813
$$ 93270385 94003463 94456595 94673270 94722301 94721371 94767094 94883054 95036256 95194912 95335579 95408392
1951.9I5408392j7625n7280n4944q9103j58202k01023k27088k84171l37332k66493
$$ 95408392 95390767 95333487 95278543 95189440 95031238 94830215 94603127 94318956 93981624 93715131
1972.3I3715131o2000P7289M1532l105O5750J26552Q7893O9201J40745J77508R7096
$$ 93715131 93653131 93730420 93771952 93768847 93834597 93961149 94049042 94118243 94258988 94436496 94533592
1994.8I4533592l63j0085L9875P4619R6399J17755J05989N8561L0584L6913K6303k1565
$$ 94533592 94533229 94523144 94563019 94637638 94734037 94851792 94957781 95016342 95046926 95083839 95110142 95088577
2019.2I5088577n8776o0058m6122k1112q88Q142J3078j2j0801P10p99l3420n4276l4380
$$ 95088577 95029801 94969743 94923621 94902509 94901621 94909763 94922841 94922829 94912028 94912738 94911939 94878519 94824243 94789863
2047.8I4789863k623M774M065K1047K6631r465l8952j3750K3132J8162j1158j4121
$$ 94789863 94787240 94792014 94796079 94817126 94843757 94834292 94795340 94781590 94804722 94822884 94811726 94797605
2072.3I4797605L672K181q326P152K7967J7792l076j07J3143j067k8736k7686p319
$$ 94797605 94801277 94803458 94795132 94802284 94830251 94848043 94844967 94844860 94858003 94856936 94828200 94800514 94793195
2098.8I4793195j3090m0221n0449m4173n1385p0632o7305m5926m6277o7067o6274m8995
$$ 94793195 94780105 94739884 94689435 94645262 94593877 94523245 94455940 94410014 94363737 94296670 94230396 94181401
2123.3I4181401n6756q8018j11181j22815j13613l4052J11395K20883K13731J33979
$$ 94181401 94124645 94036627 93925446 93802631 93689018 93654966 93766361 93987244 94200975 94334954
2143.7I4334954P5191N7477L2824q231k8431k5344j9551r155Q112J5229l0k2739j7231
$$ 94334954 94410145 94467622 94500446 94492215 94463784 94438440 94418889 94409734 94417846 94433075 94433045 94410306 94393075
2170.2I4393075P444N025k4283l8427k2835p224j5664k6894j8197j5843l2365l8856
$$ 94393075 94400519 94405544 94381261 94342834 94319999 94312775 94297111 94270217 94252020 94236177 94203812 94164956
2194.6I4164956k1649k718L690J0240J9568K1267J5628J6207K8759L8105K6125M17
$$ 94164956 94143307 94140589 94144279 94154519 94174087 94195354 94210982 94227189 94255948 94294053 94320178 94320595
2219.1I4320595k4366n8109j02788j24729q8691r513M9591O2334O7777P8112O6423
$$ 94320595 94296229 94238120 94135332 94010603 93921912 93912399 93961990 94024324 94092101 94170213 94236636
2241.6I4236636L5298J2898M286l195p802o145p993j6964j7827l16J4883P152q046
$$ 94236636 94271934 94284832 94289118 94285923 94278121 94271976 94263983 94247019 94229192 94228876 94243759 94250911 94242865
2268.1I4242865r078j031l82q702j4680j6606k7657m9949o5016o5667o5863n9497k8193
$$ 94242865 94233787 94232756 94232374 94223672 94208992 94192386 94164729 94114780 94049764 93984097 93918234 93858737 93830544
2294.6I3830544J0544L2222L8242L6568K8002J4770j341j6063j6487q673j4805m6480
$$ 93830544 93841088 93873310 93911552 93948120 93976122 93990892 93989551 93973488 93957001 93948328 93933523 93887043
2319.1I3887043r7793j42509j40506q5557J312Q5854J00082L3218k9033k1232J0992
$$ 93887043 93789250 93646741 93506235 93420678 93421990 93507844 93607926 93641144 93612111 93590879 93601871
2341.5I3601871K479P39N1224Q1903O5154L3993J5419O879o509j7667q315N192J4013
$$ 93601871 93604350 93605089 93656313 93738216 93803370 93837363 93852782 93859661 93853152 93835485 93827170 93832362 93846375
2368I3846375K8288L8797L7938K7555J7643J4514J0616m423k6190m1437n3478o2841
$$ 93846375 93874663 93913460 93951398 93978953 93996596 94011110 94021726 94017303 93991113 93949676 93896198 93833357
2392.5I3833357n9444m1300j6999J788J4347K3091J9103J061k1040m4573o4015o2126
$$ 93833357 93773913 93732613 93715614 93717402 93731749 93754840 93773943 93775004 93753964 93709391 93645376 93583250
2417I3583250k6715K6393O7312P8034O5476N4604N5658N5892M4924L2836K7549J9407
$$ 93583250 93556535 93582928 93650240 93728274 93793750 93848354 93904012 93959904 94004828 94037664 94065213 94084620
2441.4I4084620J848j3262k1934l9059o7842r1952j00637j03736j03205p8541j8102
$$ 94084620 94086468 94073206 94051272 94012213 93944371 93852419 93751782 93648046 93544841 93466300 93448198
2463.9I3448198N2082J00398J25349J33526J20610Q5605M3821J5908O414K146L916
$$ 93448198 93500280 93600678 93726027 93859553 93980163 94065768 94109589 94125497 94131911 94134057 94137973
2486.3I4137973J9538L3277K8545J3935J0461K0945K7621K4658J9998J3304R83j1563
$$ 94137973 94157511 94190788 94219333 94233268 94243729 94264674 94292295 94316953 94336951 94350255 94351238 94339675
2510.8I4339675j9557l3539n3334n2637k2781R847K0694J2666M345N085Q350P314N770
$$ 94339675 94320118 94286579 94233245 94180608 94157827 94167674 94188368 94201034 94205379 94210464 94218814 94226128 94231898
2537.3I4231898L737j657o962r906j1713j7398k1982j7280j2266j6553k3681k3424
$$ 94231898 94235635 94233978 94227016 94217110 94205397 94187999 94166017 94148737 94136471 94119918 94096237 94072813
2561.8I4072813k0647k6125l8171n3048o8837p0316n2977m2521n1618n5122l4494n328
$$ 94072813 94052166 94026041 93987870 93934822 93865985 93795669 93742692 93700171 93648553 93593431 93558937 93553609
2586.2I3553609J4794L3646O2073Q4483Q1623O0820L8314J7518n323k9647l4606m435
$$ 93553609 93568403 93602049 93664122 93748605 93830228 93891048 93929362 93946880 93941557 93911910 93877304 93872869
2610.7I3872869L0148L8827L3015L1775L0893K0808R554O122J7595M7845P3457P0756
$$ 93872869 93903017 93941844 93974859 94006634 94037527 94058335 94067889 94074011 94091606 94139451 94212908 94283664
2635.2I4283664M8334K1720N197K742J91j0056k0528k5284k2751j1849M53O938N394
$$ 94283664 94331998 94353718 94358915 94361657 94361848 94351792 94331264 94305980 94283229 94271380 94271833 94278771 94284165
2661.7I4284165j419k718J359L302L285k128q768r888p928j377P719J2279J0472O527
$$ 94284165 94282746 94280028 94281387 94284689 94287974 94285846 94277078 94267190 94259262 94257885 94265604 94277883 94288355 94294882
2690.3I4294882m41j2666k3616k6398k7055l1942l6091l9834m6908n9694p8220r6404
$$ 94294882 94294441 94281775 94258159 94231761 94204706 94172764 94136673 94096839 94049931 93990237 93912017 93815613
2714.7I3815613j18613j54597j92904k06054j71697q0943N7513J95610K56556K24018
$$ 93815613 93697000 93542403 93349499 93143445 92971748 92890805 92948318 93143928 93400484 93624502
2735.1I3624502J52386R2703O4587N2214L2890Q595j6540l8743m0079j9717m893m799
$$ 93624502 93776888 93869591 93934178 93986392 94019282 94027877 94011337 93972594 93932515 93912798 93907905 93903106
2759.6I3903106l796j938j0877k3556j9473K950K2489K2865P391r126k1291l3217l9238
$$ 93903106 93899310 93897372 93886495 93862939 93843466 93846416 93868905 93891770 93899161 93890035 93868744 93835527 93796289
2786.1I3796289l1978k1619k3716l7444n1319o7902q9550r5302p6801o4522p9143r7495
$$ 93796289 93764311 93742692 93718976 93681532 93630213 93562311 93472761 93377459 93300658 93236136 93156993 93059498
2810.6I3059498r9182j00958j20986j50460j74653j86587j83427j52391p7862J0854
$$ 93059498 92960316 92859358 92738372 92587912 92413259 92226672 92043245 91890854 91812992 91823846
2831I1823846N0134J9842m1264j12701j95199k64716l11887l50982l91096m19551l98142
$$ 91823846 91873980 91893822 91852558 91739857 91544658 91279942 90968055 90617073 90225977 89806426 89408284
2853.4H9408284l04359j62244j8239J04225J89811K19125K07197J93960J84869J39761
$$ 89408284 89103925 88941681 88923442 89027667 89217478 89436603 89643800 89837760 90022629 90162390
2873.8I0162390O9136K9468P195k9570o2722q6028j10524j36668j69265j96976k02536
$$ 90162390 90231526 90260994 90268189 90238619 90175897 90089869 89979345 89842677 89673412 89476436 89273900
2896.3H9273900k11150k50011l08246l81344m68093n27758n14084m18597k40773L5810
$$ 89273900 89062750 88812739 88504493 88123149 87655056 87127298 86613214 86194617 85953844 85989654
2916.6H5989654L69406O47068P87651P80994O81770N41264L63308J88434O4474m226
$$ 85989654 86359060 87006128 87793779 88574773 89256543 89797807 90161115 90349549 90414023 90409797
2937I0409797j1104J9097K5112j4401o0784o1715j5503K8276M7475O6632R1952R7692
$$ 90409797 90398693 90417790 90442902 90428501 90367717 90306002 90290499 90318775 90366250 90432882 90524834 90622526
2961.5I0622526O7556J6123k7829m6450m3040m6385p4225r7901j09673j34682j57500
$$ 90622526 90690082 90706205 90678376 90631926 90588886 90542501 90468276 90370375 90260702 90126020 89968520
2984H9968520j64175j75094j98418k45154l16095l87049m81141o11007p06136o52075
$$ 89968520 89804345 89629251 89430833 89185679 88869584 88482535 88001394 87390387 86684251 86032176
3004.4H6032176l03280L10325Q30758R17774O19710K61420J08570J45691J41478m0674
$$ 86032176 85728896 86039221 86869979 87787753 88407463 88668883 88777453 88923144 89064622 89023948
3024.7H9023948l14498m88007l47978J56390N90492M54873n8008l22044l4970M38828
$$ 89023948 88709450 88221443 87873465 88029855 88620347 89075220 89017212 88695168 88660198 89099026
3045.1H9099026N30195K01249k08467m97574o24031n80859m23610j98174L22950J265848
$$ 89099026 89629221 89830470 89622003 89124429 88500398 87919539 87495929 87297755 87620705 88886553
3065.5H8886553J911837J604688Q38375K89118N5421J5253j282j40410l88802n77855
$$ 88886553 90798390 92403078 93241453 93530571 93585992 93601245 93599963 93459553 93070751 92492896
3085.9I2492896m06474K08474P29221O90353L83657K24215J90317J35666O2645M8739
$$ 92492896 92086422 92294896 93024117 93714470 94098127 94322342 94512659 94648325 94710970 94759709
3106.3I4759709J15037J82229J93238J60766R6863K4426l9828q5574r9754j05727j14399
$$ 94759709 94874746 95056975 95250213 95410979 95507842 95532268 95492440 95406866 95307112 95201385 95086986
3128.8I5086986q5157J2225J34742J94889J59580P7182J9848L338J234O550R358j2994
$$ 95086986 95001829 95014054 95148796 95343685 95503265 95580447 95600295 95603633 95604867 95611417 95620775 95607781
3153.2I5607781m1949m0168j8668k879n138l2747o1476p0471p0804p0250o8200n3012
$$ 95607781 95565832 95525664 95506996 95504117 95498979 95466232 95404756 95334285 95263481 95193231 95125031 95072019
3177.7I5072019j7398J823k3239o2895q3465p5566l1722K7078M8447K1553j4859l5102
$$ 95072019 95054621 95056444 95033205 94970310 94886845 94811279 94779557 94806635 94855082 94876635 94861776 94826674
3202.2I4826674m2879m9555n8371o1196n9957o0171o0749o1726n7239m4959l3009k7114
$$ 94826674 94783795 94734240 94675869 94614673 94554716 94494545 94433796 94372070 94314831 94269872 94236863 94209749
3226.7I4209749k5708k0897k1434m9812q0085p7468o2138m9442l8916m6408p0381q5032
$$ 94209749 94184041 94163144 94141710 94091898 94011813 93934345 93872207 93822765 93783849 93737441 93667060 93582028
3251.1I3582028q3291q2904r2757q5831l9148J5837L5864K6953J0580k2870o1340p0089
$$ 93582028 93498737 93415833 93323076 93237245 93198097 93213934 93249798 93276751 93287331 93264461 93203121 93133032
3275.6I3133032n2070k4748q935k0796l8773l6758k5690l3140n5444o9320p6944p8118
$$ 93133032 93080962 93056214 93047279 93026483 92987710 92950952 92925262 92892122 92836678 92767358 92690414 92612296
3300.1I2612296o0749m3487n9742j03772j33621j35011j32811j45954j67370j82223
$$ 92612296 92551547 92508060 92448318 92344546 92210925 92075914 91943103 91797149 91629779 91447556
3320.5I1447556j93048k18009k76924l58742m37594n01322n11682m05383j75161P9024
$$ 91447556 91254508 91036499 90759575 90400833 89963239 89461917 88950235 88544852 88369691 88448715
3340.9H8448715K34962K60102K09320J40530P7802K8235j4836n5522r2530j20777j41442
$$ 88448715 88683677 88943779 89153099 89293629 89371431 89399666 89384830 89329308 89236778 89116001 88974559
3363.3H8974559j67781j87683j90794j93167j92523j81466j74779j74374j73324j68019
$$ 88974559 88806778 88619095 88428301 88235134 88042611 87861145 87686366 87511992 87338668 87170649
3383.7H7170649j49596j17934r1028j01298j35392j28943p7283o2335j22613j69771
$$ 87170649 87021053 86903119 86812091 86710793 86575401 86446458 86369175 86306840 86184227 86014456
3404.1H6014456j33348p6401o0439o8784r0009j01298p9423n8878n2452l5930m124
$$ 86014456 85881108 85804707 85744268 85675484 85585475 85484177 85404754 85345876 85293424 85257494 85253370
3426.5H5253370J9210Q357M917L0965J4776l9542m1812R161M6867M7016M2993N7328
$$ 85253370 85272580 85280937 85285854 85316819 85331595 85292053 85250241 85259402 85306269 85353285 85396278 85453606
3451H5453606O8366P1699Q8864J06466Q9359Q2392J25777J45007Q5544J8472K6965
$$ 85453606 85521972 85593671 85682535 85789001 85878360 85960752 86086529 86231536 86317080 86335552 86362517
3473.4H6362517Q0216J21581J15812O6644N9521R7353J00743R2191J09684J23525J22190
$$ 86362517 86442733 86564314 86680126 86746770 86806291 86903644 87004387 87096578 87206262 87329787 87451977
3495.9H7451977J08408J02181J09160R5790P8935Q5938J14083J53303J52618J17355
$$ 87451977 87560385 87662566 87771726 87867516 87946451 88032389 88146472 88299775 88452393 88569748
3516.3H8569748J11401J34624J48355J26184R1743R3615J25635J53321J60205J39213
$$ 88569748 88681149 88815773 88964128 89090312 89182055 89275670 89401305 89554626 89714831 89854044
3536.7H9854044J21087J45810J72407J43468R3454J01537J30939J31339J31953J40935
$$ 89854044 89975131 90120941 90293348 90436816 90530270 90631807 90762746 90894085 91026038 91166973
3557.1I1166973J46604J39290J09345P4070J04583J95777K07525J64026J51885J64330
$$ 91166973 91313577 91452867 91562212 91636282 91740865 91936642 92144167 92308193 92460078 92624408
3577.5I2624408J85817K06692J91688J29932R2489J57326J97816J65087J62590J97267
$$ 92624408 92810225 93016917 93208605 93338537 93431026 93588352 93786168 93951255 94113845 94311112
3597.9I4311112J95038J82057J82754J46740J07390J31148J57178J62243J62274J41466
$$ 94311112 94506150 94688207 94870961 95017701 95125091 95256239 95413417 95575660 95737934 95879400
3618.3I5879400J59269J87248J60075Q8524J1844R3174J96153J71107J26588R8038
$$ 95879400 96038669 96225917 96385992 96474516 96486360 96579534 96775687 96946794 97073382 97171420
3638.7I7171420P6222P1061N1814j9258o2382L4934J04874L9006j9425K3323L6210
$$ 97171420 97247642 97318703 97370517 97351259 97288877 97323811 97428685 97467691 97448266 97471589 97507799
3661.1I7507799J8721K3222j3786o4164L8242J32561O7520Q2200J35571J14459R8181
$$ 97507799 97526520 97549742 97535956 97471792 97510034 97642595 97710115 97792315 97927886 98042345 98140526
3683.5I8140526Q6438M1199j0419L8028J08135J00362N7298J0532j7673K2746N5193
$$ 98140526 98226964 98268163 98257744 98295772 98403907 98504269 98561567 98572099 98554426 98577172 98632365
3706I8632365J2178o2365p4285J7488M3351k3318o9523l7509L8618R8276J20968Q8900
$$ 98632365 98644543 98582178 98507893 98525381 98568732 98545414 98475891 98438382 98477000 98575276 98696244 98785144
3730.4I8785144K0045j3542L9518J08969R2119m2516j58912l8671J609r5695k69J27548
$$ 98785144 98805189 98791647 98831165 98940134 99032253 98989737 98830825 98792154 98793763 98698068 98697799 98825347
3754.9I8825347J01006L7843M4489N6142K1976K712n746J8639P1084P6604L7909j5283
$$ 98825347 98926353 98964196 99008685 99064827 99086803 99089515 99083769 99102408 99173492 99250096 99288005 99272722
3779.4I9272722j8322K121K81K2703L7795J3447k8413o3724l6043k7072p0101r263
$$ 99272722 99254400 99256521 99256802 99279505 99317300 99330747 99302334 99238610 99202567 99175495 99105394 99096131
3803.9I9096131M304l3236J4037K8241l3635q2648k2757j2135q435Q7554R4330P1031
$$ 99096131 99100435 99067199 99081236 99109477 99075842 98993194 98970437 98958302 98949867 99037421 99131751 99202782
3828.3I9202782N3692K2810K1315k2507p5972O265Q4489P6944N8204L3224l9334j70648
$$ 99202782 99256474 99279284 99300599 99278092 99202120 99208385 99292874 99369818 99428022 99461246 99421912 99251264
3852.8I9251264r4199J17093J21445K8878m9597k5999L3557k3120o1965m328K7085
$$ 99251264 99157065 99274158 99395603 99424481 99374884 99348885 99382442 99359322 99297357 99293029 99320114
3875.2I9320114K8777l6353o7437j6194m2355m6862j7088j4913O0224J21325P9620
$$ 99320114 99348891 99312538 99245101 99228907 99186552 99139690 99122602 99107689 99167913 99289238 99368858
3897.7I9368858J8019O258L8243R7853J24353Q3416L7283J7864r740j9031J8358L2824
$$ 99368858 99386877 99393135 99431378 99529231 99653584 99737000 99774283 99792147 99782407 99763376 99781734 99814558
3922.1I9814558N215j204J0646M738J0610L7760M4655L2550J7471M994J8007K6345
$$ 99814558 99819773 99818569 99829215 99833953 99844563 99882323 99926978 99959528 99976999 99981993 100000000 100026345
3946.6A00026345J3352K0885L8910L8052K2936J3983J4663J6677J7273J2493J2804
$$ 100026345 100039697 100060582 100099492 100137544 100160480 100174463 100189126 100205803 100223076 100235569 100248373
3969.1A00248373J8680J2183l421p105J990Q858Q142K157l755p045o878n043p081j4102
$$ 100248373 100267053 100279236 100275815 100268710 100270700 100279558 100287700 100289857 100286102 100279057 100272179 100267136 100260055 100245953
3997.6A00245953
$$ 100245953
##END=$$ End of the data block
