##TITLE=IVL padrao $$ Begin of the data block
##JCAMP-DX=5.00 $$ ACD/SpecManager v 10.08
##SPECTROMETER/DATA SYSTEM=Alpha
##DATE=08 Jul 2016 10:14:48
##DATA TYPE=INFRARED SPECTRUM
##DATA CLASS=XYDATA
##ORIGIN=
##OWNER=
##NPOINTS=1765
##FIRSTX=399.76428223
##LASTX=3997.64306641
##MAXX=3997.64306641
##MINX=399.76428223
##MAXY=0.75988859
##MINY=0.36423838
##XFACTOR=1.0000000000
##YFACTOR=1.000000000000000e-9
##FIRSTY=0.59923846
##DELTAX=2.03961372
##XUNITS=1/CM
##YUNITS=ARBITRARY UNITS
##XYDATA=(X++(Y..Y))
399.8E99238455K14637J128971K844155M044831M116237M907012M986167L390670L802955
418.1F28674090M771054K589583K298474L066242J412451M93527Q25465n35846j213908
436.5F42381132l56377j159191j761019p97570j299202j701832m12166p53999j898467
454.8F32241309j204670j425564k586901j919389j936913l347635k909660k450884
471.2F14459693l716230l329754k735853m003465m000843l077030l504038k664625
487.5E87427855p16806j114666j964331j609564k675414m138231m050613m859805o634831
505.8E59663594o982088p492900q793712q168101o563068n178749j942694J140535
522.1E15682817J171886L55661J65165n68271m92096R41277J109242N80669J072228
$$ y = [599238455, 599453092, 600582063, 603426218, 607471049, 611587286, 616494298, 621480465, 624871135, 628674090, 633445144, 636034727, 638333201, 641399443, 642811894, 643305421, 644130886, 643595040, 642381132, 642024755, 640865564, 639104545, 638306975, 637007773, 635305941, 634893775, 634139776, 632241309, 631036639, 629611075, 627024174, 625104785, 623167872, 619820237, 616910577, 614459693, 610743463, 607413709, 604677856, 600674391, 596673548, 593596518, 590092480, 587427855, 586711049, 585596383, 583632052, 582022488, 579347074, 575208843, 571158230, 566298425, 559663594, 552681506, 545188606, 536394894, 528226793, 521663725, 516484976, 514542282, 515682817, 516854703, 517210364, 517375529, 516807258, 516315162, 517256439, 518365681, 518946350, 520018578]
540.5E20018578P17401n44906o02126q64148k180219k440035k468705l884494m641891
558.9E03109455l136486m0143M216730P344484O888092N009472M511178M519284M663348
577.2E37085414N897105O719112O528139P118583P746339P237136P355869P722914
593.5E93410611O693006N919873O028593N292177M442692M583061M200339L478229
609.8F34048581L720045L680349L018438L225863L515602L028810L097832L380239
626.2F60715759K730608K380371K645254K245903J850247K017975J609564R14157Q99195
644.5F78009033P98822K71678J36077P9393k82347k77281j57356m83811n78820j20461
664.9F77394927j6392p56442r14395o38127n16057m33684n45204p32600q80957j100600
$$ y = [520018578, 520735979, 520191073, 519588947, 518724799, 516544580, 514104545, 511635840, 507751346, 503109455, 499972969, 499932826, 504149556, 511494040, 518382132, 523391604, 527902782, 532422066, 537085414, 542982519, 549701631, 556229770, 563348353, 571094692, 578331828, 585687697, 593410611, 600103617, 606023490, 612052083, 617344260, 621786952, 626370013, 630570352, 634048581, 637768626, 641448975, 644467413, 647693276, 651208878, 654237688, 657335520, 660715759, 663446367, 665826738, 668471992, 670717895, 672568142, 674586117, 676195681, 677109838, 678009033, 678807855, 679079533, 679215610, 679295003, 679012656, 678735375, 678578019, 678094208, 677515388, 677394927, 677378535, 676622093, 675707698, 675069571, 674553514, 674119830, 673574626, 672842026, 671961069, 670860469]
685.3F70860469j362979j596630j846015k100527k406419k791583l134847l470123
701.6F52151346l887653m269719m683554n237043n579353n720913o160915o791830
717.9F09820366p228315p512331p439971o867945o286860n814969m813492l693164
734.3E60163319l050089j750946Q23260L940522O844163Q471489P842779O130159N039454
752.6E94454110M335761L793120M055202M555345M572212M849375N366981N302548
768.9F31284654N143881N189061M582226L754676L515303K968550K043605J787960
785.3F60269916J555741Q74996Q83102J147092O31630L19839M63843k4259n61893m67956
805.6F65092051p73728j328885j197577j202524j650631j585186j545250k097607k194583
$$ y = [670860469, 669497490, 667900860, 666054845, 663954318, 661547899, 658756316, 655621469, 652151346, 648263693, 643993974, 639310420, 634073377, 628494024, 622773111, 616612196, 609820366, 602592051, 595079720, 587639749, 580771804, 574484944, 568669975, 563856483, 560163319, 557113230, 555362284, 556185544, 560126066, 566970229, 575441718, 583284497, 589414656, 594454110, 598789871, 602582991, 606638193, 611193538, 615765750, 620615125, 625982106, 631284654, 636428535, 641617596, 646199822, 649954498, 653469801, 656438351, 658481956, 660269916, 661825657, 662700653, 663583755, 664730847, 665362477, 665682316, 666146159, 666121900, 665560007, 665092051, 664318323, 662989438, 661791861, 660589337, 658938706, 657353520, 655808270, 653710663, 651516080]
824F51516080j988471k426326k728522k479553k665520k958297k615571k523482k937556
842.4F28192782l041923l157317l463090l195107k745747k458215j070917J119018
858.7F10179484J812875Q24273n38528k255440l805935l522098j702845j09256R38297
877F01820827J327037R63927Q30471Q32498J67251n09203o96897j093209j561224j472533
897.4F00608945j341760j370549j005531o51181p45117p23064o11007q77560j129329
915.8E92153847j191139j507640j804471j704097j673221j831830j799822j822471
932.1E78819156k109826k294123k520919l108680l708422m253149n122304o168783
948.4E49532950p129073q215845r389579j0226488j0634780j0620922r944290q679241
$$ y = [651516080, 649527609, 647101283, 644372761, 641893208, 639227688, 636269391, 633653820, 631130338, 628192782, 625150859, 621993542, 618530452, 615335345, 612589598, 610131383, 609060466, 610179484, 611992359, 612816632, 612278104, 610022664, 606216729, 602694631, 600991786, 600882530, 601820827, 603147864, 604111791, 604942262, 605774760, 605942011, 605432808, 604735911, 603642702, 602081478, 600608945, 599267185, 597896636, 596891105, 596239924, 595494807, 594771743, 594160736, 593283176, 592153847, 590962708, 589455068, 587650597, 585946500, 584273279, 582441449, 580641627, 578819156, 576709330, 574415207, 571894288, 568785608, 565077186, 560824037, 555701733, 549532950, 542403877, 534188032, 524798453, 514571965, 503937185, 493316263, 483371973, 474692732]
964.7D74692732p251561n805164m316628k948851j840859j154989j320780k319633
981.1D47734267k938957j764506P66576K640545L002793K836376L224790L999800M055917
999.4D63557601L041863K067209K139568K903789L322810K743066J324564k91377j585633
1017.8D79223460k418906k903282l216654l524155l920287m369288m758984m810602
1034.1D49301302l806173j477152J061052K490043K536178J546264N4180j520395l086239
1052.4D47099060m483164n384355n709976n830914n987078o074846o088435o061286
1068.8D01479006n902022n650342n334973m730970l942162l461152l351062l003270
1085.1C66103053j864672K3663K015144L100276K645910J256645J97470l88N48244
$$ y = [474692732, 467441171, 461636007, 457319379, 454370528, 452529669, 451374680, 450053900, 447734267, 444795310, 443030804, 443797380, 446437925, 449440718, 452277094, 455501884, 459501684, 463557601, 466599464, 468666673, 470806241, 473710030, 477032840, 479775906, 481100470, 480809093, 479223460, 476804554, 473901272, 470684618, 467160463, 463240176, 458870888, 454111904, 449301302, 445495129, 444017977, 445079029, 447569072, 450105250, 451651514, 451705694, 450185299, 447099060, 442615896, 437231541, 431521565, 425690651, 419703573, 413628727, 407540292, 401479006, 395576984, 389926642, 384591669, 379860699, 375918537, 372457385, 369106323, 366103053, 364238381, 364262044, 366277188, 369377464, 372023374, 373280019, 373477489, 373477101, 374025345]
1103.4C74025345J417339J989513K076269J975208J881152J879037K145201K650350
1119.8C90039414L224880L874451M555881N027622N339413N618841N681813N551398
1136.1D28913713N457341N300880M971593M661650M360974L989487L851444M100382
1152.4D65607464M364431M482299M577935M488528M237056M117965L990442L666699
1168.7D99532819L366709L137230L024996L383398L945946L982068L583014L243684
1185E27199864K938629K738177K912104L187836L343403L657818L987849L971040L903150
1203.4E57839870L990591L911316L728807L703118L541291L173887K990365K821446
1219.7E85700691K445698K251327K242386K090812K037882K201558K210319K191007
$$ y = [374025345, 375442684, 377432197, 379508466, 381483674, 383364826, 385243863, 387389064, 390039414, 393264294, 397138745, 401694626, 406722248, 412061661, 417680502, 423362315, 428913713, 434371054, 439671934, 444643527, 449305177, 453666151, 457655638, 461507082, 465607464, 469971895, 474454194, 479032129, 483520657, 487757713, 491875678, 495866120, 499532819, 502899528, 506036758, 509061754, 512445152, 516391098, 520373166, 523956180, 527199864, 530138493, 532876670, 535788774, 538976610, 542320013, 545977831, 549965680, 553936720, 557839870, 561830461, 565741777, 569470584, 573173702, 576714993, 579888880, 582879245, 585700691, 588146389, 590397716, 592640102, 594730914, 596768796, 598970354, 601180673, 603371680]
1236F03371680K417803K532184K459764K579510K708495K608717K617061K713620K539575
1254.4F26548409K373636K415121K254069J992464J970529J839042J506627J397848
1270.7F42297745J322984J005054Q15988P37845M32551K04206J10447m47392j200080
1289F45279348j178086l83198O03318J555800K038837J834393J599550J719713J979589
1307.4F55049264K191365K126217J620889J045942Q00669O61314M96208N72026P10726
1325.8F65274620N70238M13000L01361p0691m84645n90026m97938j78337P25210K041995
1346.2F67504787L002108L258645L010035K504825K106309J771689J145422M38154
1362.5F84741974p4089p13348j305044j196027q01801o72460n13434j39892N58316
$$ y = [603371680, 605789483, 608321667, 610781431, 613360941, 616069436, 618678153, 621295214, 624008834, 626548409, 628922045, 631337166, 633591235, 635583699, 637554228, 639393270, 640899897, 642297745, 643620729, 644625783, 645441771, 646179616, 646612167, 646816373, 646926820, 646479428, 645279348, 644101262, 643718064, 644321382, 645877182, 647916019, 649750412, 651349962, 653069675, 655049264, 657240629, 659366846, 660987735, 662033677, 662834346, 663495660, 663991868, 664563894, 665274620, 665844858, 666257858, 666559219, 666488528, 666003883, 665413857, 664915919, 664737582, 665462792, 667504787, 670506895, 673765540, 676775575, 679280400, 681386709, 683158398, 684303820, 684741974, 684667885, 683954537, 682649493, 681453466, 680651665, 679979205, 679465771, 679325879, 679884195]
1380.8F79884195J696706K919853L524005K882004J619518O53028J23799J07706K21908
1399.2F93632722K14636L71814Q94368J259386J237869J229704J068354O38663K90275
1417.5G00837791J40905l5286k18987l39687o06894r21309r59695j189470k079964
1435.9F94627404k907455l260255l911018m306436m491210m989743m959225m454196
1452.2F61347866l972173k924323Q4579K209127K130628J831591J714289J693905K129673
1470.6F66245162K956093L019035K501130K236068K041340J892567J757621J471818
1486.9F84120834J158714J066625P38681o8426q42572j188516j420379j757503k794802
1505.2F79012656m398405l905654l428817m108489n138516n877853o086409o886601
$$ y = [679884195, 681580901, 684500754, 688024759, 690906763, 692526281, 693179309, 693303108, 693410814, 693632722, 693847358, 694219172, 695113540, 696372926, 697610795, 698840499, 699908853, 700547516, 700837791, 700978696, 700943410, 700724423, 700384736, 699777842, 698856533, 697896838, 696707368, 694627404, 691719949, 688459694, 684548676, 680242240, 675751030, 670761287, 665802062, 661347866, 657375693, 654451370, 654535949, 656745076, 658875704, 660707295, 662421584, 664115489, 666245162, 669201255, 672220290, 674721420, 676957488, 678998828, 680891395, 682649016, 684120834, 685279548, 686346173, 687084854, 687016428, 686173856, 684985340, 683564961, 681807458, 679012656, 674614251, 670708597, 667279780, 663171291, 658032775, 652154922, 646068513, 639181912]
1521.6F39181912o172121m408121l421068k382219j842618j844704j539588j297414
1537.9F16274059j289427k31147J244664K260804K719998K915621K827525K383531
1554.2F29105628J826167K037882K980948K478242K196610K379060K509236K827108
1570.5F48340881K670050K336382K483726K287924J651228J084327O28531J19508n52297
1588.9F61050260j159489j635730k211333k699971l039837l561079m122138m412055
1605.2F38208628m657269m930258m786670m474103n061209n832494m839539m654289
1621.5E98972797n739629n749464n256712m508317k833426j381218k40624Q77440J291334
1639.9E75432181J398206J671851K745390M027664L819645M729092P222176N947947
$$ y = [639181912, 633009791, 628601670, 625180602, 622798383, 620955765, 619111061, 617571473, 616274059, 614984632, 614753485, 615998149, 618258953, 620978951, 623894572, 626722097, 629105628, 630931795, 632969677, 635950625, 638428867, 640625477, 643004537, 645513773, 648340881, 651010931, 653347313, 655831039, 658118963, 659770191, 660854518, 661483049, 661602557, 661050260, 659890771, 658255041, 656043708, 653343737, 650303900, 646742821, 642620683, 638208628, 633551359, 628621101, 623834431, 619360328, 614299119, 608466625, 603627086, 598972797, 593233168, 587483704, 582226992, 577718675, 574885249, 573504031, 573263407, 574140847, 575432181, 576830387, 578502238, 581247628, 585275292, 589094937, 593824029, 601046205, 606994152]
1656.2F06994152M814327N172610N853474N973459N151808N000412N317748M660666
1672.5F48938656M252195M180491L520787K894998K654016L133416K989351K305329
1688.8F74869239K099574J793265J517177J413643J601517K224088K094448J718521
1705.1F89331472J793504J671910J457930J366496J298368J546085J931130J765430
1721.5G02162325J468599J430392J401008J265943J088619J273215J610398J375020
1737.8G13075519J259207J300693J163661J059235J009047R94205J173377J181066
1754.1G22216010R59694Q55864Q59797Q85367Q56519P47323O61790N82934O89268R40680
1774.5G30255246Q42571O67751O98567P08639O54996O90222N70476L23891M83752P60734
$$ y = [606994152, 611808479, 616981089, 622834563, 628808022, 633959830, 638960242, 644277990, 648938656, 653190851, 657371342, 660892129, 663787127, 666441143, 669574559, 672563910, 674869239, 676968813, 678762078, 680279255, 681692898, 683294415, 685518503, 687612951, 689331472, 691124976, 692796886, 694254816, 695621312, 696919680, 698465765, 700396895, 702162325, 703630924, 705061316, 706462324, 707728267, 708816886, 710090101, 711700499, 713075519, 714334726, 715635419, 716799080, 717858315, 718867362, 719861567, 721034944, 722216010, 723175704, 724031568, 724891365, 725776732, 726633251, 727380574, 728042364, 728625298, 729314566, 730255246, 731097817, 731765568, 732464135, 733172774, 733827770, 734517992, 735088468, 735412359, 735896111, 736656845]
1794.9G36656845O43313N35666O66857P29978O59168O13034N06818M32432N35786N53072
1815.3G42532969M20570M61876N41210M03822L84331N22613N01156N40972O54220N63205
1835.7G47526944M41014M70102M04179K54393M02689N70118M68493L84748M37200L99947
1856.1G51759827K94864L62218M25875L17395K25603K78116M11629N15998N04851L58641
1876.5G55455017K75493L49462L50296K69354K83301K72154K23518K81274L22759K37346
1896.9G58319974J80185K29776J84953J00136J30653J17481M3392Q6069R9003k9504
1917.3G59462118Q106J35661P2360L5405J11401O3538n0366j9609q882j07884j29640
1939.7G59572208r3699r4115n3466p450r3460j95206j58608j52051k47776k46287k03848
$$ y = [736656845, 737300158, 737835824, 738502681, 739232659, 739891827, 740504861, 741011679, 741444111, 741979897, 742532969, 742953539, 743415415, 743956625, 744360447, 744744778, 745267391, 745768547, 746309519, 746963739, 747526944, 747967958, 748438060, 748842239, 749096632, 749499321, 750069439, 750537932, 750922680, 751359880, 751759827, 752054691, 752416909, 752842784, 753160179, 753385782, 753663898, 754075527, 754591525, 755096376, 755455017, 755730510, 756079972, 756430268, 756699622, 756982923, 757255077, 757478595, 757759869, 758082628, 758319974, 758500159, 758729935, 758914888, 759015024, 759145677, 759263158, 759306550, 759392619, 759491622, 759462118, 759470224, 759605885, 759678245, 759713650, 759825051, 759888589, 759838223, 759818614, 759809732, 759701848, 759572208, 759478509, 759384394, 759330928, 759323478, 759230018, 759034812, 758876204, 758724153, 758476377, 758230090, 758026242]
1962.1G58026242k73108l14296k70307l17633l85105l62456m16398n10454m83334m81844
1982.5G54211307n64993n66125n68628o65307o47366n29647n75364o61015o31452o55889
2002.9G48145521p18773o86407o53803p07567p39753p58112q73386j020432j110971
2021.3G40876317j277029j228273n70774j43648m18722o62864p07984q00788q56399
2039.6G34209836q27134q50678q99374q75294q41379q31843q11934q25465r04858r31382
2060G25610495q93534r17375r49084r24886r49084r95517r69708r46999r82940r78649
2080.4G16102719r27508r37521r48429q92639q79586r06527q55327q13365q36551q02457
2100.8G07302809p58887p96496p85351o84321o29604o03616n39959m95374m70817m24027
$$ y = [758026242, 757753134, 757438838, 757168531, 756850898, 756465793, 756103337, 755686939, 755176485, 754693151, 754211307, 753646314, 753080189, 752511561, 751846254, 751198888, 750669241, 750093877, 749432862, 748801410, 748145521, 747426748, 746740341, 746086538, 745378971, 744639218, 743881106, 743007720, 741987288, 740876317, 739599288, 738371015, 737800241, 737656593, 737237871, 736575007, 735867023, 735066235, 734209836, 733382702, 732532024, 731632650, 730757356, 729915977, 729084134, 728272200, 727446735, 726541877, 725610495, 724716961, 723799586, 722850502, 721925616, 720976532, 719981015, 719011307, 718064308, 717081368, 716102719, 715175211, 714237690, 713289261, 712396622, 711517036, 710610509, 709755182, 708941817, 708105266, 707302809, 706543922, 705747426, 704962075, 704277754, 703648150, 703044534, 702504575, 702009201, 701538384, 701114357]
2121.2G01114357l93630l93390l73900l57092l97503m13656l44515k94566k53320j67072
2141.6F97725713j38581j58190j16587p8917r2566n8531J9431N0306P4208J50263J93537
2164.1F97570086J87635K58982M07636M96090N22494N40316N18203N20587N68390N57661
2184.5G02148080N32508N64992N54681M77970M61280M74632M11689L74317M04835L56615
2204.8G06761599K60591K32995K09868J47402J12295R6023P3910J02281J49250J54078
2225.2G08300292J83642K31803K19226K22981K92301K89917K19703K33292K49505J55270
2245.6G10597932P9215N8651l755o2883q9288j71244k71440k99692l17871l64542l80040
2268.1G08775043l93331m61638n16355n13732n37813n71310n42760n38647n75126n63144
$$ y = [701114357, 700720727, 700327337, 699953437, 699596345, 699198842, 698785186, 698440671, 698146105, 697892785, 697725713, 697587132, 697428942, 697312355, 697233438, 697140872, 697082341, 697101772, 697152078, 697226286, 697376549, 697570086, 697757721, 698016703, 698424339, 698920429, 699442923, 699983239, 700501442, 701022029, 701590419, 702148080, 702680588, 703245580, 703800261, 704278231, 704739511, 705214143, 705625832, 706000149, 706404984, 706761599, 707022190, 707255185, 707465053, 707612455, 707724750, 707820773, 707894683, 707996964, 708146214, 708300292, 708483934, 708715737, 708934963, 709157944, 709450245, 709740162, 709959865, 710193157, 710442662, 710597932, 710677147, 710735798, 710732043, 710669160, 710579872, 710408628, 710137188, 709837496, 709519625, 709155083, 708775043, 708381712, 707920074, 707403719, 706889987, 706352174, 705780864, 705238104, 704699457, 704124331, 703561187]
2288.5G03561187n50807n84841n85734n80728o35565o29067n44429n18441m94421m44591
2308.9F97992563n08606n75960m87268l86894l87847m39286n29170o13570n88596n14388
2329.3F92960978n88537p40647p29740o63757o60896o67394q36193j096845r17136
2347.6F86059833m49241j63138j05619j49429l09586o15061r36567j106680j161337
2366F81063175j247346j322746j335621j328528j287937j211763j118064r80198q26597
2384.3F70404375p25151o42240n62965n40674n24938m87626n06103n45740n41687n68211
2404.7F64759040o25312o30439o37710o91473p27475p63059q23974q43108q30531q42452
2425.1F57343507q49247q37088q71002r23455q95679q63195r09567r26911q93176r15945
$$ y = [703561187, 703010380, 702425539, 701839805, 701259077, 700623512, 699994445, 699450016, 698931575, 698437154, 697992563, 697483957, 696907997, 696420729, 696033835, 695645988, 695206702, 694677532, 694063962, 693475366, 692960978, 692372441, 691631794, 690902054, 690238297, 689577401, 688910007, 688073814, 686976969, 686059833, 685610592, 685447454, 685341835, 685192406, 684882820, 684267759, 683331192, 682224512, 681063175, 679815829, 678493083, 677157462, 675828934, 674540997, 673329234, 672211170, 671230972, 670404375, 669679224, 669036984, 668474019, 667933345, 667408407, 666920781, 666414678, 665868938, 665327251, 664759040, 664133728, 663503289, 662865579, 662174106, 661446631, 660683572, 659859598, 659016490, 658185959, 657343507, 656494260, 655657172, 654786170, 653862715, 652967036, 652103841, 651194274, 650267363, 649374187, 648458242]
2445.5F48458242r39846q90851q67486r09626r41157r67682j022220j048088j042127
2463.9F39829159j080632j142025j169563j201868j246631j245618j213670j179456
2480.2F30349696j110256j033008r80675r10759q48055q61883q92342r03785r60409
2498.5F21848524j023412j049042j078427j080453r89735q84593q32915p29323n46038
2516.9F13634586l75807k36392j13547j8060O5327J49786K08736K11358J72734J28567
2537.3F13827288P9394N0187M0233k1219r0361j14858j54674k07067k27392k45869
2557.7F12935662k81214k97368l23176l63350l38257k90394l18467l85225m37379m89175
2578.1F09411657n46396o09696p04408q23080r21428r84609j045347j111567j151859
$$ y = [648458242, 647518396, 646627545, 645760059, 644850433, 643909276, 642941594, 641919374, 640871286, 639829159, 638748527, 637606502, 636436939, 635235071, 633988440, 632742822, 631529152, 630349696, 629239440, 628206432, 627225757, 626314998, 625466943, 624605060, 623712718, 622808933, 621848524, 620825112, 619776070, 618697643, 617617190, 616627455, 615742862, 614909947, 614180624, 613634586, 613258779, 613022387, 612908840, 612890780, 612956107, 613105893, 613314629, 613525987, 613698721, 613827288, 613906682, 613956869, 613997102, 613975883, 613885522, 613770664, 613615990, 613408923, 613181531, 612935662, 612654448, 612357080, 612033904, 611670554, 611332297, 611041903, 610723436, 610338211, 609900832, 609411657, 608865261, 608255565, 607551157, 606728077, 605806649, 604822040, 603776693, 602665126, 601513267]
2596.4F01513267j188636j237452j254380j237571j168967j023471q52406o85334n29766
2614.8E92335284m05967k82944j44064k5153L6955M0531K7597o56o0141j10030j40965
2637.2E91270447j89901k42948k71619l08156l64184m16160m85718n80609o73234p57277
2657.6E86980641q13782q27313q29279q30174p73072o56187n64397m93586m02927l55304
2678E80434620l49640l23415l00050k93016k89381l31163m23611m97341n17905m72366
2698.4E76636732l24130j14739P0095K84671N57900P21812P48038P51317O70731M89831
2718.8E80492258L38674J82509l4869k41518m04298n20527o23644p49349q93593j016021
2739.2E76529622j075208j128256j191080j225770j281082j367033j383126j319110
$$ y = [601513267, 600324631, 599087179, 597832799, 596595228, 595426261, 594402790, 593550384, 592865050, 592335284, 591929317, 591646373, 591502309, 591477156, 591514111, 591554642, 591582239, 591581583, 591521442, 591411412, 591270447, 591080546, 590837598, 590565979, 590257823, 589893639, 589477479, 588991761, 588411152, 587737918, 586980641, 586166859, 585339546, 584510267, 583680093, 582907021, 582250834, 581686437, 581192851, 580789924, 580434620, 580084980, 579761565, 579461515, 579168499, 578879118, 578547955, 578124344, 577627003, 577109098, 576636732, 576312602, 576197863, 576267958, 576552629, 577110529, 577832341, 578580379, 579331696, 580002427, 580492258, 580830932, 581013441, 580978572, 580737054, 580332756, 579812229, 579188585, 578439236, 577545643, 576529622, 575454414, 574326158, 573135078, 571909308, 570628226, 569261193, 567878067, 566558957]
2755.5E66558957j301825j321793j279294j204312j096487r25302p47204n58555l39449
2773.9E57784736k20775k01524j12772M053L8386M6313N0246n8114k19882k50876k09331
2796.3E56650460k65897l65674l47972k58863j48654n36P2717P6354R1791O0856O497
2818.8E55571079m8101j79410l50833m86791n97417o80506p25091p75397q69572j052618
2839.1E49805343j264691j334489j278817j225949j231789j201511j016140p73727
2855.5E40478230o00458n35071n85496o65545p21097q04067q58009q34167r31203j142145
2875.9E32800972j156628r89020q76486q22186p10845n67854m64618l39150j53840
2894.2E26720345%J20223K89321M34815M77732M99963N35727N31495M34696J98484
$$ y = [566558957, 565257132, 563935339, 562656045, 561451733, 560355246, 559429944, 558682740, 558124185, 557784736, 557563961, 557362437, 557249665, 557253718, 557292104, 557338417, 557388663, 557330549, 557110667, 556859791, 556650460, 556384563, 556018889, 555670917, 555412054, 555263400, 555262864, 555335581, 555411935, 555503726, 555564582, 555571079, 555522978, 555343568, 554992735, 554505944, 553908527, 553228021, 552502930, 551727533, 550857961, 549805343, 548540652, 547206163, 545927346, 544701397, 543469608, 542268097, 541251957, 540478230, 539877772, 539342701, 538757205, 538091660, 537370563, 536566496, 535708487, 534874320, 533943117, 532800972, 531644344, 530655324, 529778838, 528956652, 528245807, 527677953, 527213335, 526874185, 526720345, 526720345, 526840568, 527129889, 527564704, 528042436, 528542399, 529078126, 529609621, 530044317, 530242801]
2914.6E30242801q8036k63095l10302l00050k65717j54853m5836j34111k86460l47554
2935E28046787m56631o02723o03377m96865m23968l86238k55286L6001K40028K23636
2955.4E25321364J78099J45495L1769j53482k45988j58489l8385P7128K22385L08752
2975.8E25688648L92616M51684K55942k2351n0486O8188J84000J87397k3067j66297
2996.2E26966274r8229K4140J66476K35796K04086K19286K81512K26915K3187j42634
3016.6E28106809j55330j24753j09911j18494j77979j78933j05441o7055j39892k23458
3037E26705563j20223J2994l5345j62602k00927j07348l7908p1645q8811j01805j25110
3059.4E25666833p6175R120O9678K0384j41740j98245j03414Q822P6949K0087j03175
$$ y = [530242801, 530154765, 529891670, 529581368, 529281318, 529015601, 528860748, 528814912, 528680801, 528394341, 528046787, 527590156, 526987433, 526384056, 525887191, 525463223, 525076985, 524821699, 524857700, 525097728, 525321364, 525499463, 525644958, 525676727, 525523245, 525277257, 525118768, 525080383, 525157511, 525379896, 525688648, 526081264, 526532948, 526788890, 526766539, 526716053, 526784241, 526968241, 527155638, 527132571, 526966274, 526868045, 526892185, 527058661, 527294457, 527498543, 527717829, 527999341, 528226256, 528249443, 528106809, 527951479, 527826726, 527716815, 527598321, 527420342, 527241409, 527135968, 527068913, 526929021, 526705563, 526585340, 526598334, 526562989, 526400387, 526199460, 526092112, 526054204, 525982559, 525893748, 525791943, 525666833, 525590658, 525599778, 525669456, 525689840, 525548100, 525349855, 525246441, 525255263, 525332212, 525352299, 525249124]
3081.9E25249124j54198j72674j74105j68086k22742k49624j59383n3704p2181j86682
3102.2E23635745k19464j35482j03414j89185j55270L2663O8069q8036k69950l54111
3122.6E22221565k77459j29879m7147q1420j26004o4314M3750L1889j40727k39015
3143E21191239j61051o4016K2412M6849j13845k99633k97784k18749j58191r0718q5175
3165.5E19771338j23263q2850k1041m2736o6936p0930r1255p8260l1531r954j8239
3187.9E19134343l7194o5505p5221p4208q8096q9228m5180j2696m7862p9334o1333
3210.3E18458486m7088m1366l9518r5367j57654j54853j57297j70767j41025r0420
3230.7E17363131r9182k49505l75569l27408k78473k69354k25603k31862l02375l28660
$$ y = [525249124, 525094926, 524922252, 524748147, 524580061, 524357319, 524107695, 523948312, 523894608, 523822427, 523635745, 523416281, 523280799, 523177385, 522988200, 522832930, 522865593, 522933662, 522845626, 522575676, 522221565, 521944106, 521814227, 521767080, 521685660, 521559656, 521495342, 521539092, 521570981, 521430254, 521191239, 521030188, 520966172, 520988584, 521035433, 520921588, 520621955, 520324171, 520105422, 519947231, 519856513, 519771338, 519648075, 519565225, 519544184, 519501448, 519434512, 519363582, 519272327, 519194067, 519162536, 519152582, 519134343, 519097149, 519031644, 518956423, 518882215, 518794119, 518704891, 518659711, 518647015, 518599153, 518519819, 518458486, 518411398, 518370032, 518330514, 518235147, 518077493, 517922640, 517765343, 517594576, 517453551, 517363131, 517263949, 517014444, 516638875, 516311467, 516032994, 515763640, 515538037, 515306175, 515003800, 514675140]
3251.1E14675140k61366k02179k56896k96473k40624j97292j61409o9082j013r4652
3271.5E12894154k45095k91049k58625j81615j26839j54137j93715j61648q7977j00434
3291.9E11093020k21967l42191m29511m60445l64781k57969l61979o22272q22246q78156
3312.3E06331503q18014p72357p88986p93338p94471q56816j003445j131922j165360
3330.7D98206794j139134j046061r85772j114309j282245j320868j347840j335412
3347D88635153j247079j351356j613706j701653j568526j423330j446992j506895j375645
3365.4D75399971j239926j402706j727283j754373j447111j230926j217275j245469
3381.7D64134902j176447r78112p18117n08964n76585q24214q19534n14090l42011
$$ y = [514675140, 514413774, 514211595, 513954699, 513658226, 513417602, 513220310, 513058901, 512989819, 512988806, 512894154, 512649059, 512358010, 512099385, 511917770, 511790931, 511636794, 511443079, 511281431, 511193454, 511093020, 510871053, 510528862, 510099351, 509638906, 509274125, 509016156, 508654177, 508031905, 507209659, 506331503, 505513489, 504741132, 503952146, 503158808, 502364337, 501507521, 500504076, 499372154, 498206794, 497067660, 496021599, 495035827, 493921518, 492639273, 491318405, 489970565, 488635153, 487388074, 486036718, 484423012, 482721359, 481152833, 479729503, 478282511, 476775616, 475399971, 474160045, 472757339, 471030056, 469275683, 467828572, 466597646, 465380371, 464134902, 462958455, 461980343, 461262226, 460753262, 460176677, 459352463, 458532929, 458018839, 457676828]
3400D57676828n94795q71479p04199m13895l74317m31985m30971l62993k38686j41681
3420.4D53111827p6919N0097K44171L78102L62813M11898N63234N15312L23862L40611
3440.8D56225008N64009P49647Q34972Q86828R57668J021891J084984J163304J203298
3459.2D64691609J149357J189172J446306J583130J308202R28075R25838J183272J410395
3477.5D75815356J447975J309276J315594J467228J453101J394391J524330J683950
3493.8D87411201J755923J731426J709967J763523J732260J643777J698047J873284
3510.2E01319408K020896J979649J817405J781941J918554K095640K037108J811504
3526.5E16782105J784027J924455J995563K018869J953185J781046J767397J843095
$$ y = [457676828, 457082033, 456210554, 455506355, 455092460, 454718143, 454286158, 453855187, 453492194, 453253508, 453111827, 453034908, 453085005, 453329176, 453707278, 454070091, 454481989, 455045223, 455560535, 455884397, 456225008, 456789017, 457538664, 458373636, 459260464, 460218132, 461240023, 462325007, 463488311, 464691609, 465840966, 467030138, 468476444, 470059574, 471367776, 472295851, 473221689, 474404961, 475815356, 477263331, 478572607, 479888201, 481355429, 482808530, 484202921, 485727251, 487411201, 489167124, 490898550, 492608517, 494372040, 496104300, 497748077, 499446124, 501319408, 503340304, 505319953, 507137358, 508919299, 510837853, 512933493, 514970601, 516782105, 518566132, 520490587, 522486150, 524505019, 526458204, 528239250, 530006647, 531849742]
3542.8E31849742J770258J531899J344442J259685J148641J070678J071572J088441
3559.1E42135358J115143J123727J268863J998723K839803L067315L141999L406942
3575.4E60097873L645420L764034L826141L774226L614902L670514L893196L747940
3591.7E90034246L590942L697693L768444L709019L661870L509164L224433L252804
3608.1F18448615L464937L458679L404737L262639L283441L603279L434777K930403
3624.4F45291507K548814K695501L268778L100574K760113K643227K547920K517819
3640.7F67374253K448023K151012J778543J959562K602578K465128J919151J998663
3657F84696913K187669J825094J499534J425147J157820Q92461J209557J152396Q99076
$$ y = [531849742, 533620000, 535151899, 536496341, 537756026, 538904667, 539975345, 541046917, 542135358, 543250501, 544374228, 545643091, 547641814, 550481617, 553548932, 556690931, 560097873, 563743293, 567507327, 571333468, 575107694, 578722596, 582393110, 586286306, 590034246, 593625188, 597322881, 601091325, 604800344, 608462214, 611971378, 615195811, 618448615, 621913552, 625372231, 628776968, 632039607, 635323048, 638926327, 642361104, 645291507, 647840321, 650535822, 653804600, 656905174, 659665287, 662308514, 664856434, 667374253, 669822276, 671973288, 673751831, 675711393, 678313971, 680779099, 682698250, 684696913, 686884582, 688709676, 690209210, 691634357, 692792177, 693684638, 694894195, 696046591, 696945667]
3675.4F96945667J433015J566827J340628J333356J204908J040876J158237J265288
3691.7G07288802J195013J097441R27031O78897O64890J000106J029670O56307L15726
3710G14853883M47988R09090R07660O66499N71430N58197M69446M53115O18756N27858
3730.4G20983922J79947J53839O77169J023173O38962j37389j18971P49588O12379
3748.8G24762619K25424N91576Q04544N89967M37259O38128O62326L30210J69397K82406
3769.2G29493856M83990N33104M83394M13239K78473K96652L22223L01361L83198M53174
3789.6G33442664M38988K80559J58310J77443o4432K6107N45024L43860K86102O50108
3810G36284733N31077L6299q3327J94371P748K29180O63579M34816K71499K38061K38120
$$ y = [696945667, 698378682, 699945509, 701286137, 702619493, 703824401, 704865277, 706023514, 707288802, 708483815, 709581256, 710508287, 711187184, 711852074, 712852180, 713881850, 714538157, 714853883, 715301871, 716210961, 717118621, 717785120, 718356550, 718914747, 719384193, 719837308, 720456064, 720983922, 721163869, 721317708, 721994877, 723018050, 723657012, 723519623, 723400652, 724150240, 724762619, 724988043, 725579619, 726384163, 726974130, 727411389, 728049517, 728711843, 729042053, 729211450, 729493856, 729977846, 730510950, 730994344, 731407583, 731686056, 731982708, 732304931, 732606292, 732989490, 733442664, 733881652, 734162211, 734320521, 734497964, 734433532, 734459639, 735004663, 735348523, 735634625, 736284733, 736815810, 736852109, 736768782, 736963153, 736970901, 737200081, 737863660, 738298476, 738569975, 738808036, 739046156]
3832.4G39046156K90335l100k21193J56999M58181N12123N26428L63231k75493r53316
3852.8G39900351M2438J098812P66217K55108K0743J57714K23815l3379Q7083L67880
3873.2G42886782M97996M27008P8142K17676L72767J05024J97112J52886J848L51131
3893.6G45288372M62234L9041k74718j63436J24097M51803N70119L91841J97053L8087
3914G47124493q6486O974K35259K78950J73569J61051J43945K6525O3061K61605L11911
3936.4G48700857J77384K8312M4584J68741J45137J00672J66119J92463J58906Q8811
3956.8G49971986N4240J02162J47641J44184J13845Q2969L6300K9623Q9765J12533
3977.2G50885248Q5116J00672J39713J35780J05381P1764J15692K11239K03192J39892
$$ y = [739046156, 739336491, 739333391, 739112198, 739269197, 739727378, 740239501, 740765929, 741129160, 740853667, 739900351, 739942789, 741041601, 741807818, 742062926, 742083669, 742241383, 742465198, 742431819, 742518902, 742886782, 743384778, 743811786, 743889928, 744107604, 744480371, 744585395, 744782507, 744935393, 744937241, 745288372, 745750606, 745789647, 745514929, 745351493, 745475590, 745927393, 746497512, 746889353, 747086406, 747124493, 747038007, 747044981, 747280240, 747559190, 747732759, 747893810, 748037755, 748064280, 748127341, 748388946, 748700857, 748878241, 748906553, 748951137, 749119878, 749265015, 749365687, 749531806, 749724269, 749883175, 749971986, 750026226, 750128388, 750276029, 750420213, 750534058, 750617027, 750653327, 750682950, 750772715, 750885248, 750970364, 751071036, 751210749, 751346529, 751451910, 751523674, 751639366, 751850605, 752053797, 752193689]
3997.6G52193689
$$ y = [752193689]
##END=$$ End of the data block
