##TITLE=IVL FE $$ Begin of the data block
##JCAMP-DX=5.00 $$ ACD/SpecManager v 10.08
##SPECTROMETER/DATA SYSTEM=Alpha
##DATE=08 Jul 2016 10:14:48
##DATA TYPE=INFRARED SPECTRUM
##DATA CLASS=XYDATA
##ORIGIN=
##OWNER=
##NPOINTS=1765
##FIRSTX=399.76428223
##LASTX=3997.64306641
##MAXX=3997.64306641
##MINX=399.76428223
##MAXY=0.78092849
##MINY=0.21914695
##XFACTOR=1.0000000000
##YFACTOR=1.000000000000000e-9
##FIRSTY=0.68644679
##DELTAX=2.03961372
##XUNITS=1/CM
##YUNITS=ARBITRARY UNITS
##XYDATA=(X++(Y..Y))
$$ plain form
399.8 686446786 686065495 686638594 687470078 687876046 688580275 689698160 690806925 692251682 694136798
418.1 694136798 695971370 697630525 699071407 700142741 701109409 701740444 701931417 702251136 702281415
436.5 702281415 701746404 701193392 700244129 698830426 697456479 695649385 693493426 691475987 689077854
454.8 689077854 685990453 682691395 679318011 675768197 672030151 667784631 663631678 660291255
471.2 660291255 657468200 655378699 653847098 652022779 650099754 648248374 645806193 642884552
487.5 642884552 639605343 635279715 630078316 624475896 618398130 612332106 606368542 600199163
503.8 600199163 594330728 588870108 583535016 578642964 574288905 570098758 566287220 563128173
520.1 563128173 560338855 557976127 556107640 554685950 554024160 554097533 554608941 555691719 557289243
$$ packed form
399.8F86446786l81291N73099Q31484M05968P04229J117885J108765J444757J885116
418.1F94136798J834572J659155J440882J071334R66668O31035J90973L19719L0279
436.5G02281415n35011n53012r49263j413703j373947j807094k155959k017439k398133
454.8F89077854l087401l299058l373384l549814l738046m245520m152953l340423
471.2F60291255k823055k089501j531601j824319j923025j851380k442181k921641
487.5F42884552l279209m325628n201399n602420o077766o066024n963564o169379
503.8F00199163n868435n460620n335092m892052m354059m190147l811538l159047
520.1E63128173k789318k362728j868487j421690o61790P3373N11408J082778J597524
$$ plain form
538.5 557289243 559057951 561168790 563550889 565855086 568269849 570925891 573710918 576766312
554.8 576766312 580051780 583216250 586337447 589338958 591835558 593777537 595117509 595829606 596222878
573.1 596222878 596356571 596137047 596025288 596310675 596877575 597438574 597234905 595077395 589724600
591.5 589724600 579731584 563629329 540440023 510106623 475687355 443967342 421828747 411829591
607.8 411829591 412173927 420968443 439586788 469442278 506163418 540983081 568146288 585078001
624.1 585078001 589139342 579723060 560003638 536269903 515732348 504049003 503685951 514055967
640.4 514055967 532695770 556622982 583622754 611360848 636892736 658388436 675846696
654.7 675846696 689396441 699619532 707438111 713296235 718050003 723468363 727621734 728130877
$$ packed form
538.5E57289243J768708K110839K382099K304197K414763K656042K785027L055394
554.8E76766312L285468L164470L121197L001511K496600J941979J339972P12097L93272
573.1E96222878J33693k19524j11759K85387N66900N60999k03669k157510n352795
591.5E89724600r993016j6102255k3189306l0333400l4419268l1720013k2138595r999156
607.8D11829591L44336Q794516J8618345K9855490L6721140L4819663K7163207J6931713
624.1E85078001M061341r416282j9719422k3733735k0537555j1683345l63052J0370016
640.4E14055967J8639803K3927212K6999772K7738094K5531888K1495700J7458260
654.7F75846696J3549745J0223091P818579N858124M753768N418360M153371N09143
$$ plain form
671 728130877 728503048 729434907 730081916 730383873 730292320 729663849 728701413 727532983 726297379 725216508
691.4 725216508 724013388 722482204 720849454 719065249 717084587 715074122 712812901 710196376
707.7 710196376 707481503 704595387 701425374 698160589 694721460 690911233 686907589 682905614
724.1 682905614 678938508 675178587 671694458 668429673 665459335 662739038 660210192 657919288
740.4 657919288 655776680 653665423 651739478 650144935 648923278 648255467 648369253 649463773 651717186
758.7 651717186 655058086 659226954 664112210 669475257 674859583 679895103 684330881 687984407
775.1 687984407 690825880 692872405 694121122 694730103 694868743 694627762 694220722 693847895 693581462
793.4 693581462 693471074 693454564 693431318 693394899 693269789 692949772 692483366 691953659 691324830 690580547
$$ packed form
671G28130877L72171R31859O47009L01957r1553o28471r62436j168430j235604j080871
691.4G25216508j203120j531184j632750j784205j980662k010465k261221k616525
707.7G10196376k714873k886116l170013l264785l439129l810227m003644m001975
724.1F82905614l967106l759921l484129l264785k970338k720297k528846k290904
740.4F57919288k142608k111257j925945j594543j221657o67811J13786J094520K253413
758.7F51717186L340900M168868M885256N363047N384326N035520M435778L653526
775.1F87984407K841473K046525J248717O08981J38640k40981m07040l72827k66433
793.4F93581462j10388j6510k3246l6419j25110l20017m66406n29707o28829p44283
$$ plain form
813.8 690580547 689792216 688913465 687843502 686659873 685353696 683770418 681919575 679799736 677374363
832.2 677374363 674849391 672391415 670006514 667859554 665992141 664180219 662331879 660421729
848.5 660421729 658287108 655836046 652992785 649657428 646045089 642319500 638470888 634837806
864.8 634837806 631670117 628783703 626111150 623864174 622626364 622746110 623359323 623549521 623440504
883.2 623440504 623252451 622765422 621926129 620732307 619005442 616908133 614669919 612257421 609874189
901.5 609874189 607745647 605691016 603673458 601668537 599327624 596579552 593498945 589923143
917.8 589923143 585958660 581876397 577664256 573463559 569453180 565505326 561779618 558934748
934.1 558934748 557308733 556310713 554874539 552413046 549284816 546054065 542319834 537031114 529521823
$$ packed form
813.8F90580547p88331q78751j069963j183629j306177j583278j850843k119839k425373
832.2F77374363k524972k457976k384901k146960j867413j811922j848340j910150
848.5F60421729k134621k451062k843261l335357l612339l725589l848612l633082
864.8F34837806l167689k886414k672553k246976j237810J19746O13213J90198j09017
883.2F23440504j88053m87029q39293j193822j726865k097309k238214k412498k383232
901.5F09874189k128542k054631k017558k004921k340913k748072l080607l575802
917.8E89923143l964483m082263m212141m200697m010379l947854l725708k844870
934.1E58934748j626015r98020j436174k461493l128230l230751l734231n288720p509291
$$ plain form
952.5 529521823 519477308 506962717 492433310 476544142 460601419 446474582 435596883
966.8 435596883 428562790 425424755 425656736 428234458 431467354 432553113 430700183 433328956 448173255
985.1 448173255 467721343 479473412 482388377 481095195 478149265 474261194 469589770 464268982
1001.4 464268982 458267182 451554924 444245934 436395556 428121865 419762492 411496818 403541833
1017.8 403541833 396324873 390043020 384631127 380009383 375955880 372181118 368506849 364629388
1034.1 364629388 360259533 355298311 349599242 342910320 335094869 325991601 315508723 303874463
1050.4 303874463 291404337 278543442 266114652 254988283 245368496 236987457 229837894 224305823
1066.7 224305823 220732287 219146952 219336525 221012339 223923460 227784768 232376873 237592027
$$ packed form
952.5E29521823j0044515j2514591j4529407j5889168j5942723j4126837j0877699
966.8D35596883p034093l138035K31981K577722L232896J085759j852930K628773J4844299
985.1D48173255J9548088J1752069K914965j293182k945930l888071m671424n320788
1001.4D64268982o001800o712258p308990p850378q273691q359373q265674p954985
1017.8D03541833p216960o281853n411893m621744m053503l774762l674269l877461
1034.1C64629388m369855m961222n699069o688922p815451r103268j0482878j1634260
1050.4C03874463j2470126j2860895j2428790j1126369r619787q381039p149563n532071
1066.7B24305823l573536j585335J89573J675814K911121L861308M592105N215154
$$ plain form
1083 237592027 243472517 250139028 257497281 265108913 272503525 279288471 285044402 289565533 292780638
1101.4 292780638 294610351 295189738 294832945 293775588 292300433 290712386 289179355 287891388 287085444
1119.8 287085444 286913842 287533939 289195180 292036533 296170950 301696539 308471978 316258043 324909478
1138.1 324909478 334227175 343933046 353776366 363441259 372733444 381649524 390070409 397780865
1154.4 397780865 404595882 410152584 414093077 416390628 417050749 416010618 413354158 409236789
1170.7 409236789 403914243 397855282 391411483 384762943 378304273 372542113 367940217 365004152
1187.1 365004152 364080220 365231335 368424356 373446852 379922539 387596875 396223068 405503511
1203.4 405503511 415303856 425539970 436047137 446761072 457545578 468016267 477822095 486702949
$$ packed form
1083B37592027N880490O666511P358253P611632P394612O784946N755931M521131L215105
1101.4B92780638J829713N79387l56793j057357j475155j588047j533031j287967q05944
1119.8B87085444j71602O20097J661241K841353M134417N525589O775439P786065Q651435
1138.1C24909478R317697R705871R843320R664893R292185Q916080Q420885P710456
1154.4C97780865O815017N556702L940493K297551O60121j040131k656460m117369
1170.7D09236789n322546o058961o443799o648540o458670n762160m601896k936065
1187.1C65004152r23932J151115L193021N022496O475687P674336Q626193R280443
1203.4D05503511R800345J0236114J0507167J0713935J0784506J0470689R805828Q880854
$$ plain form
1219.7 486702949 494695872 502581000 511325657 521110892 531437516 541630566 551147401 559866309
1236 559866309 567874908 575161934 581830740 588102400 594007373 599583149 604936063 609951615 614538610
1254.4 614538610 618765771 622559249 625880241 628870487 631490052 633688152 635636210 637406409
1270.7 637406409 639035404 640716910 642506123 644361019 646393955 648644388 651101291 653831422
1287 653831422 656745493 659724891 662856162 666121483 669365764 672556162 675576866 678228498 680473924
1305.4 680473924 682293296 683616519 684531271 685141861 685483456 685728431 686040759 686449111 687050879
1323.7 687050879 687910914 688899040 690015614 691347778 692782581 694263697 695912480 697729468 699599743
1342.1 699599743 701414704 702992439 704341710 705649137 706887543 707997262 708999276 709613085
$$ packed form
1219.7D86702949P992923P885128Q744657R785235J0326624J0193050R516835Q718908
1236E59866309Q008599P287026O668806O271660N904973N575776N352914N015552M586995
1254.4F14538610M227161L793478L320992K990246K619565K198100J948058J770199
1270.7F37406409J628995J681506J789213J854896K032936K250433K456903K730131
1287F53831422K914071K979398L131271L265321L244281L190398L020704K651632K245426
1305.4F80473924J819372J323223R14752O10590L41595K44975L12328M08352O01768
1323.7F87050879Q60035R88126J116574J332164J434803J481116J648783J816988J870275
1342.1F99599743J814961J577735J349271J307427J238406J109719J002014O13809
$$ plain form
1358.4 709613085 709453523 708444417 706831992 704999566 703360915 702432096 702428877 703364789 704852283
1376.7 704852283 706120908 706610560 706391871 706285596 706663013 706751406 705824912 703318238 698258936
1395.1 698258936 691007197 685151935 685846686 693122208 702514648 710138559 715337515 719363153
1411.4 719363153 722905636 725651264 727312863 727828681 727351367 725974441 723479509 719407141 712866008
1429.8 712866008 703814924 693376064 683489621 679381609 681419432 684060633 684569120 682760179
1446.1 682760179 679451466 676262915 674046457 672726214 672108233 672537327 674250185 676642656 679221153
1464.5 679221153 681715906 684135795 686429679 688521683 690546274 692606568 694743574 697077453
1480.8 697077453 699461460 701633453 703537047 704883695 705492079 705712378 705239534 703461707 700959086
$$ packed form
1358.4G09613085j59562j009106j612425j832426j638651r28819l219R35912J487494
1376.7G04852283J268625M89652k18689j06275L77417Q8393r26494k506674n059302
1395.1F98258936p251739n855262O94751P275522R392440P623911N198956M025638
1411.4G19363153L542483K745628J661599N15818m77314j376926k494932m072368o541133
1429.8G12866008r051084j0438860r886443m108012K037823K641201N08487j808941
1446.1F82760179l308713l188551k216458j320243o17981M29094J712858K392471K578497
1464.5F79221153K494753K419889K293884K092004K024591K060294K137006K333879
1480.8F97077453K384007K171993J903594J346648O08384K20299m72844j777827k502621
$$ plain form
1499.1 700959086 698525488 696166396 692694783 686777592 681504488 677514315 673348904 668615401
1515.4 668615401 663555562 658584714 652907133 647594333 643290639 639095902 635640025 632572234
1531.8 632572234 629207969 626886785 625568986 623558700 621782541 621443391 621834517 622759700 624185085
1550.1 624185085 626073301 628527999 631492794 635145724 639624715 643782735 647986829 652527452
1566.4 652527452 657325625 662201405 666407049 670099556 673435867 675870478 677442491 678120434
1582.8 678120434 677863896 676800668 674920738 672325492 669220448 665578365 661511600 657171667
1599.1 657171667 652402341 647241592 641984165 636583626 630932629 625410020 620260298 614505112
1615.4 614505112 607926488 603019714 599226475 594959021 590948761 587571561 584796369 583167076
$$ packed form
1499.1G00959086k433598k359092l471613n917191n273104l990173m165411m733503
1515.4F68615401n059839m970848n677581n312800m303694m194737l455877l067791
1531.8F32572234l364265k321184j317799k010286j776159l39150L91126R25183J425385
1550.1F24185085J888216K454698K964795L652930M478991M158020M204094M540623
1566.4F52527452M798173M875780M205644L692507L336311K434611J572013O77943
1582.8F78120434k56538j063228j879930k595246l105044l642083m066765m339933
1599.1F57171667m769326n160749n257427n400539n650997n522609n149722n755186
1615.4F14505112o578624m906774l793239m267454m010260l377200k775192j629293
$$ plain form
1631.7 583167076 582322717 581729233 582038105 583492577 585803986 588842869 592904389 597970784 602934420
1650.1 602934420 608955324 617216945 624293804 630691767 637746394 645580053 653364480 660209179
1666.4 660209179 667004406 674013853 680106342 685768306 691297233 696046889 700236678 704232574
1682.7 704232574 708305061 711758077 714645922 717466176 720022082 722304583 724359989 726428151
1699 726428151 728832662 731121063 733056962 734851778 736526012 738078654 739512682 740822434 741990089
1717.4 741990089 743124485 744313538 745415568 746433139 747411907 748375058 749248147 749888241 750455260
1735.7 750455260 751131594 751733601 752265036 752962291 753846288 754730284 755463779 756211102 756984830 757657945
1756.1 757657945 758297145 758908153 759439290 760019064 760603189 761108518 761591911 761936247 762291729 762839437
$$ packed form
1631.7E83167076q44359n93484L08872J454472K311409L038883M061520N066395M963636
1650.1F02934420O020904Q261621P076859O397963P054627P833659P784427O844699
1666.4F60209179O795227P009447O092489N661964N528927M749656M189789L995896
1682.7G04232574M072487L453016K887845K820254K555906K282501K055406K068162
1699G26428151K404511K288401J935899J794816J674234J552642J434028J309752J167655
1717.4G41990089J134396J189053J102030J017571R78768R63151Q73089O40094N67019
1735.7G50455260O76334O02007N31435O97255Q83997Q83996P33495P47323P73728O73115
1756.1G57657945O39200O11008N31137N79774N84125N05329M83393L44336L55482N47708
$$ plain form
1776.5 762839437 763396323 763840497 764270902 764685571 765093267 765586019 765988111 766242266 766627431 767109036
1796.9 767109036 767472684 767799437 768182695 768564463 768959880 769335806 769651234 769995093 770347178 770626128
1817.3 770626128 770952761 771306694 771535337 771764457 772087693 772297859 772480130 772762179 772951901 773111761
1837.7 773111761 773369670 773577988 773671389 773812652 774003923 774225295 774485111 774665952 774832070 775045335
1858.1 775045335 775199413 775370121 775651574 775858581 775931895 776072264 776283860 776495457 776718736 776873469
1878.5 776873469 776987076 777163804 777303815 777391970 777477562 777507663 777557790 777644873 777629316 777560651 777553201
1900.9 777553201 777511179 777447164 777438998 777343452 777172923 777091324 776985228 776768148 776608527 776459455 776224852
1923.4 776224852 776067793 775936127 775718272 775519431 775274873 774922550 774614453 774319768 773933768 773557961
$$ packed form
1776.5G62839437N56886M44174M30405M14669M07696M92752M02092K54155L85165M81605
1796.9G67109036L63648L26753L83258L81768L95417L75926L15428L43859L52085K78950
1817.3G70626128L26633L53933K28643K29120L23236K10166J82271K82049J89722J59860
1837.7G73111761K57909K08318R3401J41263J91271K21372K59816J80841J66118K13265
1858.1G75045335J54078J70708K81453K07007P3314J40369K11596K11597K23279J54733
1878.5G76873469J13607J76728J40011Q8155Q5592L0101N0127Q7083j5557o8665p450
1900.9G77553201m2022o4015q166r5546j70529q1599j06096k17080j59621j49072k34603
1923.4G76224852j57059j31666k17855j98841k44558l52323l08097k94685l86000l75807
$$ plain form
1943.8 773557961 773172855 772706449 772266030 771786809 771175802 770556867 769881070 769026220 768107533 767210782
1964.2 767210782 766430259 765979648 765720189 765335441 764839351 764276862 763591170 762858570 762095869 761242151
1984.6 761242151 760399997 759592950 758697033 757772148 756902874 756002724 755078793 754150808 753167629 752203643
2005 752203643 751259148 750241816 749218524 748230040 747155309 745937169 744579375 743048310 741319239
2023.3 741319239 739703536 738739550 738167763 737274766 735964000 734454989 732799768 730910122 728803217
2041.7 728803217 726642072 724636734 723044515 721979380 721224666 720456064 719497085 718323350 717054605
2060 717054605 715853930 714809954 713986874 713416219 713012338 712677658 712362409 711974800 711433053 710734487
2080.4 710734487 709865808 708824337 707761109 706848443 706108987 705509245 705000997 704522848 704083681
$$ packed form
1943.8G73557961l85106m66406m40419m79221o11007o18935o75797q54850r18687q96751
1964.2G67210782p80523m50611k59459l84748m96090n62489o85692p32600p62701q53718
1984.6G61242151q42154q07047q95917r24885q69274r00150r23931r27985r83179r63986
2005G52203643r44495j017332j023292r88484j074731j218140j357794j531065j729071
2023.3G41319239j615703r63986n71787q92997j310766j509011j655221j889646k106905
2041.7G28803217k161145k005338j592219j065135p54714p68602r58979j173735j268745
2060G17054605j200675j043976q23080n70655m03881l34680l15249l87609n41747o98566
2080.4G10734487q68679j041471j063228r12666p39456n99742n08248m78149m39167
$$ plain form
2098.8 704083681 703683853 703247309 702745080 702196300 701569080 700858414 700149894 699493349 698888600 698337436
2119.2 698337436 697806656 697276890 696785271 696344137 695955873 695642292 695374489 695120633 694918871 694807053
2139.6 694807053 694786131 694906235 695175231 695492983 695814669 696125746 696367085 696540296 696689785 696832418
2160 696832418 697000325 697193086 697359025 697530687 697794020 698115706 698441327 698759496 699017227 699235082
2180.4 699235082 699455023 699637830 699839354 700117946 700395644 700672388 701011181 701361239 701697826 702082992
2200.8 702082992 702488244 702875137 703294992 703707874 704076350 704447448 704762459 705006897 705262423 705481231
2221.2 705481231 705636501 705780923 705856383 705839932 705818594 705765486 705630839 705480516 705307186 705066741
2241.6 705066741 704801083 704500198 704143584 703792393 703414023 702924907 702386737 701846421 701271236 700697005
$$ packed form
2098.8G04083681l99828m36544n02229n48780o27220p10666p08520o56545o04749n51164
2119.2F98337436n30780n29766m91619m41134l88264l13581k67803k53856k01762j11818
2139.6F94807053k0922J20104K68996L17752L21686L11077K41339J73211J49489J42633
2160F96832418J67907J92761J65939J71662K63333L21686L25621L18169K57731K17855
2180.4F99235082K19941J82807K01524K78592K77698K76744L38793L50058L36587L85166
2200.8G02082992M05252L86893M19855M12882L68476L71098L15011K44438K55526K18808
2221.2G05481231J55270J44422P5460j6451k1338n3108j34647j50323j73330k40445
2241.6G05066741k65658l00885l56614l51191l78370m89116n38170n40316n75185n74231
$$ plain form
2262 700697005 700110495 699439764 698743224 698046207 697280288 696481884 695657849 694736540 693804085 692935526
2282.3 692935526 692089438 691333652 690677643 689978302 689243376 688567340 687892318 687228143 686651945 686116874
2302.7 686116874 685660243 685332358 685004175 684609473 684198916 683799624 683566451 683610499 683640659 683358967
2323.1 683358967 682944417 682633162 682336688 681822956 681052208 680280745 679618180 678898573 677932978 676350117
2343.5 676350117 673826814 671669126 671331823 672540009 674123585 675293624 675752103 675234377 673911691
2361.9 673911691 672053814 669778466 667189419 664330184 661389709 658629060 656038225 653549969
2378.2 653549969 651286006 649328291 647679865 646367610 645292222 644309640 643402696 642518461 641585588
2396.6 641585588 640654325 639719605 638729692 637755156 636800528 635787606 634765029 633757591 632711530
$$ packed form
2262G00697005n86510o70731o96540o97017p65919p98404q24035r21309r32455q68559
2282.3F92935526q46088p55786o56009o99341p34926o76036o75022o64175n76198n35071
2302.7F86116874m56631l27885l28183l94702m10557l99292k33173M4048L0160k81692
2323.1F83358967m14550l11255k96474n13732p70748p71463o62565p19607r65595j582861
2343.5F76350117k523303k157688l37303J208186J583576J170039M58479n17726j322686
2361.9F73911691j857877k275348k589047k859235k940475k760649k590835k488256
2378.2F53549969k263963j957715j648426j312255j075388r82582r06944q84235r32873
2396.6F41585588r31263r34720r89913r74536r54628j012922j022577j007438j046061
$$ plain form
2414.9 632711530 631650805 630582094 629445732 628279150 627152324 626015782 624855280 623699129
2431.2 623699129 622506618 621299624 620113492 618912101 617724895 616588771 615467548 614381671
2447.6 614381671 613352001 612320542 611278653 610247076 609191835 608131766 607120216 606127322
2463.9 606127322 605119824 604106307 603060186 601983130 600936413 599900126 598813057 597689450
2480.2 597689450 596575260 595496655 594454169 593411684 592355430 591306925 590246141 589166403
2496.5 589166403 588104427 587057352 586020768 585009694 583996177 582972109 581994832 581088603 580220163
2514.9 580220163 579373002 578560352 577796876 577085137 576408386 575762272 575181067 574670374 574209511 573815167
2535.3 573815167 573491812 573204398 572945774 572729468 572537065 572370291 572252333 572161555 572068870 571957111
$$ packed form
2414.9F32711530j060725j068711j136362j166582j126826j136542j160502j156151
2431.2F23699129j192511j206994j186132j201391j187206j136124j121223j085877
2447.6F14381671j029670j031459j041889j031577j055241j060069j011550r92894
2463.9F06127322j007498j013517j046121j077056j046717j036287j087069j123607
2480.2E97689450j114190j078605j042486j042485j056254j048505j060784j079738
2496.5E89166403j061976j047075j036584j011074j013517j024068r77277r06229q68440
2514.9E80220163q47161q12650p63476p11739o76751o46114n81205n10693m60863l94344
2535.3E73815167l23355k87414k58624k16306j92403j66774j17958r0778r2685j11759
$$ plain form
2555.6 571957111 571793914 571574330 571330726 571062863 570750117 570383847 569931924 569361091 568710208 568038046
2576 568038046 567327619 566546917 565680325 564736605 563770294 562803507 561818540 560825229 559829116 558804393
2596.4 558804393 557762682 556752384 555798769 554884732 553988099 553105235 552247643 551458478 550763905
2614.8 550763905 550122559 549501836 548905492 548342168 547834098 547364473 546907723 546488464 546104848 545732379
2635.2 545732379 545385182 545047522 544669211 544265985 543873429 543475270 543068588 542675436 542275310 541832268
2655.6 541832268 541345894 540834129 540308356 539781868 539249659 538686454 538107097 537523150 536934137 536359310
2676 536359310 535770714 535134315 534469366 533804715 533181012 532633126 532119274 531599760 531094253 530602336
2696.4 530602336 530122399 529677510 529259443 528833449 528396964 527941048 527474165 527051032 526640952 526177585
$$ packed form
2555.6E71957111j63197k19584k43604k67863l12746l66270m51923n70833o50883o72162
2576E68038046p10427p80702q66592r43720r66311r66787r84967r93311r96113j024723
2596.4E58804393j041711j010298r53615r14037q96633q82864q57592p89165o94573
2614.8E50763905o41346o20723n96344n63324n08070m69625m56750m19259l83616l72469
2635.2E45732379l47197l37660l78311m03226l92556l98159m06682l93152m00126m43042
2655.6E41832268m86374n11765n25773n26488n32209n63205n79357n83947n89013n74827
2676E36359310n88596o36399o64949o64651o23703n47886n13852n19514n05507m91917
2696.4E30602336m79937m44889m18067m25994m36485m55916m66883m23133m10080m63367
$$ plain form
2716.8 526177585 525681078 525176942 524644196 524090886 523490548 522793889 522082210 521406412 520711899 519992709
2737.2 519992709 519245803 518449664 517649114 516895771 516158402 515361905 514486670 513597548 512767375 511975825
2757.6 511975825 511175036 510409832 509705424 509004891 508317947 507700503 507166922 506700099 506199837 505617976
2778 505617976 505078614 504638135 504235387 503898442 503658056 503391922 503039122 502704263 502434850 502164423
2798.4 502164423 501808882 501341760 500833452 500359833 499890834 499346644 498692364 497959971 497228444 496515989
2818.8 496515989 495747328 494906038 494026780 493099570 492154151 491227537 490284055 489331186 488392800 487275481
2839.1 487275481 485862643 484412283 483090729 481806397 480512440 479274988 478180081 477268040
2855.5 477268040 476533175 475876689 475185633 474479616 473810285 473175853 472600073 472090036 471487015 470651627
$$ packed form
2716.8E26177585m96507n04136n32746n53310o00338o96659p11679o75798o94513p19190
2737.2E19992709p46906p96139q00550p53343p37369p96497q75235q89122q30173p91550
2757.6E11975825q00789p65204p04408p00533o86944o17444n33581m66823n00262n81861
2778E05617976n39362m40479m02748l36945k40386k66134l52800l34859k69413k70427
2798.4E02164423l55541m67122n08308m73619m68999n44190o54280p32393p31527p12455
2818.8D96515989p68661q41290q79258r27210r45419r26614r43482r52869r38386j117319
2839.1D87275481j412838j450360j321554j284332j293957j237452j094907r12041
2855.5D77268040p34865o56486o91056p06017o69331o34432n75780n10037o03021q35388
$$ plain form
2875.9 470651627 469747216 468961388 468232095 467497081 466862381 466420025 466166914 466156453 466416508 466784298
2896.3 466784298 467159450 467642814 468240678 468820333 469306648 469732821 470151395 470456988 470442444 470116198
2916.6 470116198 469646513 469115615 468626976 468268126 468048096 467930615 467760950 467516929 467368215 467343569
2937 467343569 467368454 467481166 467657119 467701346 467526108 467244387 466952711 466565520 466020882 465440750
2957.4 465440750 464959502 464610994 464320898 464083910 464008331 464141130 464519233 465147942 465906709 466741651
2977.8 466741651 467596233 468235552 468588769 468825847 469035208 469239324 469370931 469281584 469070852 468874484
2998.2 468874484 468655914 468463629 468326509 468216687 468223065 468372583 468459845 468312442 467977315 467566013
3018.6 467566013 467163026 466839612 466558963 466229737 465935588 465761483 465635777 465410799 465040892 464757264
$$ packed form
2875.9D70651627r04411p85828p29293p35014o34700m42356k53111j0461K60055L67790
2896.3D66784298L75152M83364N97864N79655M86315M26173M18574L05593j4544l26246
2916.6D70116198m69685n30898m88639l58850k20030j17481j69665k44021j48714k4646
2937D67343569K4885J12712J75953M4227j75238k81721k91676l87191n44638n80132
2957.4D65440750m81248l48508k90096k36988p5579J32799L78103O28709P58767Q34942
2977.8D66741651Q54582O39319L53217K37078K09361K04116J31607q9347k10732j96368
2998.2D68874484k18570j92285j37120j09822O378J49518Q7262j47403l35127m11302
3018.6D67566013m02987l23414k80649l29226k94149j74105j25706k24978l69907k83628
$$ plain form
3039 464757264 464660972 464503676 464149207 463761359 463497847 463289022 463058978 462853432 462634951 462395698
3059.4 462395698 462237030 462164611 462133706 462062269 461860895 461627930 461536884 461660206 461894870 461991042
3079.8 461991042 461901158 461780041 461660504 461575329 461574703 461534142 461423337 461404592 461515963 461608768 461591393
3102.2 461591393 461580426 461713880 461909086 461988091 462039679 462247223 462509602 462662667 462644845 462480783
3122.6 462480783 462361455 462416768 462561846 462692410 462791711 462918282 463151544 463420153 463532835 463517189
3143 463517189 463566035 463728845 464010745 464371234 464582443 464565158 464543253 464658648 464844108 464998633
3163.4 464998633 465093821 465178698 465315074 465511203 465738058 465968430 466185659 466391534 466582477 466776967
3183.8 466776967 467024446 467342794 467669606 467935771 468163997 468397796 468647927 468930602 469261914 469640374
$$ packed form
3039D64757264r6292j57296l54469l87848k63512k08825k30044k05546k18481k39253
3059.4D62395698j58668p2419l0905p1437k01374k32965r1046J23322K34664R6172
3079.8D61991042q9884j21117j19537q5175o26m0561j10805j8745J11371R2805j7375
3102.2D61591393j0967J33454J95206P9005N1588K07544K62379J53065j7822j64062
3122.6D62480783j19328N5313J45078J30564R9301J26571K33262K68609J12682j5646
3143D63517189M8846J62810K81900L60489K11209j7285k1905J15395J85460J54525
3163.4D64998633R5188Q4877J36376J96129K26855K30372K17229K05875J90943J94490
3183.8D66776967K47479L18348L26812K66165K28226K33799K50131K82675L31312L78460
$$ plain form
3204.2 469640374 470039040 470397979 470743954 471136600 471507579 471833497 472176611 472516716 472824961 473118126
3224.6 473118126 473402053 473708004 474104017 474527925 474767536 474841446 474965066 475185156 475445330 475739896
3245 475739896 476053327 476321369 476549089 476829827 477194399 477535218 477809519 478099197 478442341 478844285
3265.4 478844285 479355067 479968518 480505556 480880767 481193095 481502473 481864125 482286870 482691646 483083576
3285.8 483083576 483526826 484033942 484521896 484842271 484981120 485066473 485173702 485345423 485599637 485740036
3306.2 485740036 485556513 485120952 484610587 484112948 483631045 483117044 482559502 482019991 481436342 480609328
3326.6 480609328 479574263 478559256 477604747 476659089 475710630 474639952 473381132 472030789 470612854
3345 470612854 469224542 467994958 466671914 465049267 463345557 461786151 460332572 458812952 457255274
$$ packed form
3204.2D69640374L98666L58939L45975L92646L70979L25918L43114L40105L08245K93165
3224.6D73118126K83927L05951L96013M23908K39611P3910J23620K20090K60174K94566
3245D75739896L13431K68042K27720K80738L64572L40819K74301K89678L43144M01944
3265.4D78844285N10782O13451N37038L75211L12328L09378L61652M22745M04776L91930
3285.8D83083576M43250N07116M87954L20375J38849Q5353J07229J71721K54214J40399
3306.2D85740036j83523m35561n10365m97639m81903n14001n57542n39511n83649q27014
3326.6D80609328j035065j015007r54509r45658r48459j070678j258820j350343j417935
3345D70612854j388312j229584j323044j622647j703710j559406j453579j519620j557678
$$ plain form
3363.3 457255274 455897897 454695851 453268528 451483697 449680388 448167205 446899146 445717871
3379.6 445717871 444525689 443403423 442513347 441911608 441563338 441144735 440380514 439629406 439315677
3398 439315677 439216644 438800424 438053876 437464446 437181711 437030017 436911821 436736435 436546326 436518490
3418.4 436518490 436621487 436774462 437073827 437601805 438289016 438948005 439672440 440632492 441541195 442177534
3438.8 442177534 442841858 443830401 445092857 446459860 447850853 449339330 450943679 452635080 454483449
3457.1 454483449 456466943 458386749 460301459 462506205 464877009 466947377 468654037 470417798
3473.4 470417798 472472340 474802256 477192521 479398370 481615186 484010607 486374825 488676578
3489.8 488676578 491094083 493654132 496295691 498902112 501497507 504170120 506743550 509159803
$$ packed form
3363.3D57255274j357377j202046j427323j784831j803309j513183j268059j181275
3379.6D45717871j192182j122266q90076o01739l48270m18603p64221p51108l13729
3398D39315677r9033m16220p46548n89430k82735j51694j18196j75386j90109k7836
3418.4D36518490J02997J52975K99365N27978O87211O58989P24435R60052R08703O36339
3438.8D42177534O64324R88543J262456J367003J390993J488477J604349J691401J848369
3457.1D54483449J983494J919806J914710K204746K370804K070368J706660J763761
3473.4D70417798K054542K329916K390265K205849K216816K395421K364218K301753
3489.8D88676578K417505K560049K641559K606421K595395K672613K573430K416253
$$ plain form
3506.1 509159803 511689723 514472067 517415166 520305634 523036242 525783956 528733373 531873584
3522.4 531873584 534929574 537783086 540661812 543697655 546858072 550122023 553364694 556493878
3538.7 556493878 559715748 563141942 566559970 569729865 572787225 575980425 579300523 582631826
3555 582631826 586000979 589462757 592912316 596269131 599681735 603448212 607391000 611123264 614737988
3573.4 614737988 618487835 622417510 626461506 630534768 634552181 638562560 642695189 646871805
3589.7 646871805 650903404 654920220 659058809 663285911 667507708 671588540 675433993 679132223
3606 679132223 682937622 686810195 690645158 694499671 698227882 702016771 706049681 709706724 712747812
3624.4 712747812 715601206 718902886 722407877 725348055 728015125 730602562 733054340 735432804
$$ packed form
3506.1E09159803K529920K782344K943099K890468K730608K747714K949417L140211
3522.4E31873584L055990K853512K878726L035843L160417L263951L242671L129184
3538.7E56493878L221870L426194L418028L169895L057360L193200L320098L331303
3555E82631826L369153L461778L449559L356815L412604L766477L942788L732264L614724
3573.4F14737988L749847L929675M043996M073262M017413M010379M132629M176616
3589.7F46871805M031599M016816M138589M227102M221797M080832L845453L698230
3606F79132223L805399L872573L834963L854513L728211L788889M032910L657043L041088
3624.4G12747812K853394L301680L504991K940178K667070K587437K451778K378464
$$ plain form
3640.7 735432804 737708986 739772916 741756856 744063437 746421695 748200953 749777794 751634836
3657 751634836 753435671 754840136 755960166 756960750 757901788 758885682 759858251 760636687 761522889
3675.4 761522889 762573123 763449013 764240205 765052438 765896142 766954243 768172443 769135833 769894660
3693.7 769894660 770592690 771161854 771667719 772278905 772893250 773299456 773526669 773734212 774052382 774430811
3714.1 774430811 774765074 775105596 775504410 775888979 776234210 776582778 776783586 776748538 776749969 777040780
3734.5 777040780 777488470 777695775 777475893 777165055 777290761 777581930 777631998 777770400 778074741 778244793
3754.9 778244793 778312027 778472841 778682768 778803647 778924048 779074311 779243469 779430807 779535294 779612720
3775.3 779612720 779786170 779946625 779934287 779878378 779939353 780052960 780119956 780101836 780018210 779972434 779965580
$$ packed form
3640.7G35432804K276182K063930J983940K306581K358258J779258J576841J857042
3657G51634836J800835J404465J120030J000584R41038R83894R72569P78436Q86202
3675.4G61522889J050234Q75890P91192Q12233Q43704J058101J218200R63390P58827
3693.7G69894660O98030N69164N05865O11186O14345M06206K27213K07543L18170L78429
3714.1G74430811L34263L40522L98814L84569L45231L48568K00808l5048J431K90811
3734.5G77040780M47690K07305k19882l10838J25706K91169N0068J38402L04341J70052
3754.9G78244793O7234J60814K09927J20879J20401J50263J69158J87338J04487P7426
3775.3G79612720J73450J60455j2338n5909O0975J13607O6996j8120q3626m5776o854
$$ plain form
3797.7 779965580 779998720 780164063 780272126 780304790 780449033 780533552 780460894 780396998 780464172 780491114 780455768
3820.2 780455768 780583322 780698299 780691981 780672371 780672252 780696213 780731022 780790150 780813694 780736446 780731797 780874252
3844.6 780874252 780928493 780720353 780362129 780275881 780650616 780851007 780745387 780583978 780522883 780538917
3865 780538917 780474246 780412793 780513585 780680299 780806243 780788422 780716360 780690312 780627429 780645967 780682445
3887.5 780682445 780649722 780766904 780858576 780674458 780448496 780373514 780382872 780466259 780598819 780596197 780423701
3909.9 780423701 780235350 780113459 780067682 780116796 780150115 780086815 780035973 780049503 780054271 780055106 780116320 780148447
3934.4 780148447 780031264 779876232 779808402 779782832 779734075 779691219 779666841 779620469 779595017 779578924 779506803
3956.8 779506803 779439986 779450893 779483020 779429555 779283226 779125988 779014289 778956115 778979659 779049277 779083312
$$ packed form
3797.7G79965580L3140J65343J08063L2664J44243Q4519p2658o3896O7174K6942l5346
3820.2G80455768J27554J14977o318j9610j19K3961L4809N9128K3544p7248m649J42455
3844.6G80874252N4241k08140l58224q6248L74735K00391j05620j61409o1095J6034
3865G80538917o4671o1453J00792J66714J25944j7821p2062k6048o2883J8538L6478
3887.5G80682445l2723J17182R1672j84118k25962p4982R358Q3387J32560k622j72496
3909.9G80423701j88351j21891m5777M9114L3319o3300n0842J3530M768Q35O1214L2127
3934.4G80148447j17183j55032o7830k5570m8757m2856k4378m6372k5452j6093p2121
3956.8G79506803o6817J0907L2127n3465j46329j57238j11699n8174K3544O9618L4035
$$ plain form
3979.3 779083312 779080033 779034853 778921664 778763890 778690219 778752387 778813839 778791487 778742850
3997.6 778742850
$$ packed form
3979.3G79083312l279m5180j13189j57774p3671O2168O1452k2352m8637
3997.6G78742850
##END=$$ End of the data block
