##TITLE=ISOCIANATE ISO 99 PB2 $$ Begin of the data block
##JCAMP-DX=5.00 $$ ACD/SpecManager v 10.08
##SPECTROMETER/DATA SYSTEM=Alpha
##DATE=27 Nov 2015 09:01:52
##DATA TYPE=INFRARED SPECTRUM
##DATA CLASS=XYDATA
##ORIGIN=
##OWNER=
##NPOINTS=1667
##FIRSTX=599.64648438
##LASTX=3997.64306641
##MAXX=3997.64306641
##MINX=599.64648438
##MAXY=1.07588661
##MINY=0.24506427
##XFACTOR=1.0000000000
##YFACTOR=0.000000010000000
##FIRSTY=1.00325561
##DELTAX=2.03961372
##XUNITS=1/CM
##YUNITS=ARBITRARY UNITS
##XYDATA=(X++(Y..Y))
599.6A00325561j20104j35898j45752k19696k52980k09558j79327j57058j34009j10060
$$ 100325561 100205457 100069559 99923807 99704111 99451131 99241573 99062246 98905188 98771179 98661119
620I8661119j7232J39934K94363M25697N19222N18691L96562K23005R7048P4554K02369
$$ 98661119 98643887 98783821 99078184 99503881 100023103 100541794 100938356 101161361 101258409 101332963 101535332
642.5A01535332M55404O17289N64885M21882L16846K39909J59788R6500L4511m434
$$ 101535332 101990736 102608025 103172910 103594792 103911638 104151547 104311335 104407835 104442346 104437912
662.9A04437912K06959O86729L57437n11992l78549p9966k8741p6497j33431j75845
$$ 104437912 104644871 105331600 105689037 105177045 104798496 104718530 104689789 104613292 104479861 104304016
683.3A04304016j93596j77002j13523n4872k9552R525N7065Q0204P9846N7257K8372
$$ 104304016 104110420 103933418 103819895 103765023 103735471 103744996 103802061 103882265 103962111 104019368 104047740
705.7A04047740M3058R7597J18696P2718O378k4617o9475j31631j25098q3304l7098
$$ 104047740 104090798 104188395 104307091 104379809 104386187 104361570 104292095 104160464 104035366 103952062 103914964
728.1A03914964J9455M3893M0710L3867o318j27673l06499m71473o03819o85322o40774
$$ 103914964 103934419 103978312 104019022 104052889 104046571 103918898 103612399 103140926 102537107 101851785 101211011
750.6A01211011m23872q1050K85565N26083N25451L48520K06256K14457K75874K69151
$$ 101211011 100787139 100706089 100991654 101517737 102043188 102391708 102597964 102812421 103088295 103357446
771A03357446J74809K4974j25265k18570k42865k41626k54023k87843l86619p03538
$$ 103357446 103532255 103557229 103431964 103213394 102970529 102728903 102474880 102187037 101800418 101096880
791.4A01096880j414346k508748l539425l476334j678681O37418J452553M82625q50880
$$ 101096880 99682534 97173786 93634361 90158027 88479346 89116764 90569317 91051942 90201062
809.7I0201062j387572j040072k71070N14949J080322J330757J361376J330722J338106
$$ 90201062 88813490 87773418 87502348 88017297 89097619 90428376 91789752 93120474 94458580
828.1I4458580J387066J386189J266068J042384P59226M86768K83873J05178j50073
$$ 94458580 95845646 97231835 98497903 99540287 100299513 100786281 101070154 101175332 101025259
846.4A01025259n10692q61037r63378o82551j81126K26980L80010L75831M15587O19465
$$ 101025259 100514567 99653530 98690152 98007601 97826475 98053455 98433465 98809296 99224883 99844348
866.8I9844348R20010J094282J010298P66778N28098L56102K41136J83475J79267J71149
$$ 99844348 100764358 101858640 102868938 103635716 104163814 104519916 104761052 104944527 105123794 105294943
887.2A05294943J16503O3002M3786K7168n329m6682q4055j10543j41430k08497l29697
$$ 105294943 105411446 105474448 105518234 105545402 105540073 105493391 105409336 105298793 105157363 104948866 104619169
909.7A04619169m84800n64027m01461M756M04179N50187M50397K78783J50930P7904
$$ 104619169 104134369 103570342 103168881 103173637 103577816 104128003 104578400 104857183 105008113 105086017
930.1A05086017M3296J2517l2782p2539r0897q6808p0322m1055o342J8858K2364o640
$$ 105086017 105129313 105141830 105109048 105036509 104945612 104858804 104788482 104747427 104741085 104759943 104782307 104775667
954.5A04775667n2881q0347n4085J0323O9642J12796J51289J76477J77252J69182J56057
$$ 104775667 104722786 104642439 104588354 104598677 104668319 104781115 104932404 105108881 105286133 105455315 105611372
977A05611372J24788O8832O067l6942o8808r9015j03438q9967q4758q2875o6125l9911
$$ 105611372 105736160 105804992 105811059 105774117 105705309 105606294 105502856 105412889 105328131 105245256 105179131 105139220
1001.5A05139220l0720o7878j85311l72899o97350j606548k874255k283973P59822
$$ 105139220 105108500 105040622 104855311 104482412 103785062 102178514 99304259 97020286 97780108
1019.8I7780108K849281K225840Q45361J27387r3794j66320k09868k31362k26796j98566
$$ 97780108 100629389 102855229 103700590 103827977 103734183 103567863 103357995 103126633 102899837 102701271
1040.2A02701271j54579j10304q2016r3389j35326j66428j80734j80459j73163j83404
$$ 102701271 102546692 102436388 102354372 102260983 102125657 101959229 101778495 101598036 101424873 101241469
1060.6A01241469k17795k41053k16246j67131j40500j34087j28895j11121p2193j5300
$$ 101241469 101023674 100782621 100566375 100399244 100258744 100124657 99995762 99884641 99812448 99797148
1081I9797148N4287J07891J10614K9934j49888m41051q50010j301104j644319j790923
$$ 99797148 99851435 99959326 100069940 100099874 99949986 99508935 98658925 97357821 95713502 93922579
1101.4I3922579j776784j584071j034022o2757R61339J501119J419682J022696O12283
$$ 93922579 92145795 90561724 89527702 89464945 90426284 91927403 93347085 94369781 94982064
1119.8I4982064K66254o4779m34690q16906j146251j393670j556950j616478j546574
$$ 94982064 95248318 95183539 94748849 93931943 92785692 91392022 89835072 88218594 86672020
1138.1H6672020j339740j013082o29872k61593M3434K59894L93695M64493N01323N21367
$$ 86672020 85332280 84319198 83689326 83427733 83471167 83731061 84124756 84589249 85090572 85611939
1158.5H5611939N21523N15241N11390N02234M87632M61674M05424L03317J73521J20282
$$ 85611939 86133462 86648703 87160093 87662327 88149959 88611633 89017057 89320374 89493895 89614177
1178.9H9614177K28530M00573M87798M63772L86763L12257K55668K01762J11442l5643
$$ 89614177 89842707 90243280 90731078 91194850 91581613 91893870 92149538 92351300 92462742 92427099
1199.3I2427099j74243j90997m4697J90335L49862K96849J02758l4189k9218P6675
$$ 92427099 92252856 92061859 92017162 92207497 92557359 92854208 92956966 92922777 92893559 92970234
1219.7I2970234K09594L12453L60477L45534K89077K28059J75858J38456J25908J40822
$$ 92970234 93179828 93492281 93852758 94198292 94487369 94715428 94891286 95029742 95155650 95296472
1240.1I5296472J74320K00725K12973K22611K29222K32649K35993K45422K59673K60127
$$ 95296472 95470792 95671517 95884490 96107101 96336323 96568972 96804965 97050387 97310060 97570187
1260.5I7570187K38913K05124J46025N5033l2139p2777n5587m483M0090M3184J5354
$$ 97570187 97809100 98014224 98160249 98215282 98183143 98110366 98054779 98050296 98090386 98133570 98148924
1282.9I8148924K6971J36668K79909L10505J94716J18148K60353M43626L73256R3520
$$ 98148924 98175895 98312563 98592472 98902977 99097693 99215841 99476194 99919820 100293076 100386596
1303.3A00386596j73772l08245l08549k39230j18953P1359L05277N12296O24132O19042
$$ 100386596 100212824 99904579 99596030 99356800 99237847 99309206 99614483 100126779 100750911 101369953
1323.7A01369953N05090L28135J39320l7682j57892j80555j45817j21402j29724j52922
$$ 101369953 101875043 102203178 102342498 102304816 102146924 101966369 101820552 101699150 101569426 101416504
1344.1A01416504j67834j53160j21069q5831n2619m7350o8951j07193j87635l02482
$$ 101416504 101248670 101095510 100974441 100888610 100835991 100788641 100719690 100612497 100424862 100122380
1364.5A00122380l64434l87586l79163l50892l59041l19802j74100K5350K40368M72301
$$ 100122380 99757946 99370360 98991197 98640305 98281264 97961462 97787362 97812712 98053080 98525381
1384.9I8525381O84244P22199N99635N08153M15838K66028J29926J9610r7323l31628
$$ 98525381 99209625 99931824 100531459 101039612 101455450 101721478 101851404 101871014 101773691 101442063
1405.3A01442063o81830j087230j436847j306981n16379N90318J399356J213152P10141
$$ 101442063 100760233 99673003 98236156 96929175 96412796 97003114 98402470 99615622 100325763
1423.7A00325763L24393p1073m82357p54875o64508m15939j19042J47634L18146M07291
$$ 100325763 100650156 100579083 100096726 99341851 98677343 98261404 98142362 98289996 98608142 99015433
1444.1I9015433M09150L38822K07115J26397J54042K83063L69537L87656N20027P05206
$$ 99015433 99424583 99763405 99970520 100096917 100250959 100534022 100903559 101291215 101811242 102516448
1464.5A02516448O99926N18966M06003K72536P2730l6312m2939l9041m6253n6553q2397
$$ 102516448 103216374 103735340 104141343 104413879 104486609 104450297 104407358 104368317 104322064 104265511 104183114
1486.9A04183114j82963l63672m18198m87101p82621j154554j349204j445616k015328
$$ 104183114 104000151 103636479 103218281 102731180 101948559 100794005 99444801 97999185 95983857
1505.2I5983857l316826k811867j683819j407701j795977k592695k972275l086036
$$ 95983857 92667031 89855164 88171345 86763644 84967667 82374972 79402697 76316661
1521.6G6316661k101505m57072Q20350J704705K554786L596205L389913K974468L819293
$$ 76316661 74215156 73758084 74578434 76283139 78837925 82434130 85824043 88798511 92617804
1539.9I2617804L520977K132714J524949J163203R45961P50113N93030N42104N68009
$$ 92617804 96138781 98271495 99796444 100959647 101905608 102655721 103248751 103790855 104358864
1558.3A04358864K95746N6970N3644o2561n13017j273596j651454j680577j215678
$$ 104358864 104654610 104711580 104765224 104702663 104189646 102916050 101264596 99584019 98368341
1576.6I8368341L08490J519233J806747J262510M77481q0168m44734o90592q10360
$$ 98368341 98676831 100196064 102002811 103265321 103742802 103662634 103217900 102527308 101716948
1595A01716948q02839q12161j035601j472437j814044j514196k82365J281344K159965
$$ 101716948 100914109 100101948 99066347 97593910 95779866 94265670 93983305 95264649 97424614
1613.4I7424614K462155K302712J402879Q14784N82885L00527O0236o4766l6132O7961
$$ 97424614 99886769 102189481 103592360 104407144 104990029 105290556 105350792 105286026 105249894 105317855
1633.7A05317855J6010j27781o6590O5863J84214K13123J02591R1910J79625k9993
$$ 105317855 105333865 105206084 105139494 105205357 105389571 105602694 105705285 105797195 105976820 105946827
1654.1A05946827j85478n8722L3664L0697j9539o91Q82q4948j26434j44911k13241
$$ 105946827 105761349 105702627 105736291 105766988 105747449 105746758 105747640 105662692 105536258 105391347 105178106
1676.6A05178106j78576q3196q5020l48449m75382l93081l96180l43347l84700m90034
$$ 105178106 104999530 104916334 104831314 104482865 104007483 103614402 103218222 102874875 102490175 102000141
1697A02000141n95772q68237q85922r86844j309544j403672j413249j443828j561856
$$ 102000141 101404369 100536132 99650210 98663366 97353822 95950150 94536901 93093073 91531217
1715.3I1531217j996750k182841k060217k446067l044563l378845l501647l244692
$$ 91531217 89534467 87351626 85291409 82845342 79800779 76421934 72920287 69675595
1731.7F9675595l068543k153420n69356O76596J824254K792895L637534M427058N204463
$$ 69675595 66607052 64453632 63884276 64560872 66385126 69178021 72815555 77242613 82447076
1750H2447076N140191M076690L385305K866083K092404J554155J031995O56903M81450
$$ 82447076 87587267 91663957 95049262 97915345 100007749 101561904 102593899 103250802 103732252
1768.4A03732252L00765M6432j37615p7045J06502L05438L93152L64613K70629K25616
$$ 103732252 104033017 104079449 103941834 103864789 103971291 104276729 104669881 105034494 105305123 105530739
1788.8A05530739K18642J55067Q1205J00422J35458J15180P2312N3966O8558O8247
$$ 105530739 105749381 105904448 105985653 106086075 106221533 106336713 106409025 106462991 106531549 106599796
1809.2A06599796N0878K3640J7488J9991K9123M5359M5955L6442M0925L4964j3483
$$ 106599796 106650674 106674314 106691802 106711793 106740916 106786275 106832230 106868672 106909597 106944561 106931078
1831.6A06931078j6355P093J2779K0588M8112L1865l3510m4417k7204j6009j3507j0729
$$ 106931078 106914723 106921816 106934595 106955183 107003295 107035160 107001650 106957233 106930029 106914020 106900513 106889784
1856.1A06889784j7261k4355k5403j0169P642l2997j13142j22571p9560n7388m6706
$$ 106889784 106872523 106848168 106822765 106812596 106820238 106787241 106674099 106551528 106471968 106414580 106367874
1878.5A06367874l2329j6368j2469j1802l0565p4232r5522r8908r3842p6353m5538
$$ 106367874 106335545 106319177 106306708 106294906 106264341 106190109 106094587 105995679 105901837 105825484 105779946
1900.9A05779946j0026K8468O4015Q7583R6297J08576J33252J35446J05774Q7071P3623
$$ 105779946 105769920 105798388 105862403 105949986 106046283 106154859 106288111 106423557 106529331 106616402 106690025
1923.4A06690025N0176N1307N3978M1056L0374K8766L3319L6799K8539N496p701p713
$$ 106690025 106740201 106791508 106845486 106886542 106916916 106945682 106979001 107015800 107044339 107049835 107042134 107034421
1947.9A07034421j597k397j1766j3113q761j2386j6463p153K242j848j0491j0466n770
$$ 107034421 107032824 107030427 107018661 107005548 106996787 106984401 106967938 106960785 106963027 106961179 106950688 106940222 106934452
1974.4A06934452J347M995j156o771o879q070m208L683j967j2970j7547j6415j1325
$$ 106934452 106935799 106940794 106939638 106932867 106925988 106917918 106913710 106917393 106915426 106902456 106884909 106868494 106857169
2000.9A06857169n699m553j0288j9062k2721j0788l016j8824k8705k2388k1362k3568
$$ 106857169 106851470 106846917 106836629 106817567 106794846 106784058 106781042 106762218 106733513 106711125 106689763 106666195
2025.4A06666195k5713k9683l1245l2890l8922m3165m7076n6648o3587p1513p7272
$$ 106666195 106640482 106610799 106579554 106546664 106507742 106464577 106417501 106360853 106297266 106225753 106148481
2047.8A06148481p3742q1659r8991j08731j13404j16825j24252j30832j24991j07419
$$ 106148481 106074739 105993080 105894089 105785358 105671954 105555129 105430877 105300045 105175054 105067635
2068.2A05067635q5545n7793k2590O294J8168K4307L5548M0698L8755L7002K9994J9645
$$ 105067635 104982090 104924297 104901707 104908001 104926169 104950476 104986024 105026722 105065477 105102479 105132473 105152118
2092.7A05152118J1742Q059N841m077j5259k7096m7445o3455p4470r0933j15538j38366
$$ 105152118 105163860 105171919 105177760 105173683 105158424 105131328 105083883 105020428 104945958 104855025 104739487 104601121
2117.1A04601121j58811j93131k33483k69043l07167l47149l81768m11296m35591m50504
$$ 104601121 104442310 104249179 104015696 103746653 103439486 103092337 102710569 102299273 101863682 101413178
2137.5A01413178m52506m43280m17042l73906l27658k87289k54279k34497k39086k60311
$$ 101413178 100960672 100517392 100100350 99726444 99398786 99111497 98857218 98622721 98383635 98123324
2157.9I8123324k90424l20905l47203l67266l60096l34024l14987l03620l02499l17800
$$ 98123324 97832900 97511995 97164792 96797526 96437430 96103406 95788419 95484799 95182300 94864500
2178.3I4864500l44456l88217m53984n22399n72938o16461o67447p07352p26456p40420
$$ 94864500 94520044 94131827 93677843 93155444 92582506 91966045 91298598 90591246 89864790 89124370
2198.7H9124370p50387p56121p67022p83307q14306q61943r10813r66644j045972j161844
$$ 89124370 88373983 87617862 86850840 86067533 85253227 84391284 83480471 82513827 81467855 80306011
2219.1H0306011j337933j580834j883007k244287k646429l065109l468984l813410
$$ 80306011 78968078 77387244 75504237 73259950 70613521 67548412 64079428 60266018
2235.4F0266018m047042m122108m011322l710916l260362k738411k229854j797247
$$ 60266018 56218976 52096868 48085546 44374630 41114268 38375857 36146003 34348756
2251.8C4348756j490402j321605j246175j202816j141071j032779q79827o92567m80642
$$ 34348756 32858354 31536749 30290574 29087758 27946687 26913908 26034081 25341514 24860872
2270.1B4860872k71719q2726R1616K76008M88909P30761J003465J311532J648802J996722
$$ 24860872 24589153 24506427 24598043 24874051 25362960 26093721 27097186 28408718 30057520 32054242
2290.5C2054242K349636K685640K988323L264070L499955L654384L708727L672176
$$ 32054242 34403878 37089518 40077841 43341911 46841866 50496250 54204977 57877153
2306.8E7877153L546983L335583L043467K714080K424586K209085K008736J757020
$$ 57877153 61424136 64759719 67803186 70517266 72941852 75150937 77159673 78916693
2323.1G8916693J490909J321190J242626J132727J001626R56946R62210R32104Q48978
$$ 78916693 80407602 81728792 82971418 84104145 85105771 86062717 87024927 87957031 88806009
2341.5H8806009O55079L28857K18338N66280J101303J426929J398587J231718J009166
$$ 88806009 89461088 89789945 90008283 90574563 91675866 93102795 94501382 95733100 96742266
2359.9I6742266P62189N62668L97163K65545K03198J75548J74254J82950J76323J81132
$$ 96742266 97504455 98067123 98464286 98729831 98933029 99108577 99282831 99465781 99642104 99823236
2380.2I9823236K28513L11124L87800M27043M34196M15457L77833L42501L15177K91479
$$ 99823236 100051749 100362873 100750673 101177716 101611912 102027369 102405202 102747703 103062880 103354359
2400.6A03354359K65014K33805K09320J97672J85025J71256J66619J58095J40727J23787
$$ 103354359 103619373 103853178 104062498 104260170 104445195 104616451 104783070 104941165 105081892 105205679
2421A05205679J14834J10638R9278Q8727Q7715Q6069Q3184Q5127Q2338P1669O2811
$$ 105205679 105320513 105431151 105530429 105619156 105706871 105792940 105876124 105961251 106043589 106115258 106178069
2443.5A06178069O0153O1011N6994N0474N5849O9523O8891N6243M5609L4905K9302
$$ 106178069 106238222 106299233 106356227 106406701 106462550 106532073 106600964 106657207 106702816 106737721 106767023
2465.9A06767023K3806J7905K6047L8135L9184L0721J8072J4329J9514J4997M613P99
$$ 106767023 106790829 106808734 106834781 106872916 106912100 106942821 106960893 106975222 106994736 107009733 107014346 107015145
2490.4A07015145M232Q988J0932Q118Q10L207O116l791n281L636L481p04j824k002
$$ 107015145 107019377 107028365 107039297 107047415 107048225 107051432 107057548 107053757 107048476 107052112 107055593 107054889 107053065 107051063
2518.9A07051063J609K074p105q309O414J2994Q750L683q452j7011q845K289K753J037
$$ 107051063 107052672 107054746 107047641 107039332 107045746 107058740 107067490 107071173 107062721 107045710 107036865 107039154 107041907 107042944
2547.5A07042944j967r965j3221p689l028m291p093p856q249p212p141j6117k3651
$$ 107042944 107040977 107031012 107017791 107010102 107007074 107002783 106995690 106987834 106979585 106972373 106965232 106949115 106925464
2574A06925464k1983j7094j7429k9802m0769m2427n1200n7221l4892K491L4380N0080
$$ 106925464 106903481 106886387 106868958 106839156 106798387 106755960 106704760 106647539 106612647 106615138 106649518 106699598
2598.5A06699598M7636L8981L0077J9026Q702M280J978L422P021Q798M804r954j8835
$$ 106699598 106747234 106786215 106816292 106835318 106844020 106848300 106850278 106853700 106860721 106869519 106874323 106864369 106845534
2625A06845534p522J3852J7488J31j1361j1551m280M793L838L839M470n817j6594j6487
$$ 106845534 106838012 106851864 106869352 106869483 106858122 106846571 106842291 106847084 106850922 106854761 106859231 106853414 106836820 106820333
2653.5A06820333n352J645k63r250k0778j3161K885p75j2827j7464k1768k3162q667
$$ 106820333 106814981 106816626 106816363 106807113 106786335 106773174 106776059 106775284 106762457 106744993 106723225 106700063 106691396
2680.1A06691396J8621L4857K7918J1516k384j3137k2113k5237j3065M899N269p784
$$ 106691396 106710017 106744874 106772792 106784308 106781924 106768787 106746674 106721437 106708372 106713271 106718540 106710756
2704.5A06710756j8156j9085j1444k682j038m768j1301k6560l8671l1555K062L6002
$$ 106710756 106692600 106673515 106662071 106659389 106658351 106653583 106642282 106615722 106577051 106545496 106547558 106583560
2729A06583560L2687J1205m291m757J2291K2673J0777j6618l1662q213K5701K5940
$$ 106583560 106616247 106627452 106623161 106618404 106630695 106653368 106664145 106647527 106615865 106607652 106633353 106659293
2753.5A06659293N341j991L231J3172K0290J0418l349q250k5415l6967J466M3285K7049
$$ 106659293 106664634 106662643 106665874 106679046 106699336 106709754 106706405 106698155 106672740 106635773 106637239 106680524 106707573
2780A06707573m244p248k1243m9901l2532J0264N698k7883k3627J5247K7179n96l7098
$$ 106707573 106703329 106696081 106674838 106624937 106592405 106602669 106608367 106580484 106556857 106572104 106599283 106598687 106561589
2806.5A06561589o4683n2738j3471m136k2245l4689m1199n7435p0119p6389r7192j26958
$$ 106561589 106496906 106444168 106430697 106426561 106404316 106369627 106328428 106270993 106200874 106124485 106027293 105900335
2831A05900335j52421j72829j81556j22202j0406K7787j8286m9496l1412k0790n2333
$$ 105900335 105747914 105575085 105393529 105271327 105260921 105288708 105270422 105220926 105189514 105168724 105116391
2853.4A05116391q2540p9954m7219m601P093r346j6368m1163r1004o6578K0647L0934
$$ 105116391 105033851 104953897 104906678 104902077 104909170 104899824 104883456 104842293 104751289 104684711 104705358 104736292
2877.9A04736292k7871p0202r0504j01650j23167j45459j56736j75762j66583j24956
$$ 104736292 104708421 104638219 104547715 104446065 104322898 104177439 104020703 103844941 103678358 103553402
2898.3A03553402j28305j69181j76800j68144j89507k18249j94812j12831m5467k4271
$$ 103553402 103425097 103255916 103079116 102910972 102721465 102503216 102308404 102195573 102150106 102125835
2918.7A02125835o485R394P713j2994k5046J2660L2890q404m7743p7320j37198j88374
$$ 102125835 102119350 102128744 102136457 102123463 102098417 102111077 102143967 102135563 102087820 102010500 101873302 101684928
2943.2A01684928j73068j17827q3220q9383p1168j430N0855O8640R7776J56116J95217
$$ 101684928 101511860 101394033 101310813 101221430 101150262 101148832 101199687 101268327 101366103 101522219 101717436
2965.6A01717436J79231J47212J22380J02353R6381P1848M2021Q0561J49906J72460
$$ 101717436 101896667 102043879 102166259 102268612 102364993 102436841 102478862 102559423 102709329 102881789
2986A02881789J55139J15562Q3410P8261N1832L1055M3392L0374K4998M6230J8871
$$ 102881789 103036928 103152490 103235900 103314161 103365993 103397048 103440440 103470814 103495812 103542042 103560913
3008.4A03560913l5215l1328R692J8322j5783p0000j28257j23608k8014M7040N9962
$$ 103560913 103525698 103494370 103504062 103522384 103506601 103436601 103308344 103184736 103156722 103203762 103263724
3030.9A03263724N6028P5615P9989l3891j38664o5863R7274J84965J42622J02365J37258
$$ 103263724 103319752 103395367 103475356 103441465 103302801 103236938 103334212 103519177 103661799 103764164 103901422
3053.3A03901422J36209J05369R4628L8481m3547o6674J6224J47331J84321J22345
$$ 103901422 104037631 104143000 104237628 104276109 104232562 104165888 104182112 104329443 104513764 104636109
3073.7A04636109M5252J6021P5090J46509J50764J30927J07598Q9980J16515J24025
$$ 104636109 104681361 104697382 104772472 104918981 105069745 105200672 105308270 105398250 105514765 105638790
3094.1A05638790O3360k670p010M3225N1654o640k2602L4928L8457m5645p6747k0302
$$ 105638790 105702150 105699480 105692470 105735695 105787349 105780709 105758107 105793035 105831492 105785847 105709100 105688798
3118.6A05688798N1129R7084Q2541K3186j1146J4937N1224L3772j5485j4246N9414
$$ 105688798 105739927 105837011 105919552 105942738 105931592 105946529 105997753 106031525 106016040 106001794 106061208
3141A06061208J07396Q2421M1712r132n0127k98Q5902R0480L9661K050l469N925L993
$$ 106061208 106168604 106251025 106292737 106283605 106233478 106233180 106319082 106409562 106449223 106451273 106447804 106453729 106457722
3167.5A06457722l826p487p665j3411k2078j6212J31M602J013J3959K9600K6846J7834
$$ 106457722 106453896 106446409 106438744 106425333 106403255 106387043 106387174 106391776 106392789 106406748 106436348 106463194 106481028
3194A06481028J9061K8944K5022J1552R143J8465L3010K8729M160m243m268k0600j8775
$$ 106481028 106500089 106529033 106554055 106565607 106574750 106593215 106626225 106654954 106659114 106654871 106650603 106630003 106611228
3220.5A06611228K384L672q679l2913q3793r7560j5617N2178K9898r120l8564p7367
$$ 106611228 106613612 106617284 106608605 106575692 106491899 106394339 106378722 106430900 106460798 106451678 106413114 106335747
3245A06335747p0548j812K6238j6725m3654m924L6538K0397j1623l0864o8807r2650
$$ 106335747 106265199 106263387 106289625 106272900 106229246 106224322 106260860 106281257 106269634 106238770 106169963 106077313
3269.5A06077313k8669M9769M9389J7953l064k1064k8217k5725m7636q8251q9002m5919
$$ 106077313 106048644 106098413 106147802 106165755 106162691 106141627 106113410 106087685 106040049 105951798 105862796 105816877
3294A05816877J860K7883l028p8857j27101r4545j061O1500M8602O532k3269l2342
$$ 105816877 105818737 105846620 105843592 105764735 105637634 105543089 105542028 105603528 105652130 105658662 105635393 105603051
3318.4A05603051l9148p5174r6476m0626J4818o903m6384q2183j23882r9135k6285
$$ 105603051 105563903 105488729 105392253 105351627 105366445 105359542 105313158 105230975 105107093 105007958 104981673
3340.9A04981673k146k0516o1929j06943o3348L4082M9353K098k5296r179M649m7577
$$ 104981673 104979527 104959011 104897082 104790139 104726791 104760873 104810226 104812324 104787028 104777849 104782498 104734921
3365.4A04734921r8025n2560M2630N5611k3270p0286o4659n7065n5612o9665j08445
$$ 104734921 104636896 104584336 104626966 104682577 104659307 104589021 104524362 104467297 104411685 104342020 104233575
3387.8A04233575j33348p0870L4607M6539k9456m3571P9870J94597J69849J05405R2328
$$ 104233575 104100227 104029357 104063964 104110503 104081047 104037476 104117346 104311943 104481792 104587197 104679525
3410.2A04679525J12879J60718J95301J66356J35935J37162J11306N1426K0242N7268
$$ 104679525 104792404 104953122 105148423 105314779 105450714 105587876 105699182 105750608 105770850 105828118
3430.6A05828118O4898J4424O3884J93465K10619J20127N2441L3903L6120L2854K9278
$$ 105828118 105893016 105907440 105971324 106164789 106375408 106495535 106547976 106581879 106617999 106650853 106680131
3453.1A06680131L9566J1789l2282J2017L5274q6904j48678L0887K43497K21181M8685
$$ 106680131 106719697 106731486 106699204 106711221 106746495 106659591 106510913 106541800 106785297 107006478 107055163
3475.5A07055163p5066n3262P1907Q0025j9789j8692L6454J4353m6384p4160l7837
$$ 107055163 106980097 106926835 106998742 107078767 107058978 107040286 107076740 107091093 107044709 106970549 106932712
3497.9A06932712l82j5652J9133P4661L9732l1459p1144m3643K4593M7636M292n2142
$$ 106932712 106932330 106916678 106935811 107010472 107050204 107018745 106947601 106903958 106928551 106976187 106980479 106928337
3522.4A06928337m0853K2661L0685l731k3246m6456m2963L052J31l9208j8692L3176
$$ 106928337 106887484 106910145 106940830 106937099 106913853 106867397 106824434 106827486 106827617 106788409 106769717 106802893
3546.9A06802893M4441K9778K3508J1838j0991k1148M637P3362J02293p820j12355
$$ 106802893 106847334 106877112 106900620 106912458 106901467 106880319 106884956 106958318 107060611 107052791 106940436
3569.3A06940436n4800J6534J1921k1398m0472k5188K2029P1025O0976j1492j5461
$$ 106940436 106885636 106902170 106914091 106892693 106852221 106827033 106849062 106920087 106981063 106969571 106954110
3591.7A06954110L6478J2207o0129o2144j7822L0434O9356M8304n818k7835l0542J0276
$$ 106954110 106990588 107002795 106942666 106880522 106862700 106893134 106962490 107010794 107004976 106977141 106946599 106956875
3616.2A06956875J8347o1119n6553O1548J61981O3682j75941j74510q3924o1452o7663
$$ 106956875 106975222 106914103 106857550 106919098 107081079 107144761 106968820 106794310 106710386 106648934 106581271
3638.7A06581271o2955j5306P9798J45150K753k18343j56069p5102j45304j72651p9143
$$ 106581271 106518316 106503010 106582808 106727958 106730711 106512368 106356299 106281197 106135893 105963242 105884099
3661.1A05884099R835N3251R5582R0789J8752J0383l6931j46198j34778p9668q201
$$ 105884099 105893934 105947185 106042767 106133556 106152308 106162691 106125760 105979562 105844784 105765116 105756915
3683.5A05756915O7412O2871n579m2235n0295k0861N4240Q7094L0100j0168L6192J02758
$$ 105756915 105824327 105887198 105881619 105839384 105789089 105768228 105822468 105909562 105939662 105929494 105965686 106068444
3708A06068444Q8132m8304j09804j8036Q8096J37567J31309Q6367L7003M9818J07514
$$ 106068444 106156576 106108272 105998468 105980432 106068528 106206095 106337404 106423771 106460774 106510592 106618106
3730.4A06618106J31905M4883j19508j17528O3050K13861J49632J2576N0378j5700
$$ 106618106 106750011 106794894 106675386 106557858 106620908 106834769 106984401 106996977 107047355 107031655
3750.8A07031655j72782j10674M864J073l7217J3232M8649J1588l8159o7663m0746
$$ 107031655 106858873 106748199 106753063 106754136 106716919 106730151 106778800 106790388 106752229 106684566 106643820
3773.3A06643820J2409J8895j2600k623K0993l231l9851m1211J5056Q2290Q9419R2495
$$ 106643820 106656229 106675124 106662524 106659901 106680894 106677663 106637812 106596601 106611657 106693947 106783366 106875861
3797.7A06875861R9528r728r1183n6946o3444l9911N8782J12963P2288O0940N3346
$$ 106875861 106975389 106965661 106874478 106817532 106754088 106714177 106772959 106885922 106958210 107019150 107072496
3820.2A07072496n5539q0335j9694J9777N3692P8797Q7405Q6939K5904p3266j09982
$$ 107072496 107016957 106936622 106916928 106936705 106990397 107069194 107156599 107243538 107269442 107196176 107086194
3842.6A07086194r4009l338J55139K78557J66118j89603k20155n9951M0317N5146K1648
$$ 107086194 106992185 106988847 107143986 107422543 107588661 107399058 107178903 107118952 107159269 107214415 107236063
3865A07236063M1724M9150l1591q6176o4027J9908O8306J4294l4130m8435j1933M6313
$$ 107236063 107277787 107326937 107295346 107209170 107145143 107165051 107233357 107247651 107213521 107165086 107153153 107199466
3889.5A07199466J2267l5334J2398P8094Q6319L5179n4216j19424q7536j7774K3377
$$ 107199466 107211733 107176399 107188797 107266891 107353210 107388389 107334173 107214749 107127213 107109439 107132816
3912A07132816L8827L9005K1184O532J5307J7869m887j9312j3888j6248k2400k086
$$ 107132816 107171643 107210648 107231832 107238364 107253671 107271540 107266653 107247341 107233453 107217205 107194805 107192719
3936.4A07192719L8183N1403J1134j5688K15k599k1494k6083j9502j8192j8537J800
$$ 107192719 107230902 107282305 107293439 107277751 107277966 107275367 107253873 107227790 107208288 107190096 107171559 107173359
3960.9A07173359J9718Q392m041K730N841O509Q023o676k1100k7430j9682J1134K9135
$$ 107173359 107193077 107201469 107197428 107200158 107205999 107212508 107220531 107213855 107192755 107165325 107145643 107156777 107185912
3987.4A07185912J3316q130j7834j6272l517
$$ 107185912 107199228 107191098 107173264 107156992 107153475
3997.6A07153475
$$ 107153475
##END=$$ End of the data block
