##TITLE=ISO PUBD-18 $$ Begin of the data block
##JCAMP-DX=5.00 $$ ACD/SpecManager v 10.08
##SPECTROMETER/DATA SYSTEM=Alpha
##DATE=07 Jun 2016 08:10:34
##DATA TYPE=INFRARED SPECTRUM
##DATA CLASS=XYDATA
##ORIGIN=
##OWNER=
##NPOINTS=1667
##FIRSTX=599.64648438
##LASTX=3997.64306641
##MAXX=3997.64306641
##MINX=599.64648438
##MAXY=1.11070168
##MINY=0.52270573
##XFACTOR=1.0000000000
##YFACTOR=0.000000010000000
##FIRSTY=1.01894593
##DELTAX=2.03961372
##XUNITS=1/CM
##YUNITS=ARBITRARY UNITS
##XYDATA=(X++(Y..Y))
599.6A01894593l2377o6590j00375j23703j16646r0313q4436j08791q4078j5533L3295
622.1A01105046Q3757J57368K45464L03292K98822K32744J18470Q59l9995N0712K13193
644.5A02769732K91420K47681J94251J61088J13249P4934P2182O5326M4454k3616j60670
667A03850031n7709J78528J06441l09j8585l9578o6244p4327q9026q4698k7978K9146
691.4A03705692N1081O4850P5746P1514P1680P2336N8461N3238O5184P2146N0997j335
715.9A04411590n3120n6493k9719k4175l8481l0649J8120N9903O5910M2677k467n6541
740.4A04306555j17052j95789k76530l16417l02553k14756l7908J69944L01290K97880
760.8A03614664K10500J25682Q6129R5141J11294Q2004K4652j5735l6681n3179p2885
$$ y = [101894593, 101862216, 101795626, 101695251, 101571548, 101454902, 101364589, 101280153, 101171362, 101087284, 101071751, 101105046, 101188803, 101346171, 101591635, 101894927, 102193749, 102426493, 102544963, 102545822, 102505827, 102556539, 102769732, 103061152, 103308833, 103503084, 103664172, 103777421, 103852355, 103924537, 103989863, 104034317, 104010701, 103850031, 103792322, 103970850, 104077291, 104076982, 104058397, 104018819, 103952575, 103878248, 103789222, 103704524, 103676546, 103705692, 103756773, 103821623, 103897369, 103968883, 104040563, 104112899, 104171360, 104224598, 104289782, 104361928, 104412925, 104411590, 104358470, 104301977, 104272258, 104248083, 104209602, 104178953, 104197073, 104256976, 104322886, 104365563, 104363096, 104306555, 104189503, 103993714, 103717184, 103400767, 103098214, 102883458, 102845550, 103015494, 103316784, 103614664, 103825164, 103950846, 104036975, 104132116, 104243410, 104325414, 104350066, 104334331, 104297650, 104244471, 104171586]
783.2A04171586r6750j37592k34878m33576q00478j410234k101630k223075j226186
801.6I5507187K26980Q10140K40702o02675r37545p00766j93482L19916O61438P85089
822I6116984P84588P60483P43342P25311O89948O09487M92024L69668K52152J48856
842.4A01692843N3144p5078k58792m33301m74549l32856r3496J03045J91617K16853
862.8A00589430K67470L84248N18047N96166N90825N14531L98147K90060K15233J59287
883.2A04523444J07098N3072R30m0365p4863j16479j65594k11883k39539k45726k30551
905.6A03359544k07817k22051k82777l34179k82717j13535N1999J16575J03652P3982
926A02262676N4824M1580L8231N0378O2978P9429J25742K04122K71416K98404K83742
$$ y = [104171586, 104074836, 103937244, 103702366, 103268790, 102468312, 101058078, 98956448, 96733373, 95507187, 95734167, 96544307, 96785009, 96182334, 95244789, 94544023, 94350541, 94670457, 95331895, 96116984, 96901572, 97662055, 98405397, 99130708, 99820656, 100430143, 100922167, 101291835, 101543987, 101692843, 101745987, 101670909, 101412117, 100978816, 100504267, 100171411, 100077915, 100180960, 100372577, 100589430, 100856900, 101241148, 101759195, 102355361, 102946186, 103460717, 103858864, 104148924, 104364157, 104523444, 104630542, 104683614, 104684544, 104644179, 104569316, 104452837, 104287243, 104075360, 103835821, 103590095, 103359544, 103151727, 102929676, 102646899, 102312720, 102030003, 101916468, 101968467, 102085042, 102188694, 102262676, 102317500, 102359080, 102397311, 102447689, 102510667, 102590096, 102715838, 102919960, 103191376, 103489780, 103773522]
948.4A03773522K34759J79720J32287R0587O5935O8986Q2171Q2850P4208O8212O5243
970.9A04918480O7377O6197M7898L1650J5497j3959l9327n8782p7450q7643j00637
993.3A04769301j26171j50108j78230k35271l09408l77512m39525m81939n33509q40616
1013.7A01097012j376951j047808N66155J739549J459825P26152L13222J36638K9051
1032A03642845n1403j18935j83439k36976k80238l13484l39663l70777l94452m06384
1052.4A00947094m30679m66419m99743n37652n95528o51425o79147o99693p30800p67106
1072.8I4888902p89225p88755p98988q27324q47382q69351r10181r56494r94402j035696
1093.2H6071104j091373j140571j151413j104640j002181q25864m95631J7190N72443
$$ y = [103773522, 104008281, 104188001, 104320288, 104410875, 104476810, 104545796, 104627967, 104710817, 104785025, 104853237, 104918480, 104985857, 105052054, 105099952, 105131602, 105147099, 105133140, 105093813, 105035031, 104957581, 104869938, 104769301, 104643130, 104493022, 104314792, 104079521, 103770113, 103392601, 102953076, 102471137, 101937628, 101097012, 99720061, 98672253, 99238408, 100977957, 102437782, 103163934, 103477156, 103613794, 103642845, 103591442, 103472507, 103289068, 103052092, 102771854, 102458370, 102118707, 101747930, 101353478, 100947094, 100516415, 100049996, 99550253, 99012601, 98417073, 97765648, 97086501, 96386808, 95656008, 94888902, 94099677, 93310922, 92511934, 91684610, 90837228, 89967877, 89057696, 88101202, 87106800, 86071104, 84979731, 83839160, 82687747, 81583107, 80580926, 79755062, 79259431, 79276621, 79849064]
1111.6G9849064R68999J146412J191199J174468J104295R80472Q05349N97029M11052
1129.9H8228339K85208K02954J49012J36780J67549K33585L39305M73583O15388P44998
1150.3I1576701Q46380R15581R54533R61095R26161Q62902P97302P34240O65241N84686
1170.7I9824822M91428L74520K39301J73104K59816M22693N11324M84288L99744L05283
1191.1A03486323K17820J40416M8530q2159k18701k75898k08247n3417Q3696Q2136
1211.5A03220499o1918k41589l78478m22668l46494j85108N042J70756K62534K62761
1231.9A02285337K01452J32430R2292P8809P7796Q7047R3591R0718Q8549R0503R3651
1254.4A03412175R7656J02437R7680P9024N7149L9458K9194K1255L720k4641n2488
$$ y = [79849064, 80818063, 81964475, 83155674, 84330142, 85434437, 86414909, 87220258, 87817287, 88228339, 88513547, 88716501, 88865513, 89002293, 89169842, 89403427, 89742732, 90216315, 90831703, 91576701, 92423081, 93338662, 94293195, 95254290, 96180451, 97043353, 97840655, 98574895, 99240136, 99824822, 100316250, 100690770, 100930071, 101103175, 101362991, 101785684, 102297008, 102781296, 103181040, 103486323, 103704143, 103844559, 103893089, 103810930, 103592229, 103316331, 103108084, 103054667, 103138363, 103220499, 103158581, 102916992, 102538514, 102115846, 101769352, 101584244, 101589286, 101760042, 102022576, 102285337, 102486789, 102619219, 102711511, 102790320, 102868116, 102955163, 103048754, 103139472, 103228021, 103318524, 103412175, 103509831, 103612268, 103709948, 103788972, 103846121, 103885579, 103914773, 103936028, 103939748, 103915107, 103862619]
1276.8A03862619p5078j03867j37925j47366j29021j45053k49982l83318l72803j35660
1297.2A01982546J49059K57528K04194J24573P5090N8425P2097J04166J50823K15387
1317.6A03393888K80607L01326K63083J89363Q6821k9636j33240k17736k88284l36289
1338A03509903l10946k25937j64592j03879J5771J62053K52688K62392K11477Q2052
1358.4A03690982j34480l85559o34587r30106j203847j180613p28142J06573R07886
1376.7I9508107J201319J067830P70926M97663L62968L57461L11411K01297J34706
1395.1A04413688J24777J30307J17493L3629p0143j64473l27539m83239m27449j27971
1415.5A03219080L06094P17258O81210L40378O0213j87040m13489n11575m95839m42767
$$ y = [103862619, 103787541, 103683674, 103545749, 103398383, 103269362, 103124309, 102874327, 102491009, 102118206, 101982546, 102131605, 102389133, 102593327, 102717900, 102792990, 102851415, 102923512, 103027678, 103178501, 103393888, 103674495, 103975821, 104238904, 104428267, 104515088, 104485452, 104352212, 104134476, 103846192, 103509903, 103198957, 102973020, 102808428, 102704549, 102720320, 102882373, 103135061, 103397453, 103608930, 103690982, 103556502, 103170943, 102536356, 101606250, 100402403, 99221790, 98493648, 98600221, 99508107, 100709426, 101777256, 102548182, 103045845, 103408813, 103766274, 104077685, 104278982, 104413688, 104538465, 104668772, 104786265, 104819894, 104749751, 104585278, 104257739, 103774500, 103347051, 103219080, 103525174, 104242432, 104923642, 105264020, 105324233, 105137193, 104723704, 104212129, 103716290, 103273523]
1435.9A03273523k74658j42789j70839k16115k16639j70219q8644l9160o2156n2297
1456.3A01840007J54746K95019K64108K90346L58749K96688J71447J16193J55973K35403
1476.7A04178679L18146L37660K84445J77551N5074r679J4174r18j51730l18921m00435
1499.1A04484046m88973o91474j168036j678813j321733r81813j088631j404518j781023
1517.5I3879032j964897j972383j340258l60978M67396J028466J441181J925301J873529
1535.8I4976389J587373J794070J770616J354384J134181R35519P53677N86200M15122
1554.2A05307531K33639J57976L34644L04735R5296p0906k91026o09994q64315j037788
1574.6A03559792p87604J63973R08577J107669Q31151L89624O5088j42157k77174l55160
$$ y = [103273523, 102998865, 102856076, 102685237, 102469122, 102252483, 102082264, 101993620, 101954460, 101892304, 101840007, 101994753, 102289772, 102553880, 102844226, 103202975, 103499663, 103671110, 103787303, 103943276, 104178679, 104496825, 104834485, 105118930, 105296481, 105351555, 105341876, 105356050, 105355132, 105203402, 104884481, 104484046, 103995073, 103303599, 102135563, 100456750, 99135017, 98153204, 97064573, 95660055, 93879032, 91914135, 89941752, 88601494, 88240516, 88707912, 89736378, 91177559, 93102860, 94976389, 96563762, 98357832, 100128448, 101482832, 102617013, 103552532, 104306209, 104892409, 105307531, 105541170, 105699146, 106033790, 106338525, 106433821, 106362915, 106071889, 105461895, 104597580, 103559792, 102772188, 102936161, 103844738, 104952407, 105783558, 106173182, 106238270, 106096113, 105818939, 105463779]
1595A05463779m05622m81236o26063q63421j122904j089275m37307N57780J170612
1613.4A02166343J350748J310599Q90935M99785L46279K55489J77324J37877O3908
1631.7A07199287n1570n4740R8133J32155M8399n3668r5856J9085O0869n6768J7405
1654.1A07262731K06458J53446M8316J3745K9039p63n8758m1878J621n686K312j442
1678.6A07609141p4995j56986q1098Q0418O5196j586o9499j54555j65462j48702j24740
1701.1A06777132r1327j61528k21277k40743l01861l72017m41635m58133l40199l01600
1721.5A03846812l92902m15516l31354j89459L5548M35913P81345P38120P01952O64497
1741.9A05874956N32639M11391K94805K23636K32899J95074J03105O8080N3000M1497
$$ y = [105463779, 105058157, 104576921, 103950858, 103087437, 101964533, 100875258, 100437951, 100995731, 102166343, 103517091, 104827690, 105718625, 106218410, 106564689, 106820178, 106997502, 107135379, 107199287, 107147717, 107092977, 107191110, 107323265, 107371664, 107317996, 107222140, 107241225, 107302094, 107245326, 107262731, 107469189, 107622635, 107670951, 107684696, 107713735, 107712972, 107654214, 107612336, 107613957, 107608271, 107610583, 107609141, 107534146, 107377160, 107296062, 107376480, 107441676, 107440090, 107370591, 107216036, 107050574, 106901872, 106777132, 106685805, 106524277, 106303000, 106062257, 105760396, 105388379, 104946744, 104488611, 104148412, 103846812, 103453910, 103038394, 102707040, 102517581, 102553129, 102989042, 103770387, 104508507, 105210459, 105874956, 106407595, 106818986, 107113791, 107337427, 107570326, 107765400, 107868505, 107936585, 107989585, 108031082]
1762.2A08031082M3106l826o4242q9217p1585k5928j6296j2755L3164P0143P5865Q3899
1786.7A08053410M7863p642K9815R4831P5638K3138R358M4585O0629K9135j025J2112
1811.2A08471847L4713K0957J252N519K575k0837k7764j9491o938L6669N2726K0754
1835.7A08571982M435p224m2248m2736J8024M5514K8312J4139P462J311p224j1885
1860.2A08579862j4639l0374o2526o5875j2898J8573j55j8239j8525j2529j1862j8859
1884.6A08331954l1197m4965l9554l3975m3428l8325k3103j3375n329O831K3985M5907
1909.1A08135426O3169N6863K9325K1446N0604N8640M0113L8982M5454M1807K8300
1931.5A08610129J7119J8668J6689j144j1742J0073L0351J9776P952P844L969J812
$$ y = [108031082, 108074188, 108070362, 108006120, 107916903, 107845318, 107819390, 107803094, 107790339, 107823503, 107893646, 107969511, 108053410, 108101273, 108093631, 108123446, 108218277, 108293915, 108317053, 108326411, 108370996, 108431625, 108460760, 108459735, 108471847, 108506560, 108527517, 108528769, 108534288, 108536863, 108516026, 108488262, 108468771, 108461833, 108498502, 108551228, 108571982, 108576417, 108569193, 108526945, 108484209, 108502233, 108547747, 108576059, 108590198, 108597660, 108598971, 108591747, 108579862, 108565223, 108534849, 108472323, 108406448, 108393550, 108412123, 108411968, 108393729, 108375204, 108362675, 108350813, 108331954, 108300757, 108255792, 108216238, 108182263, 108138835, 108100510, 108077407, 108064032, 108058703, 108065534, 108089519, 108135426, 108198595, 108255458, 108284783, 108306229, 108356833, 108415473, 108455586, 108494568, 108540022, 108581829, 108610129, 108627248, 108645916, 108662605, 108661461, 108649719, 108659792, 108690143, 108709919, 108717871, 108725715, 108729684, 108731496]
1956A08731496N281j31m613n031o652Q476K7430K4366J0622O104R024O127J407L230
1984.6A08817136O378O282M578O509R572Q357P355R787J0717Q345N066O92M243O760
2013.1A08911777p141j2887K540J2731Q881R179J5295J4138L123q523p022m339j9324
2039.6A08918428k9063k0516j3840j4841k4844l2448l2521m0936n0676n9819o9225
2062.1A08529699o3980m8792m1056m2689l7300j6380Q345K5046L0184K4914K4260L3068
2086.6A08425319L8433M0865L2795J6224J4508K0993K3710K1816N543j0872j3304j6308
2111A08599722k6691m8947p1061p4553p9978j00290j27590j52481j67048j86574k03908
2133.5A07360601k12812k34008k43652k33793k29561k10524j71459j51920j49441j36530
$$ y = [108731496, 108736777, 108736646, 108732033, 108727002, 108720350, 108728826, 108756256, 108780622, 108791244, 108797348, 108806372, 108812499, 108813906, 108817136, 108823514, 108829796, 108834374, 108840883, 108850455, 108858812, 108866167, 108875954, 108886671, 108895016, 108900082, 108900774, 108905017, 108911777, 108904636, 108891749, 108894289, 108907020, 108915901, 108925080, 108940375, 108954513, 108957636, 108949113, 108942091, 108937752, 108918428, 108889365, 108868849, 108855009, 108840168, 108815324, 108782876, 108750355, 108709419, 108658743, 108598924, 108529699, 108465719, 108416927, 108375871, 108333182, 108295882, 108279502, 108287847, 108312893, 108343077, 108367991, 108392251, 108425319, 108463752, 108504617, 108537412, 108553636, 108568144, 108589137, 108612847, 108634663, 108640206, 108629334, 108616030, 108599722, 108573031, 108524084, 108453023, 108378470, 108298492, 108198202, 108070612, 107918131, 107751083, 107564509, 107360601, 107147789, 106913781, 106670129, 106436336, 106206775, 105996251, 105824792, 105672872, 105523431, 105386901]
2153.9A05386901j27208j32454j44350j73235k07687k13194j96039j81198j68801j49035
2174.3A03693700j36244j48726j77836k09272k32029k53165k89667l32951l67403l91889
2194.6A01154518m05562m17220m31520m35364m33237m36651m47792m63677m87452n24790
2215I6671253n76889o53601p62450r09228j104742j354009j649731j981169k327693
2233.4H5351741k658128k935982l119236l165925l042811k769196k400816j994174
2249.7F3265473j628328j366967j214242j149445j132322j105892j028079q86393o95658
2268.1E3058147m75692k57898n3984J48046L51859N70535Q17222J080584J351422J637024
2288.5E8227265J917529K159774K354330K505636K601481K624064K571166K462959
$$ y = [105386901, 105259693, 105127239, 104982889, 104809654, 104601967, 104388773, 104192734, 104011536, 103842735, 103693700, 103557456, 103408730, 103230894, 103021622, 102789593, 102536428, 102246761, 101913810, 101546407, 101154518, 100748956, 100331736, 99900216, 99464852, 99031615, 98594964, 98147172, 97683495, 97196043, 96671253, 96094364, 95440763, 94678313, 93769085, 92664343, 91310334, 89660603, 87679434, 85351741, 82693613, 79757631, 76638395, 73472470, 70429659, 67660463, 65259647, 63265473, 61637145, 60270178, 59055936, 57906491, 56774169, 55668277, 54640198, 53753805, 53058147, 52582455, 52324557, 52270573, 52418619, 52770478, 53341013, 54158235, 55238819, 56590241, 58227265, 60144794, 62304568, 64658898, 67164534, 69766015, 72390079, 74961245, 77424204]
2304.8G7424204K314335K120632J901973J682031J456910J230633J031191Q81904P84600
2323.1I0828413O88988N77146N11241M97984M83793M51869M25410M16810M17119M48501
2343.5I5747274N29987M91661L08346J72830J52349K04975L16477M22811M67348N14561
2363.9I9328619N79280O12688O17230O13367O05274N98359N81920N46253N00846M45020
2384.3A05028856L82137L24261K73311K38026K23124K09593J83142J56712J47522J45280
2404.7A07311964J25110J02925J03760J06931R4783Q7714Q7584P2860O2251O8534O6614
2427.2A08291030N6851N6028N9939O0415N1927M0460M0639M0769L4762M0149N0247
2449.6A08823216M6718M1235M1329L5370K9230L2711L5346K9981K4557K2900K3448
$$ y = [77424204, 79738539, 81859171, 83761144, 85443175, 86900085, 88130718, 89161909, 90043813, 90828413, 91517401, 92094547, 92605788, 93103772, 93587565, 94039434, 94464844, 94881654, 95298773, 95747274, 96277261, 96768922, 97077268, 97250098, 97402447, 97607422, 97923899, 98346710, 98814058, 99328619, 99907899, 100520587, 101137817, 101751184, 102356458, 102954817, 103536737, 104082990, 104583836, 105028856, 105410993, 105735254, 106008565, 106246591, 106469715, 106679308, 106862450, 107019162, 107166684, 107311964, 107437074, 107539999, 107643759, 107750690, 107845473, 107933187, 108020771, 108093631, 108155882, 108224416, 108291030, 108347881, 108403909, 108463848, 108524263, 108576190, 108616650, 108657289, 108698058, 108732820, 108772969, 108823216, 108869934, 108911169, 108952498, 108987868, 109017098, 109049809, 109085155, 109115136, 109139693, 109162593, 109186041]
2472A09186041K7538K4140J2493J4567J7715Q523P188J2267J3232J5867K1100J8621
2496.5A09379292R715K432r5P927J7166J4699Q070O902N758K265O557J2564R537O104
2525.1A09488893K276l123J717J2469J4269N365r66K730L803M77j812k74P104O295
2553.6A09539223o44k277K813P976K706j252m828j9503k2721q607m709j3959k0874
2580.1A09453344k0730j8561j7130j5819j7584j5223q11J8502K4867K1124K5522L1400
2604.6A09468901K5642J0061o91M17K170n25L243P641l946j1241n96L159r346j7262
2633.2A09477627j2099n174M876J0108m148j5020q285m42L541M995j812j0634o258
2659.7A09437275j133j4770k7978j7333m172p105j2112j0693l70J5700K2710J1003
$$ y = [109186041, 109213579, 109237719, 109250212, 109264779, 109282494, 109291017, 109298205, 109310472, 109323704, 109339571, 109360671, 109379292, 109389007, 109391439, 109391344, 109399271, 109416437, 109431136, 109439206, 109446108, 109451866, 109454131, 109460688, 109473252, 109482789, 109488893, 109491169, 109488046, 109489763, 109502232, 109516501, 109521866, 109520900, 109523630, 109527433, 109527910, 109526098, 109525824, 109532928, 109539223, 109538579, 109536302, 109539115, 109547091, 109549797, 109548545, 109543717, 109524214, 109501493, 109492886, 109488177, 109474218, 109453344, 109432614, 109414053, 109396923, 109381104, 109363520, 109348297, 109347486, 109365988, 109390855, 109411979, 109437501, 109468901, 109494543, 109504604, 109503913, 109504330, 109506500, 109505975, 109509218, 109516859, 109512913, 109501672, 109501076, 109504235, 109494889, 109477627, 109465528, 109460354, 109465230, 109475338, 109471190, 109456170, 109447885, 109447443, 109450984, 109455979, 109454167, 109443533, 109437275, 109436142, 109421372, 109393394, 109376061, 109371889, 109364784, 109352672, 109341979, 109341609, 109357309, 109380019, 109391022]
2684.1A09391022p916j7977j6737j1098j0061j3650j6069j4842q618l541q309j3816
2708.6A09248388j4687k2828l1913k9313k4772k1958j8609k1839k1422n388R549N972
2733.1A09051180o783r382m840n936j0777k2495l1340j7154p248k1029l8313m9651
2757.6A08826232m4572k7192k9480m4370m1545l2198l9005m7279k5022k908k2662m3357
2782A08426642l9267l5167l5870k4915l540P51j7655k1005M29J741k0552l6931m7421
2808.6A08147240m9794m7696n8388p2563p8106r4819j28543j57917j83380k21586k76220
2831A06778228l35800l98338m49777m52864m44829m82131n28001n49412n62203n81551
2851.4A01993322o07657o15788n90336n37312m60762l73971k88403j90830q7488N329
$$ y = [109391022, 109383106, 109365129, 109348392, 109337294, 109327233, 109313583, 109297514, 109282672, 109274054, 109270513, 109262204, 109248388, 109233701, 109210873, 109178960, 109149647, 109124875, 109102917, 109084308, 109062469, 109041047, 109035659, 109045208, 109051180, 109044397, 109035015, 109030175, 109024239, 109013462, 108990967, 108959627, 108942473, 108935225, 108914196, 108875883, 108826232, 108781660, 108754468, 108724988, 108680618, 108639073, 108606875, 108567870, 108520591, 108495569, 108492661, 108469999, 108426642, 108387375, 108352208, 108316338, 108291423, 108287883, 108288634, 108270979, 108249974, 108250403, 108252144, 108231592, 108194661, 108147240, 108097446, 108049750, 107991362, 107918799, 107840693, 107745874, 107617331, 107459414, 107276034, 107054448, 106778228, 106442428, 106044090, 105594313, 105141449, 104696620, 104214489, 103686488, 103137076, 102574873, 101993322, 101385665, 100769877, 100179541, 99642229, 99181467, 98807496, 98519093, 98328263, 98240775, 98246104]
2871.8I8246104J05071J86914K07108J87832J51652J01412M4840j3500o3986j00428
2892.2I9053019j08695p9232l5566Q118N5361J01971J43981J71560J75995J67066J65283
2914.6I9818861J58340J20336O4850R5p0035j15651r4289K4087K07394L94964N45311
2937A01054263O26814O23322N57649M80557M07600L13914J97351Q1074m5633k20108
2957.4A04076803m52543p06148r02152r69553q64017n80388k09928J29772L80343N16283
2977.8A00418472N69403O08874O54018O96051P20465O98412O49273O02543N30935M44567
2998.2A06593013L64697K79557K12181J64604J11163O2621M7016O0439O4421L9279
3018.6A07998991j4031p4482p4017o080M4406N1999M7541N2631M3368j8907o3944j9669
$$ y = [98246104, 98351175, 98538089, 98745197, 98933029, 99084681, 99186093, 99230933, 99217433, 99153447, 99053019, 98944324, 98865092, 98829526, 98837644, 98893005, 98994976, 99138957, 99310517, 99486512, 99653578, 99818861, 99977201, 100097537, 100162387, 100162482, 100092447, 99976796, 99882507, 99906594, 100113988, 100508952, 101054263, 101681077, 102304399, 102862048, 103342605, 103750205, 104064119, 104261470, 104342544, 104296911, 104076803, 103624260, 102918112, 102015960, 101046407, 100182390, 99602002, 99392074, 99521846, 99902189, 100418472, 100987875, 101596749, 102250767, 102946818, 103667283, 104365695, 105014968, 105617511, 106148446, 106593013, 106957710, 107237267, 107449448, 107614052, 107725215, 107787836, 107834852, 107895291, 107959712, 107998991, 107984960, 107910478, 107836461, 107830381, 107874787, 107926786, 107974327, 108026958, 108070326, 108051419, 107987475, 107967806]
3043.1A07967806O6161J05357P9131P2468R7036P9989M6254K9182M840k4879l9649
3065.5A08483696L791Q8131J19841Q7405L4344Q738N5086J09065J05131R2470Q7202
3088A09274900P5769P2956N8330K5999K27j264K4915L7038J371k5761O974K1398k3985
3114.5A09548867m0603l302M5180P2670N0068R537P486L1543L7491J5760j0359k981
3139A09761357M4513O8295M6039K6416K063k3222J3363O8331N9509K6000N090j1146
3163.4A10086608q059K885o282j9515p558O378j871j0872j0193p593r573p617J0144
3189.9A10016882K5595K3472J4210R930J5521J6546N531P213K5832L2532J5367O687
3214.4A10215318J7023J0753l004m673o116p963k2340n4919n4992m732L1102J9633
$$ y = [107967806, 108033967, 108139324, 108218455, 108290923, 108387959, 108467948, 108514202, 108543384, 108548224, 108523345, 108483696, 108487487, 108575618, 108695459, 108782864, 108817208, 108825946, 108881032, 108990097, 109095228, 109187698, 109274900, 109350669, 109423625, 109481955, 109507954, 109508181, 109506917, 109531832, 109568870, 109570241, 109544480, 109551454, 109572852, 109548867, 109508264, 109504962, 109550142, 109622812, 109672880, 109682417, 109689903, 109721446, 109758937, 109774697, 109764338, 109761357, 109805870, 109874165, 109920204, 109946620, 109948683, 109925461, 109938824, 110007155, 110066664, 110092664, 110097754, 110086608, 110078549, 110081434, 110075152, 110055637, 110048079, 110054457, 110052586, 110041714, 110031521, 110023928, 110014355, 110006738, 110016882, 110042477, 110065949, 110080159, 110090089, 110105610, 110122156, 110127687, 110134900, 110160732, 110193264, 110208631, 110215318, 110232341, 110243094, 110240090, 110235417, 110229301, 110221338, 110198998, 110144079, 110089087, 110084355, 110115457, 110135090]
3238.9A10135090r131l1602m0424k2245O438O198j6641k0957k349L124r966k7979m0269
3265.4A09929287n2487n7495j3399K9945K0111Q678L684j4425j8179m399j1694m2987
3289.9A09776640m6337j3745K0195M7659L4857l1900p4554m0006L0315P3123O5636
3312.3A09841883K9266J2291J7988J0038j0813j5831J1123L2401J5533r811k6655m2522
3336.8A09864891m1187j5879L839Q762m411l4642j8073L3868K3484j8489j8132p665
3361.3A09776366k8754o6828p1812k6631J6617J0741k1469m3321n6207o5029o8796
3383.7A09354877o0832o6447r9743q1110K373L4821r346j9372M8184J08541R4795M7540
3408.2A09354281L7325O5672R4092R7561P1371M6277M2867M4644L4130K2852L6967
$$ y = [110135090, 110125959, 110094357, 110053933, 110031688, 110038126, 110044324, 110027683, 110006726, 110004377, 110007501, 109997535, 109969556, 109929287, 109876800, 109819305, 109805906, 109835851, 109855962, 109864640, 109868324, 109853899, 109835720, 109831321, 109819627, 109776640, 109730303, 109716558, 109736753, 109784412, 109819269, 109787369, 109712815, 109672809, 109703124, 109776247, 109841883, 109871149, 109883440, 109901428, 109911466, 109900653, 109884822, 109895945, 109928346, 109943879, 109934068, 109907413, 109864891, 109823704, 109807825, 109811664, 109820426, 109816015, 109781373, 109763300, 109797168, 109820652, 109802163, 109784031, 109776366, 109747612, 109680784, 109608972, 109582341, 109598958, 109609699, 109588230, 109544909, 109488702, 109423673, 109354877, 109294045, 109227598, 109127855, 109046745, 109049118, 109083939, 109074593, 109055221, 109103405, 109211946, 109306741, 109354281, 109391606, 109457278, 109551370, 109648931, 109720302, 109766579, 109809446, 109854090, 109888220, 109911072, 109948039]
3430.6A09948039M3273K5356M0281P5948P5471M2641J4067J6964L0076K2054J2565
3453.1A10346735J5735M709k1792j7857o306m0043n9235p605N2476N5277R835m9484
3477.5A10282445n5289K849J8644j3721q559J6677N901k2876l2568k5451k3568j5843
3502A10128641K1303L1173J931J180J4699J9395K1172N007j9634l1936j6344K3866
3526.5A10200453M9376L6180L946j8167j0217K563k5379o1083l4690M6170P8940L5227
3551A10303319P152J1182N72j3423j7571l4798o5469m2522M3344Q2338N6362J7584
3575.4A10348070j1206k5976l0327n3274p8011k0325N8901M0818J108k610K277J6105
3599.9A10245550L0386J3507k1554k7310J2J1873J1289K670k3627o878L8337J2172
$$ y = [109948039, 109991312, 110016668, 110056949, 110132897, 110208368, 110251009, 110265076, 110282040, 110312116, 110334170, 110346735, 110362470, 110367179, 110345387, 110327530, 110321224, 110281181, 110221946, 110214341, 110266817, 110322094, 110331929, 110282445, 110227156, 110230005, 110248649, 110234928, 110226369, 110243046, 110248947, 110226071, 110193503, 110168052, 110144484, 110128641, 110149944, 110181117, 110183048, 110184228, 110198927, 110218322, 110239494, 110244501, 110224867, 110192931, 110176587, 110200453, 110249829, 110286009, 110289955, 110271788, 110261571, 110264134, 110238755, 110177672, 110142982, 110189152, 110268092, 110303319, 110310471, 110321653, 110322225, 110308802, 110291231, 110256433, 110190964, 110148442, 110191786, 110274124, 110330486, 110348070, 110336864, 110310888, 110280561, 110227287, 110149276, 110128951, 110187852, 110228670, 110229778, 110227168, 110229445, 110245550, 110275936, 110289443, 110267889, 110240579, 110240591, 110252464, 110263753, 110266423, 110242796, 110235918, 110274255, 110286427]
3624.4A10286427n3883n4920K6500P2229O6662M6671J1181j9681k8813n8365j28257
3646.8A10165751j22499K5975R1267K2054k9540j3221R692P069m5347j04904q9276
3669.2A09917021l3188l3057k8682L8147N5921J9026j6904o3216j05691n1821O1644
3691.7A09759200P7819L3224Q905l147j0002K861Q94k8586l8588K9516R6834O2942
3716.2A09991872M65k6583j8239R560L7086L5346q846p1442o0701N0902J15907R3949
3740.6A10149276N0199K7323L2306J3637P332O3181P8249L6799K9719N0283L0649P629
3765.1A10576582J4174N507l600J2815J0646j0300q047J4282J4817J777k599R53R30
3791.6A10627937k5177n4681l7301n292N888K4105M0257N6231N9652K2638k7645n1606
$$ y = [110286427, 110232544, 110177624, 110204124, 110276353, 110343015, 110389686, 110400867, 110381186, 110352373, 110294008, 110165751, 110043252, 110069227, 110160494, 110182548, 110153008, 110139787, 110149479, 110156548, 110111201, 110006297, 109917021, 109883833, 109850776, 109822094, 109860241, 109916162, 109935188, 109918284, 109855068, 109749377, 109697556, 109759200, 109837019, 109870243, 109879148, 109876001, 109865999, 109868860, 109869754, 109841168, 109802580, 109832096, 109928930, 109991872, 109992337, 109965754, 109947515, 109957075, 109994161, 110029507, 110020661, 109949219, 109888518, 109939420, 110055327, 110149276, 110199475, 110226798, 110259104, 110272741, 110280073, 110343254, 110421503, 110458302, 110488021, 110538304, 110568953, 110576582, 110590756, 110596263, 110592663, 110605478, 110616124, 110605824, 110597777, 110612059, 110626876, 110628653, 110626054, 110627007, 110627937, 110602760, 110548079, 110510778, 110505486, 110511374, 110535479, 110575736, 110631967, 110691619, 110714257, 110686612, 110635006]
3816.1A10635006m7850l2818K8181O6161L2198J2100J2660l421k5487k8634p534K3758
3840.6A10664320N4955N7567K4879j8740n4979m5371J4627N5241N8508K4533j1933
3863A10823607j3375n472q654j800K4986L2377O271k6310k6083L600K3759L6275K3484
3889.5A10892665l731N925J2410k4450n0509l4511J275O0821R3198N5408k229l0923
3914A10975349k2829J610J4555Q476M184J1695L159q238R454L5917K4009j8656l8445
3940.5A11000240r835K7955J1789j4627k253J6582K6918J3399j2326j7405q559J0431
3965A11042309J7500j1122l0840j6260Q678J4997L731M375j55o854N698P188p951q083
3993.5A11023211Q369K0492
$$ y = [110635006, 110587156, 110554338, 110582519, 110648680, 110680878, 110692978, 110705638, 110702217, 110676730, 110648096, 110640562, 110664320, 110719275, 110776842, 110801721, 110782981, 110728002, 110682631, 110697258, 110752499, 110811007, 110835540, 110823607, 110810232, 110804760, 110796106, 110794306, 110819292, 110851669, 110857940, 110831630, 110805547, 110809147, 110832906, 110869181, 110892665, 110888934, 110894859, 110907269, 110882819, 110832310, 110797799, 110799074, 110859895, 110953093, 111008501, 111006272, 110975349, 110952520, 110954130, 110968685, 110977161, 110981345, 110993040, 110996199, 110987961, 110997415, 111033332, 111057341, 111038685, 111000240, 110990405, 111018360, 111030149, 111015522, 111013269, 111029851, 111056769, 111070168, 111057842, 111040437, 111031878, 111042309, 111059809, 111048687, 111017847, 111001587, 111010265, 111025262, 111028993, 111033368, 111033213, 111026359, 111032057, 111039245, 111031294, 111023211, 111031580, 111052072]
3997.6A11052072
$$ y = [111052072]
##END=$$ End of the data block
