##TITLE=ISO MDI $$ Begin of the data block
##JCAMP-DX=5.00 $$ ACD/SpecManager v 10.08
##SPECTROMETER/DATA SYSTEM=Alpha
##DATE=14 Oct 2016 08:24:50
##DATA TYPE=INFRARED SPECTRUM
##DATA CLASS=XYDATA
##ORIGIN=
##OWNER=
##NPOINTS=1667
##FIRSTX=599.65820312
##LASTX=3997.72216797
##MAXX=3997.72216797
##MINX=599.65820312
##MAXY=1.07108319
##MINY=0.33707392
##XFACTOR=1.0000000000
##YFACTOR=0.000000010000000
##FIRSTY=1.00275981
##DELTAX=2.03965425
##XUNITS=1/CM
##YUNITS=ARBITRARY UNITS
##XYDATA=(X++(Y..Y))
599.7A00275981q9430j26279j63966j61112j38342j50621j69831j46717r1809k2167
620.1I9015707P1996J96904L08955L92395M45438M13310K80202J44112N0759J1313
640.5A01331091J13451L18802M25422L92222L30687K59614K04694J82283J58370J34861
660.8A03851497Q9026p3600k86257q3185K49684J20545p0644j34420j21868j10018
681.2A03430760j24586j34110j10495n8472k575M1091O7842R4593J15835J06180O8092
703.7A03494155L9113N5015R7036J08540O3766r001q8572j29390j00613p5245o9820
726.1A03384984m3548k1112j8239j4913r89n388q1945k10321l49223m92442n86498
748.6A01560366n84018m59695j83105J69372M12798M35770L18050K12467J90127K46918
$$ y = [100275981, 100186551, 100060272, 99896306, 99735194, 99596852, 99446231, 99276400, 99129683, 99037874, 99015707, 99087703, 99284607, 99593562, 99985957, 100431395, 100844705, 101124907, 101269019, 101319778, 101331091, 101444542, 101763344, 102188766, 102580988, 102911675, 103171289, 103375983, 103558266, 103716636, 103851497, 103940523, 103866923, 103580666, 103497481, 103747165, 103867710, 103797066, 103662646, 103540778, 103430760, 103306174, 103172064, 103061569, 103003097, 103000522, 103041613, 103109455, 103204048, 103319883, 103426063, 103494155, 103533268, 103588283, 103685319, 103793859, 103857625, 103848624, 103760052, 103630662, 103530049, 103454804, 103384984, 103341436, 103320324, 103302085, 103287172, 103286183, 103280795, 103198850, 102988529, 102639306, 102146864, 101560366, 100976348, 100516653, 100333548, 100502920, 100915718, 101351488, 101669538, 101882005, 102072132, 102319050]
769A02319050L01778K51496J18601n60q6963j46246j57631j47235j64008k55263n18143
791.4A01514876j067662j964993k971553l157300j702893M45861J357668N98151o57088
809.7I2395067j313323j133692m66740K63256P96765J075309J163507J153028J138145
828.1I5071322J142794J118928J036900Q88842O66959M33719K59792R9016j16277l90780
848.5A00211215o71327q05247o64240l15023K7693J96343K30885K86585M68171P36314
868.9I9701369R19115R11355P52187N37110L54313K40350J92940J86348J77849J46007
889.3A04118943J09697Q3673N0890M101n0831j04678j51586j99902k59793l47793m63832
911.7A02788889n26404l99089o1047K97046M56905L99590K59959J42944O1834l302
$$ y = [102319050, 102620828, 102872324, 102990925, 102990365, 102903402, 102757156, 102599525, 102452290, 102288282, 102033019, 101514876, 100447214, 98482221, 95510668, 92353368, 90650475, 91096336, 92454004, 93052155, 92395067, 91081744, 89948052, 89481312, 89744568, 90541333, 91616642, 92780149, 93933177, 95071322, 96214116, 97333044, 98369944, 99258786, 99925745, 100359464, 100619256, 100718272, 100601995, 100211215, 99539888, 98734641, 98070401, 97755378, 97783071, 97979414, 98210299, 98496884, 98965055, 99701369, 100620484, 101531839, 102284026, 102821136, 103175449, 103415799, 103608739, 103795087, 103972936, 104118943, 104228640, 104312313, 104363203, 104367304, 104316473, 104211795, 104060209, 103860307, 103600514, 103252721, 102788889, 102262485, 101863396, 101802349, 102099395, 102556300, 102955890, 103215849, 103358793, 103420627, 103417325]
932.1A03417325n6338r2078j11067j23846j38677j42490j19377q0013m5800l2175l5536
954.6A02439928l1984k1517m053M6241J19281J77228K09046K21967K18523K09141K05636
977A03789437J90210J50335R0480K4557k6751p1680j10102j29461j32585j24669j09291
999.4A03540480r7024j03617j45340k46370m00150o70826j399756k330762j773327
1017.8I6373308N90312K155233J642465N46336l2734k24603k99668l16811k93827k56109
1038.2I9883902k18111j95420j74057j55777j71936k13027k36475k54047l05766l92240
1058.6I7567046m90642n63544n60903m80652m12876m28211m82429m89914l98725k00379
1079I3058771O7848L30675N10817N61804M81367K82484l2919m45164q87692j241117
$$ y = [103417325, 103360987, 103268909, 103157842, 103033996, 102895319, 102752829, 102633452, 102553439, 102507639, 102475464, 102439928, 102407944, 102386427, 102382374, 102428615, 102547896, 102725124, 102934170, 103156137, 103374660, 103583801, 103789437, 103979647, 104129982, 104220462, 104245019, 104218268, 104146588, 104036486, 103907025, 103774440, 103649771, 103540480, 103443456, 103339839, 103194499, 102948129, 102547979, 101877153, 100477397, 98146635, 96373308, 96963620, 99118853, 100761318, 101307654, 101274920, 101050317, 100750649, 100433838, 100140011, 99883902, 99665791, 99470371, 99296314, 99140537, 98968601, 98755574, 98519099, 98265052, 97959286, 97567046, 97076404, 96512860, 95951957, 95471305, 95058429, 94630218, 94147789, 93657875, 93259150, 93058771, 93126619, 93457294, 93968111, 94529915, 95011282, 95293766, 95260847, 94815683, 93927991, 92686874]
1099.4I2686874j424331j462841j373982j041580m07660K49672N16320K76076k26157
1117.7H7792391p03431j031744j214343j284397j240206j087826q68333o20222l62569
1136.1G9379320r7871J96868N33158Q63618J128465J293224J316243J171190Q81666
1154.4H6665881N11640J39940j83881m34178n82784o12563n40024m09532k70503j59884
1174.8H4124112q7517n699J34439K93266M19397N11038N83005O39480O67781O43211
1195.2H7922513N25761K99126L1751j35284j10197L9291J01614q1521m04757o17511
1215.6H7570786n99229l76594k8509L34680O10096P27033O65063M82207K71416J02848
1236H9759797K9546N9307J35731J93244K00379J68461J20985R1386J19692K01309K98649
$$ y = [92686874, 91262543, 89799702, 88425720, 87384140, 86976480, 87226152, 87742472, 88018548, 87792391, 87088960, 86057216, 84842873, 83558476, 82318270, 81230444, 80362111, 79741889, 79379320, 79281449, 79478317, 80011475, 80875093, 82003558, 83296782, 84613025, 85784215, 86665881, 87177521, 87317461, 87133580, 86699402, 86116618, 85504055, 84964031, 84554499, 84283996, 84124112, 84036595, 84030896, 84165335, 84458601, 84877998, 85389036, 85972041, 86611521, 87279302, 87922513, 88448274, 88747400, 88779151, 88643867, 88533670, 88572961, 88674575, 88593054, 88188297, 87570786, 86971557, 86594963, 86566454, 86901134, 87511230, 88238263, 88903326, 89385533, 89656949, 89759797, 89789343, 89848650, 89984381, 90177625, 90378004, 90546465, 90667450, 90758836, 90878528, 91079837, 91378486]
1258.5I1378486L85344M40461M61197M62830M42355M04132L54749K76667J67352L3855
1278.9I4807428j09732k14595k14260o7944J51235K84761K79010K68638L97086N27465
1299.3I6109092M19647J29550j28853k34616j76471k2066J60432L28493N05084P21449
1319.7I7811741Q62586Q24016O54793M31037K01786L004j56427k68566k86603j66667
1340.1I9910700n4115j11985k24894k23375r8180M7987J42533J78397J04713o7031
1360.5I9604750j20682j3488l2145j57494k54398l70580l56269j88315j13195o8027
1380.9I7930157K5404P3075J42366K78055K15936L2955J14775M11236O21766N80436
1401.2A00426161K23422k18784o65671j226509j618474j379621o13147L42291J336932
$$ y = [91378486, 91763830, 92204291, 92665488, 93128318, 93570673, 93974805, 94329554, 94606221, 94773573, 94807428, 94697696, 94483101, 94268841, 94200897, 94352132, 94636893, 94915903, 95184541, 95581627, 96109092, 96528739, 96658289, 96529436, 96294820, 96118349, 96096283, 96256715, 96585208, 97090292, 97811741, 98674327, 99498343, 100153136, 100584173, 100785959, 100788963, 100632536, 100363970, 100077367, 99910700, 99856585, 99744600, 99519706, 99296331, 99198151, 99246138, 99388671, 99567068, 99671781, 99604750, 99484068, 99470580, 99438435, 99280941, 99026543, 98655963, 98299694, 98111379, 97998184, 97930157, 97955561, 98028636, 98171002, 98449057, 98664993, 98697948, 98812723, 99223959, 99845725, 100426161, 100649583, 100430799, 99765128, 98538619, 96920145, 95540524, 94927377, 95269668, 96606600]
1419.6I6606600J532305J031112N32514k6542n46932p75516q14641p13390j78069K46662
1440I6894103K38478J54138N3549l7259j09756k38723l99845l66813L15058Q21513
1460.4I7324443O68686O57207R37128Q23760L69442K18105M85146N76222M18043J97757
1480.8A02675939M3928j19698l19397l08991j7428J9860l82578o81973o07705o46102
1501.2I9655855j081127k013546k714873j830488j431793j866162k482796k963149
1517.5H3271921l036368k956510j848978l67730P17127J455325J953625K675629K709985
1535.9H4574026K233571K643543L103131K675045K206313J657170J215500Q72934M89449
1554.2A01670682L6216p8690P71356Q87823L18277j26899n78784r79567j272941j609802
$$ y = [96606600, 98138905, 99170017, 99702531, 99675989, 99129057, 98353541, 97538900, 96825510, 96647441, 96894103, 97132581, 97286719, 97340268, 97303009, 97193253, 96954530, 96554685, 96187872, 96502930, 97324443, 97993129, 98650336, 99587464, 100411224, 100780666, 100998771, 101483917, 102060139, 102478182, 102675939, 102719867, 102600169, 102280772, 101971781, 101954353, 101974213, 101591635, 100909662, 100301957, 99655855, 98574728, 96561182, 93846309, 92015821, 90584028, 88717866, 86235070, 83271921, 80235553, 77279043, 75430065, 75062335, 75779462, 77234787, 79188412, 81864041, 84574026, 86807597, 89451140, 92554271, 95229316, 97435629, 99092799, 100308299, 101181233, 101670682, 101706898, 101628208, 102399564, 103287387, 103605664, 103478765, 102899981, 101920414, 100647473, 99037671]
1574.6I9037671j107913N59151J552933J607955J058054L55136j65128n16796p41947
1593A01639116q12137p33435o76227p85565j062197j368761j240355k65485J057565
1611.3I5752519J683736J750332J823342J388180P38144M74215L96395K75588K18188
1629.7A04500639K8372l13341k58243K92253L81684J03820k16949l60000k9815L8255
1650.1A04166675l04604R2948O40356L40629m3345j35958R656q6832l29089j98138
1670.5A04152298j8466q6748m6361q3041l95453o89459m45544O2096p880k14398m14228
1692.9A01812816p19798p72977p19023o72024n94300r20230j252312j384586j677614
1711.3I3099952k085573k587425l159076l113813l012544l679925m234528m146934
$$ y = [99037671, 97929758, 98488909, 100041842, 101649797, 102707851, 103062987, 102897859, 102381063, 101639116, 100826979, 100093544, 99417317, 98631752, 97569555, 96200794, 94960439, 94694954, 95752519, 97436255, 99186587, 101009929, 102398109, 103136253, 103610468, 104006863, 104282451, 104500639, 104529011, 104215670, 103957427, 104249680, 104631364, 104735184, 104518235, 104158235, 104128420, 104166675, 103862071, 103955019, 104595375, 104936004, 104892659, 104756701, 104766357, 104679525, 104350436, 104152298, 104133832, 104047084, 104000723, 103917682, 103522229, 102832770, 102387226, 102449322, 102441442, 102227044, 101812816, 101093018, 100320041, 99601018, 98928994, 98334694, 97414464, 96162152, 94777566, 93099952, 91014379, 88426954, 85267878, 82154065, 79141521, 75461596, 71227068, 67080134]
1727.6F7080134l703236k900804k013319m98081R85253K196384L424406M344952M960728
1746G3876417N294269N542159N165958L831238K715272K032834J379073J031458P90346
1764.3A01659024M61471K33555J48081K43879M15969L50177K11060K30384K96938L00134
1784.7A04550672K42841P1442q9037P5984K78949J84906M8458Q0443K00987J85573
1805.1A05831218P3027j263M7099J22583J01030N0628M0305j3840r5654o4158j9658
1827.5A06071317K1136J65296J75619M5836J2326j0240j36483j48809P8309J90532
1847.9A06464839J21105M9293N519j7667l1447k1649j7416q2147j99807j60622Q0371
1870.4A06190372J62374N1070l1150m3058l5620k9897m9067r9397j17743m3881k1433
$$ y = [67080134, 63376898, 60476094, 58462775, 57964694, 58949947, 61146331, 64570737, 68915689, 73876417, 79170686, 84712845, 89878803, 93710041, 96425313, 98458147, 99837220, 100868678, 101659024, 102120495, 102354050, 102502131, 102746010, 103161979, 103512156, 103723216, 103953600, 104250538, 104550672, 104793513, 104864955, 104775918, 104851902, 105130851, 105315757, 105364215, 105444658, 105645645, 105831218, 105904245, 105902982, 105950081, 106072664, 106173694, 106224322, 106264627, 106250787, 106155133, 106090975, 106071317, 106092453, 106257749, 106433368, 106479204, 106491530, 106481290, 106344807, 106195998, 106274307, 106464839, 106585944, 106635237, 106640756, 106623089, 106591642, 106569993, 106552577, 106470430, 106270623, 106110001, 106190372, 106352746, 106403816, 106372666, 106329608, 106293988, 106264091, 106215024, 106115627, 105997884, 105954003, 105932570]
1892.8A05932570p2539n7268k6811l0255l0649k1517j3685K5785Q6212R0599K4962
1915.2A05907404J920P1382R0206Q5151J17636J01793N2774K6488K3353K9361J5092
1937.7A06522560l7479n6684J8418P5089N6494K8765M172o091J490K122o092j2576
1962.2A06590188l2104l7872J3864N0533K8622K336n948k265K467k002r847k0051l4082
1988.7A06543839l3212Q977M5204K5248J049j299r42p1J645K587m566k4366l7134j6975
2017.2A06509984J4674J9729N305j1945k4926k3735j8918k3711k8253l5965m9210m2700
2041.7A06290329k8897l9017n1451n3549o1249p0012q0073r4998r9861j02949j09292
2064.1A05498981r2709o4373m9424l4976j5938J609J5712K6417L3462L1578K7991L0744
$$ y = [105932570, 105860031, 105802763, 105775952, 105745697, 105715048, 105693531, 105679846, 105705631, 105791843, 105882442, 105907404, 105909324, 105980706, 106070912, 106156063, 106273699, 106375492, 106428266, 106454754, 106478107, 106507468, 106522560, 106485081, 106428397, 106446815, 106521904, 106578398, 106607163, 106611335, 106605244, 106606734, 106608856, 106602764, 106590188, 106558084, 106520212, 106534076, 106584609, 106613231, 106615567, 106609619, 106607354, 106609821, 106607819, 106597972, 106577921, 106543839, 106510627, 106519604, 106564808, 106590056, 106591105, 106589806, 106588864, 106588793, 106590438, 106593025, 106588459, 106564093, 106526959, 106509984, 106524658, 106544387, 106549692, 106537747, 106512821, 106489086, 106470168, 106446457, 106418204, 106382239, 106333029, 106290329, 106261432, 106222415, 106170964, 106117415, 106056166, 105986154, 105906081, 105811083, 105711222, 105608273, 105498981, 105406272, 105341899, 105292475, 105257499, 105241561, 105243170, 105258882, 105285299, 105318761, 105350339, 105378330, 105409074]
2088.6A05409074L3724K9588K5964K3341J0240n555p534m268j3363k9481n3429p4852
2113.1A05343449q0430r6786j34385j66380j82891k02620k40279k79796l08132l36957
2133.5A03314793l57365l62754l63112l58510l46410l21496k78842k34771k09355j92356
2153.9A00289822j84715j99688k34592k72739k90638k89100k77776k64418k62737k62296
2174.3I7751123k49738k44701k72220l24261l71516m14526m71074n30737n69344n91040
2194.7I3711966o15489o41036o50907o45196o48457o66750o97582p33716p64870q12817
2215.1H6835146q90118r94921j142478j339733j599360j931649k312029k724903l143681
2233.4G0756274l503990l755396l865058l801834l546304l121191k613729k123505
$$ y = [105409074, 105442798, 105472386, 105498350, 105521691, 105531931, 105526376, 105518842, 105514574, 105501211, 105471730, 105418301, 105343449, 105263019, 105166233, 105031848, 104865468, 104682577, 104479957, 104239678, 103959882, 103651750, 103314793, 102957428, 102594674, 102231562, 101873052, 101526642, 101205146, 100926304, 100691533, 100482178, 100289822, 100105107, 99905419, 99670827, 99398088, 99107450, 98818350, 98540574, 98276156, 98013419, 97751123, 97501385, 97256684, 96984464, 96660203, 96288687, 95874161, 95403087, 94872350, 94303006, 93711966, 93096477, 92455441, 91804534, 91159338, 90510881, 89844131, 89146549, 88412833, 87647963, 86835146, 85945028, 84950107, 83807629, 82467896, 80868536, 78936887, 76624858, 73899955, 70756274, 67252284, 63496888, 59631830, 55829996, 52283692, 49162501, 46548772, 44425267]
2249.7D4425267j713038j419401j242077j152420j102373j041439r42859p95412o14381
2268.1C4401867m19420k26829m8226J24315L06642N07176P32416R87583J275858J595572
2288.5C9236954J929569K257115K560404K833709L054753L202337L268045L236282
2304.8F1579168L115636K934301K704769K434904K143961J839900J550811J321042
2321.1G9624492J156855J022934R00287Q00478P47013P30122O97618O65254O62183
2339.5H7007236O52916O52694P09057O66356M68523L08579L05372L77053M37415N28860
2359.9I2114061O29461P09003P87598Q38947Q39049Q22812Q07625P86901P61723P31624
2380.3I9828804O81924O02746N21684M58229M00781L51155L16656K90751K66981K42448
$$ y = [44425267, 42712229, 41292828, 40050751, 38898331, 37795958, 36754519, 35811660, 35016248, 34401867, 33982447, 33755618, 33707392, 33831707, 34138349, 34645525, 35377941, 36365524, 37641382, 39236954, 41166523, 43423638, 45984042, 48817751, 51872504, 55074841, 58342886, 61579168, 64694804, 67629105, 70333874, 72768778, 74912739, 76752639, 78303450, 79624492, 80781347, 81804281, 82704568, 83505046, 84252059, 84982181, 85679799, 86345053, 87007236, 87660152, 88312846, 89021903, 89688259, 90156782, 90465361, 90770733, 91147786, 91585201, 92114061, 92743522, 93452525, 94240123, 95079070, 95918119, 96740931, 97548556, 98335457, 99097180, 99828804, 100510728, 101113474, 101635158, 102093387, 102494168, 102845323, 103161979, 103452730, 103719711, 103962159]
2400.7A03962159K13695J87337J69206J60789J58716J47020J31262J20473J08146J02580
2421.1A05461383R7549R0372R0611Q3137P4208P5865P8153O7365N0617N2392O2192
2443.5A06283844O7710O7115N6494N1760M9937L6120K2710K3913L2997L4428K6476
2465.9A06753504K5189L1817L0661K8538K9159K1660J5426J6403K0016K2733J9037
2488.4A07014143O605l219M184J4639R632L755J1921J5438M375k766o640p045K038
2514.9A07067060J848q452j776J4412J0765j252K504J2886J0324j455o187k360O08
2541.4A07098925o91k086J037J406p033o485R66r66o32Q70n579q237n913m732p117
2572A07053733j5664k0194j5617j5950j7989j5008k4927m4095m3655k4485o163J0502
$$ y = [103962159, 104175854, 104363191, 104532397, 104693186, 104851902, 104998922, 105130184, 105250657, 105358803, 105461383, 105558932, 105649304, 105739915, 105823052, 105897260, 105973125, 106051278, 106118643, 106169260, 106221652, 106283844, 106351554, 106418669, 106475163, 106526923, 106576860, 106612980, 106635690, 106659603, 106692600, 106727028, 106753504, 106778693, 106810510, 106841171, 106869709, 106898868, 106920528, 106935954, 106952357, 106972373, 106995106, 107014143, 107020748, 107017529, 107021713, 107036352, 107045984, 107049739, 107061660, 107077098, 107081473, 107078707, 107072067, 107065022, 107067060, 107068908, 107060456, 107058680, 107073092, 107083857, 107082605, 107085109, 107097995, 107108319, 107106864, 107100677, 107098317, 107098925, 107098234, 107096148, 107097185, 107098591, 107091558, 107085073, 107086039, 107085073, 107084441, 107085311, 107079732, 107071495, 107065582, 107060850, 107053733, 107038069, 107017875, 107002258, 106986308, 106968319, 106953311, 106928384, 106884289, 106840634, 106816149, 106809986, 106820488]
2596.5A06820488K8872L6490K1768J0669K1732K4450J4389J1539J1432R012O414J466
2620.9A07018721o270j4580j2779P87K813m768o616j1397j5688p867N24m577j2148
2647.5A06926155j1754j5330j8728j0979o175r251j1134r573p200m470l481q214j2695
2674A06797171j2660p105k671q10O735Q094N97r597j9598j6570r227j0955j8084k3329
2702.5A06681991k3520k1983j6593j6690k3663k0134j2863j5652k0504k0218k3127
2725A06467044j4960R143J0037r274j3852k265R119N615k205o759j9885j7893L731
2751.5A06417596L767r238p224J907J2839J5604M113j693p63j2839k4640r716J4139
2778A06403852J3983o080k6691m8077n3430k0992O556j4067m6932m1890j3876o843
$$ y = [106820488, 106849360, 106885850, 106907618, 106918287, 106940019, 106964469, 106978858, 106990397, 107001829, 107010841, 107017255, 107018721, 107012451, 106997871, 106985092, 106985879, 106988692, 106983924, 106977308, 106965911, 106950223, 106942356, 106942880, 106938303, 106926155, 106914401, 106899071, 106880343, 106869364, 106863189, 106853938, 106842804, 106833231, 106826031, 106821561, 106818080, 106809866, 106797171, 106784511, 106777406, 106774735, 106773925, 106780660, 106788754, 106789351, 106779754, 106760156, 106743586, 106734359, 106723404, 106705320, 106681991, 106658471, 106636488, 106619895, 106603205, 106579542, 106559408, 106546545, 106530893, 106510389, 106490171, 106467044, 106452084, 106461227, 106471264, 106461990, 106448138, 106445873, 106454992, 106460607, 106458402, 106451643, 106431758, 106413865, 106417596, 106421363, 106412125, 106404901, 106406808, 106419647, 106435251, 106439364, 106437671, 106436908, 106424069, 106399429, 106389713, 106403852, 106417835, 106411755, 106385064, 106336987, 106283557, 106262565, 106269121, 106255054, 106208122, 106166232, 106152356, 106145513]
2802.5A06145513k3818m2224n7483o0033n0044n9569q2350r2685j01948j15585j15586
2824.9A05344188r8550q6355r3258j10674j24764j27196r9397n5754n8759j17635j76907
2847.3A04194939k11394k51281l03507l41344l58820l44777l09181k83456k57277k16890
2867.7A01317012j80924j44267n8949N1952J08671J11592R8812P7391M5252P796k7013
2890.2A01407325o0844r5833j19900j30582j44184j49154j40012j41561j56355j76131
2910.6A00092769j76776j30546o8045l7920m0478n3989o3217p5072q9497q4120q6748
2933I9186361j28859j84614k28399k64001k80839k49881j85722j25670o5607K2262
2953.4I7495031J23710K10452K76005L19785L61890L94350L98028L97920L92235L71134
$$ y = [106145513, 106121695, 106079471, 106021988, 105961955, 105911911, 105852342, 105769992, 105677307, 105575359, 105459774, 105344188, 105245638, 105159283, 105066025, 104955351, 104830587, 104703391, 104603994, 104548240, 104489481, 104371846, 104194939, 103983545, 103732264, 103428757, 103087413, 102728593, 102383816, 102074635, 101791179, 101533902, 101317012, 101136088, 100991821, 100932872, 100984824, 101093495, 101205087, 101303899, 101381290, 101426542, 101434338, 101407325, 101346481, 101250648, 101130748, 101000166, 100855982, 100706828, 100566816, 100425255, 100268900, 100092769, 99915993, 99785447, 99717402, 99679482, 99639004, 99585015, 99521798, 99446726, 99357229, 99273109, 99186361, 99057502, 98872888, 98644489, 98380488, 98099649, 97849768, 97664046, 97538376, 97472769, 97495031, 97618741, 97829193, 98105198, 98424983, 98786873, 99181223, 99579251, 99977171, 100369406, 100740540]
2973.8A00740540L50559L07703K47288K32815K58291K72644K63190K23148J80948J71852
2994.2A03248978J59573J36531J20985R8884R3150J05954Q5175L8838K9516N6207N6160
3016.6A04229951J1325n0736j01113q5521r835L3522L3629L9458O9106P5746j4925
3039A04230607j00625m4167P9822J33992J04701R3019J13046R9874P9751O1297J7691
3061.5A04869008j7059k5224J6796J11115J56057J07491L4523J7488P5245J27780J30225
3083.9A05603445J26743J10781P6902P0286P0488M5324Q714K181L7575M2427m435k0671
3108.4A06169760J9300K0290l7372m9949j562M9305O9976N3024K5356J3876J9515L2234
3132.9A06383753L0339J1992K1720O7031Q0896N4574L6502K575l7563J764P6819Q3541
$$ y = [100740540, 101091099, 101398802, 101646090, 101878905, 102137196, 102409840, 102673030, 102896178, 103077126, 103248978, 103408551, 103545082, 103666067, 103764951, 103858101, 103964055, 104049230, 104088068, 104117584, 104173791, 104229951, 104241276, 104190540, 104089427, 104003906, 103994071, 104027593, 104061222, 104100680, 104169786, 104245532, 104230607, 104129982, 104085815, 104165637, 104299629, 104404330, 104497349, 104610395, 104710269, 104790020, 104851317, 104869008, 104851949, 104826725, 104843521, 104954636, 105110693, 105218184, 105252707, 105270195, 105345440, 105473220, 105603445, 105730188, 105840969, 105917871, 105988157, 106058645, 106103969, 106112683, 106114864, 106152439, 106194866, 106190431, 106169760, 106189060, 106209350, 106171978, 106122029, 106120467, 106169772, 106239748, 106292772, 106318128, 106332004, 106351519, 106383753, 106414092, 106426084, 106447804, 106514835, 106595731, 106650305, 106686807, 106689382, 106651819, 106653583, 106730402, 106813943]
3157.3A06813943M2355O891r346j8084k2269q297j108q965p188m304j2302j9872k3425
3183.9A06728029j6904K325J7941K4772J9467R870J2004J7238J8895K2745K9981K8193
3208.3A06914556J3149j729l445P39o401r156o699j9121l4118m3631n4013n3251j5509
3234.8A06681371L3831L5799l874m1080n5063m1103j3185l612j9276k6130j6058j8823
3259.3A06512797k3365j7119k1553m9758r1970p6282L46L1388R549j8025m6718n3024
3283.8A06156266l9268m8816q8441j02699o6245k1028M744j1050p4876j28150j06263
3306.2A05474174l3677J2720Q678j7488l1924l8707n2714p0286p3016m5287k3902l9506
3330.7A05069065p0226r9313j10281p2896k4164j7703k5677l8445n7817k2018M2975
$$ y = [106813943, 106856298, 106863189, 106853843, 106835759, 106813490, 106805193, 106804085, 106795120, 106787932, 106783628, 106771326, 106751454, 106728029, 106711125, 106713450, 106731391, 106756163, 106775630, 106785500, 106797504, 106814742, 106833637, 106856382, 106886363, 106914556, 106927705, 106925976, 106922531, 106923270, 106916869, 106907713, 106901014, 106881893, 106847775, 106804144, 106750131, 106696880, 106681371, 106715202, 106751001, 106747127, 106706047, 106650984, 106609881, 106596696, 106593084, 106573808, 106547678, 106531620, 106512797, 106489432, 106472313, 106450760, 106401002, 106309032, 106232750, 106233096, 106264484, 106274033, 106256008, 106209290, 106156266, 106116998, 106068182, 105979741, 105877042, 105810797, 105789769, 105794513, 105783463, 105708587, 105580437, 105474174, 105440497, 105453217, 105461895, 105444407, 105412483, 105373776, 105321062, 105250776, 105177760, 105132473, 105108571, 105069065, 104998839, 104899526, 104789245, 104716349, 104692185, 104674482, 104648805, 104610360, 104552543, 104530525, 104573500]
3353.1A04573500M4787J5950J0240K1792K8491k229k6691J7512P5268N5838m828l0565
3377.6A04779065m2332n7792n2464l7229n9974j10233q2970K2960O0248N698n495Q0681
3402.1A04500163J55186J33217Q2969P5543R4879J26314J44184J10435Q7404J12796
3422.5A05623090J11294O0117K0898L9112M8673J6857N4204J50931J61302Q5783J7858
3444.9A06390119J2123P3564J12486Q2731L7849r18j6546L2306M6646p0095j33371
3467.4A06566894J6546J89042J73641N0068o8951q9789L4631Q9693K634k8526N114
3489.8A06940997j3912o4528p8237o1596p3230p6902J2207P1764K2245j7214k1339
3512.2A06640255q428J8108k932p7212j26314p4184L0565P3397O5780L3665k5416k7859
$$ y = [104573500, 104618287, 104634237, 104644477, 104666269, 104694760, 104692531, 104665840, 104683352, 104758620, 104814458, 104809630, 104779065, 104736733, 104678941, 104626477, 104589248, 104529274, 104419041, 104336071, 104359031, 104419279, 104424977, 104419482, 104500163, 104655349, 104788566, 104871535, 104947078, 105041957, 105168271, 105312455, 105422890, 105510294, 105623090, 105734384, 105794501, 105815399, 105854511, 105903184, 105920041, 105974245, 106125176, 106286478, 106372261, 106390119, 106402242, 106475806, 106588292, 106671023, 106708872, 106707954, 106691408, 106723714, 106770360, 106700265, 106566894, 106583440, 106772482, 106946123, 106996191, 106927240, 106837451, 106872082, 106961775, 106964409, 106935883, 106940997, 106927085, 106862557, 106784320, 106722724, 106649494, 106572592, 106584799, 106656563, 106678808, 106661594, 106640255, 106631827, 106649935, 106647003, 106569791, 106443477, 106369293, 106399858, 106473255, 106539035, 106572700, 106547284, 106519425]
3536.7A06519425J6642l4428j41335j16753M7064J22559M8816K3007N3680J3495n6458
3559.1A06495714r1123j44303j99414m8673K20943K47752R9755j2613l2472l0089q4114
3581.6A06421363j87003k25842l4094J85752J03688l7861k5868J3137K0289L2032l5906
3604A06229687j48273j25611l0529j8251k1327n2678n0545J10161J66262l8612k75743
3626.4A05744541k00630J60051K35367J35517Q0776K6762l1626j27208l17001m77541
3646.8A05229008k65622K60830L55697J16050K6655P1168N5063p200j32835k95329
3667.2A05413485k91574j37365j46032m1890K80333L14212J74510R656k01726l19982
3687.6A05053627r9623K41626K70998J27697j4210j03950l7563P2157k6166k07532
$$ y = [106519425, 106536067, 106501639, 106360304, 106243551, 106290615, 106413174, 106461990, 106484997, 106538677, 106552172, 106495714, 106404591, 106260288, 106060874, 106012201, 106233144, 106480896, 106580651, 106568038, 106535566, 106505477, 106421363, 106234360, 106008518, 105974424, 106160176, 106263864, 106226003, 106200135, 106213272, 106233561, 106265593, 106229687, 106081414, 105955803, 105925274, 105907023, 105885696, 105833018, 105782473, 105892634, 106058896, 106020284, 105744541, 105543911, 105703962, 105939329, 106074846, 106155622, 106182384, 106150758, 106023550, 105706549, 105229008, 104963386, 105224216, 105579913, 105695963, 105722618, 105793786, 105848849, 105841649, 105708814, 105413485, 105121911, 104984546, 104838514, 104796624, 105076957, 105391169, 105565679, 105575335, 105373609, 105053627, 104954004, 105195630, 105466628, 105594325, 105580115, 105476165, 105438602, 105510759, 105484593, 105277061]
3708A05277061j94597J02592K99930J76323L958p0024o3467p558P0429M9031j21689
3730.5A05521989k84243j71888J93012K98524O0511j35243m7553N9235m0352N4598
3750.9A05508590K91550K13396M3178N4133J38617Q4161k4581n1438J5461J32942J42229
3773.3A06548238K515j18482o3717N8782M7958K5749O7186M6492m4382j38950j78206
3795.7A06253183j54710j24144o998J06835R2638J44589J56176q440j64342j61684
3816.1A06133103j20842p4935J52445K34401R6965J3697l5655q7393j44315j46198
3836.5A06021273J3209J62017J84941J68038N7709j67811l49724j79136K93577L26311
3856.9A06530404Q3864j05429j36936k8431j5998n6410L6657J29831J28245L2938p5531
$$ y = [105277061, 105082464, 105185056, 105484986, 105661309, 105665267, 105595243, 105531776, 105524218, 105594647, 105643678, 105521989, 105237746, 105065858, 105258870, 105557394, 105617905, 105482662, 105435109, 105494344, 105453992, 105508590, 105800140, 106013536, 106056714, 106110847, 106249464, 106333625, 106309044, 106257606, 106273067, 106406009, 106548238, 106550753, 106432271, 106368554, 106427336, 106475294, 106501043, 106568229, 106614721, 106570339, 106431389, 106253183, 106098473, 105974329, 105967331, 106074166, 106166804, 106311393, 106467569, 106459129, 106294787, 106133103, 106012261, 105937326, 106089771, 106324172, 106421137, 106434834, 106399179, 106311786, 106167471, 106021273, 106034482, 106196499, 106381440, 106549478, 106607187, 106439376, 106089652, 105910516, 106204093, 106530404, 106614268, 106508839, 106371903, 106343472, 106327474, 106271064, 106307721, 106437552, 106565797, 106598735, 106523204]
3879.3A06523204n5194j4925L3235Q9801K1171K0528R8205j311j74904k04575p3207
3901.8A06262028J14179K47168K23923J07467l683q5080r5117k3091L4666J8919L624
3924.2A06805003K6464L46m2629K1016J06180P4911p975m4203k3293J394j9943k7407
3948.7A06869864K2924N8771L6454P784L076n710k361K802k1196k8026q34J2767O187
3975.2A06962502R406J9383J2100q595j0145m005q393p534n436p033j609
3997.6A06950641
$$ y = [106523204, 106468010, 106453085, 106486320, 106576121, 106597292, 106617820, 106716025, 106714714, 106539810, 106335235, 106262028, 106376207, 106623375, 106847298, 106954765, 106951082, 106866002, 106770885, 106747794, 106782460, 106801379, 106805003, 106831467, 106831813, 106789184, 106810200, 106916380, 106991291, 106983316, 106939113, 106915820, 106917214, 106897271, 106869864, 106892788, 106951559, 106988013, 106995797, 106998873, 106993163, 106990802, 106993604, 106972408, 106944382, 106943548, 106956315, 106962502, 106971908, 106991291, 107003391, 106994796, 106984651, 106980646, 106972253, 106964719, 106959283, 106952250, 106950641]
##END=$$ End of the data block
