##TITLE=$$ Begin of the data block
##JCAMP-DX=5.00 $$ ACD/SpecManager v 10.08
##SPECTROMETER/DATA SYSTEM=Alpha
##DATE=23 Dec 2014 10:50:12
##DATA TYPE=INFRARED SPECTRUM
##DATA CLASS=XYDATA
##ORIGIN=
##OWNER=
##NPOINTS=1765
##FIRSTX=399.76428223
##LASTX=3997.64306641
##MAXX=3997.64306641
##MINX=399.76428223
##MAXY=0.84406215
##MINY=0.22003035
##XFACTOR=1.0000000000
##YFACTOR=1.000000000000000e-9
##FIRSTY=0.57258749
##DELTAX=2.03961372
##XUNITS=1/CM
##YUNITS=ARBITRARY UNITS
##XYDATA=(X++(Y..Y))
399.8E72587490o445229m845858k431154k4378J448631J651764R24885J22607l1054
418.1E62957704N5313j054406k605796l491819l583610l123224k321481k008975k206087
436.5E42617619j576006N70416L604472N783021N778372M030765J673638L70920N25773
454.8E63378990Q44717K82168j166344k930522m016816l649593k672553k472341l037452
473.2E44560254l500760l547788k712965j033604M96268Q26538k35259j379610j542627
491.5E31930447r25839m39942q03888j967073l207802l531576k881169k326906k666235
509.9E13180017l892242n173266n768836n422324m272312l175080k709716k420485
526.2D80345756j507551j08063J341671K849907M329562N278796N484670N066216M037201
$$ y = [572587490, 566142261, 561296403, 558865249, 558840871, 560289502, 561941266, 562866151, 562988758, 562957704, 563013017, 561958611, 559352815, 555860996, 552277386, 549154162, 546832681, 544823706, 542617619, 541041613, 541612029, 545216501, 550999522, 556777894, 560808659, 562482297, 562853217, 563378990, 564223707, 564505875, 563339531, 560409009, 556392193, 552742600, 550070047, 547597706, 544560254, 541059494, 537511706, 534798741, 533765137, 534261405, 535087943, 534852684, 533473074, 531930447, 531004608, 530564666, 529760778, 527793705, 524585903, 521054327, 518173158, 515846252, 513180017, 509287775, 504114509, 498345673, 492923349, 488651037, 485475957, 482766241, 480345756, 478838205, 478730142, 480071813, 482921720, 487251282, 492530078, 498014748, 503080964, 507118165]
544.6E07118165K646924J052379p07209k261460l181338l440917l644913m400432n806953
562.9D87374246p385284q438378q335889o767004m214257j409620J202941L534495
579.3D55561250N771190P668525Q495689P808566N908161L714115J890838Q73446N33134
597.6D98224914K29538k87593o40631m83244P4088R59605J826763K257288K455711
616E04616439K900184L662705M349410M705251M576325L969550L150702K513587K278686
634.3E36722839K223611K035439J735508J376093J058817R99212J106083J252353J467944
652.7E49977899J494944J159429Q72910R41813J224876J348436J395166J531124J287281
671E61233878J254439J638175J977145K019346J799583J384855R88006P29204M57465
$$ y = [507118165, 509765089, 510817468, 510110259, 507848799, 504667461, 501226544, 497581631, 493181199, 487374246, 479988962, 471550584, 463214695, 456447691, 452233434, 450823814, 452026755, 455561250, 461332440, 469000965, 477496654, 485305220, 491213381, 494927496, 496818334, 497691780, 498224914, 498454452, 498166859, 497526228, 497042984, 497117072, 498076677, 499903440, 502160728, 504616439, 507516623, 511179328, 515528738, 520233989, 524810314, 528779864, 531930566, 534444153, 536722839, 538946450, 540981889, 542717397, 544093490, 545152307, 546151519, 547257602, 548509955, 549977899, 551472843, 552632272, 553505182, 554446995, 555671871, 557020307, 558415473, 559946597, 561233878, 562488317, 564126492, 566103637, 568122983, 569922566, 571307421, 572295427, 573024631, 573482096]
689.4E73482096O8605n79417j522243k583325l439307l731370l356695k480864j344264
707.7E54513216q9884J311839K757609M111171N372464O327868O612777O427050O234825
726.1E93578935O121158N905330N311192M295051L121912K035201J178622M80294m05013
744.5F21622682j818657l580630n076945n790293n769551n434334m994750m421294
760.8E84736228l530681j872361P28846L732979O401837Q228779R133160R328246R090722
779.1F25977755Q684635Q033514O916404N432248M068851L436864L736138M453361
795.4F70739770M990160M966081M292130L476203L023505K911985K765953K192140
811.8F99357927J189887L10541L5703J65224L3140p73549k223432l860831n036235
$$ y = [573482096, 573550701, 572971284, 571449041, 568865716, 565426409, 561695039, 558338344, 555857480, 554513216, 554423332, 555735171, 558492780, 562603951, 567976415, 574304283, 580917060, 587344110, 593578935, 599700093, 605605423, 610916615, 615211666, 618333578, 620368779, 621547401, 622027695, 621622682, 619804025, 616223395, 611146450, 605356157, 599586606, 594152272, 589157522, 584736228, 581205547, 579333186, 580062032, 583795011, 590196848, 598425627, 607558787, 616887033, 625977755, 634662390, 642695904, 649612308, 655044556, 659113407, 662550271, 666286409, 670739770, 675729930, 680696011, 684988141, 688464344, 691487849, 694399834, 697165787, 699357927, 700547814, 700858355, 700894058, 701059282, 701092422, 700318873, 698095441, 694234610, 689198375]
830.1F89198375n555034n636275n611717n705834n816102n617499n008340m194379
846.4F46053195l512681l457844m207432n164623n621970m898846k121449K481282
862.8F19549632P084072J0198056J1878968J2546003J2054443J0093689O811976K956570
879.1F93173409o39081l377200m986465n773663o286860o665647o724715o301463n506575
897.4F46911740m817545m730284n403698o663322q084059r185791r859562j0379136
913.7E87788343j0837972j0834217r815693p643759m865825k347469o18518M20392
930.1E41245282J295209K410471L781736N179346O238460O327391M643678J087726
946.4E72209299l233314p120609j0327637j3025046j5208244j6857743j8011541j8763244
$$ y = [689198375, 683643341, 678007066, 672395349, 666689515, 660873413, 655255914, 650247574, 646053195, 642540514, 639082670, 634875238, 629710615, 624088645, 619189799, 617068350, 619549632, 626633704, 636831760, 648710728, 661256731, 673311174, 683404863, 690216839, 693173409, 692534328, 689157128, 684170663, 678397000, 672110140, 665444493, 658719778, 652418315, 646911740, 642094195, 637363911, 631960213, 625296891, 617212832, 608027041, 598167479, 587788343, 576950371, 566116154, 556300461, 548656702, 543790877, 541443408, 540824890, 541245282, 542540491, 544950962, 548732698, 553912044, 560150504, 566477895, 571121573, 572209299, 568975985, 561855376, 551527739, 538502693, 523294449, 506436706, 488425165, 469661921]
962.7D69661921j9387632k0198107k1193683k2089839k2606343k2555262k1827489
977C19803566k0457983j8508286j6012311j3170242j0278195p554457n159020l192514
993.3B25470558j671940o19442M2662M08754M72769J87725l74779r50739j271620j137123
1013.7B20556825n26473M31538J475722K360210L074228L702358M160300M368931M376113
1032B43979752M034162L175318K036512J207530R65029J169950J632482K279371L267944
1050.4B63748050M717022O415427Q045405R522885J0862857J1924118J1865347R113223
1066.7C36214334K756446n526274j1686027j2764633r594500n136430j265466J706212
1083B94703662L928543N512326O578058P282407P610350P287622O132513M394323K551943
$$ y = [469661921, 450274289, 430076182, 408882499, 386792660, 364186317, 341631055, 319803566, 299345583, 280837297, 264824986, 251654744, 241376549, 233822092, 228663072, 225470558, 223798618, 223179176, 223221838, 223630592, 224103361, 224291086, 223916307, 222965568, 221693948, 220556825, 220030352, 220461890, 221937612, 224297822, 227372050, 231074408, 235234708, 239603639, 243979752, 248013914, 251189232, 253225744, 254433274, 255398303, 256568253, 258200735, 260480106, 263748050, 268465072, 274880499, 282925904, 292448789, 303311646, 315235764, 327101111, 336214334, 338970780, 333444506, 321758479, 308993846, 299399346, 294262916, 292997450, 294703662, 298632205, 304144531, 310722589, 318004996, 325615346, 332902968, 339035481, 343429804, 345981747]
1101.4C45981747J214892J040667K140581L745735M933149N231499M675985L689080
1117.7C72653335K733082K171755K191990K784789L753334M664183M837215L703683
1134C99493366J203716k208709n720765q490532r960682j0016292q938938p232368
1150.3C48128796n306930l371507j478850M58270K534747M814297P267415R734095
1166.7C62780333J1969775J3822704J5288174J6326010J6813666J6706646J6039967
1180.9D69747275J4948160J3635248J2171655J0442019Q308530N954742L813267K307773
1197.3E41328669J655936J686156K052843K497971K960742L557384M350722N133271
1213.6E65223694N496621N112410L954947K372622Q65221k64585r82523j450241j824200
$$ y = [345981747, 347196639, 348237306, 350377887, 354123622, 359056771, 364288270, 368964255, 372653335, 375386417, 377558172, 379750162, 382534951, 386288285, 390952468, 395789683, 399493366, 400697082, 398488373, 392767608, 384277076, 374316394, 364300102, 355361164, 348128796, 342821866, 339450359, 337971509, 338429779, 340964526, 345778823, 353046238, 362780333, 374750108, 388572812, 403860986, 420186996, 437000662, 453707308, 469747275, 484695435, 498330683, 510502338, 520944357, 529252887, 535207629, 539020896, 541328669, 542984605, 544670761, 546723604, 549221575, 552182317, 555739701, 560090423, 565223694, 570720315, 575832725, 579787672, 582160294, 583025515, 582760930, 581778407, 580328166, 578503966]
1231.9E78503966k096116k184272j959980j372695n77747K43067R58145J476467J847267
1250.3E74838102K145886K288759K122700J667798J157820Q82506J076758J694322
1266.6E87874651K294302K397954J897932J048147K04504l80814o70731p95365r45806
1285E92924774j205385j456857j598298j687169j828373k063691k299846k396941k330482
1303.3E76057732k156794j955628j762331j605749j560032j611650j703144j818835
1319.6E61883569k189934l127158m456520n619526o145597n898118n016446l843128
1336E25587142k687395j506746l80158L13162O09577O00636K72989k12669o99401j029968
1356.4E20867169j180828j281321j265526r11951o11126m34041L3379O49571J287281
$$ y = [578503966, 576407850, 574223578, 572263598, 570890903, 570313156, 570556223, 571514368, 572990835, 574838102, 576983988, 579272747, 581395447, 583063245, 584221065, 585103571, 586180329, 587874651, 590168953, 592566907, 594464839, 595512986, 595717490, 595336676, 594665945, 593870580, 592924774, 591719389, 590262532, 588664234, 586977065, 585148692, 583085001, 580785155, 578388214, 576057732, 573900938, 571945310, 570182979, 568577230, 567017198, 565405548, 563702404, 561883569, 559693635, 556566477, 552109957, 546490431, 540344834, 534446716, 529430270, 525587142, 522899747, 521393001, 521012843, 521326005, 521935582, 522536218, 522809207, 522596538, 521897137, 520867169, 519686341, 518405020, 517139494, 516227543, 515616417, 515182376, 515215755, 515865326, 517152607]
1374.7E17152607J612962J500427J395047J735747K715468M180491M765749L624201
1391E38682699K017617N95987l86417r10580j039147j295090j836598k028882k016485
1409.4E31783104j940012j558304j147389j033724p12394N4717O35266J098454J441062
1427.7E28620780J689434J874446J779139J897574K479136K488315K175689J698911
1444.1E44703424R13441K0266o17445j015901j423061k299607k065659Q8454J325607
1462.4E39629519K732217M653931N715191P032872J0073781J1368453J0100782R042978
1478.7F00349724Q463621Q008779O937623O124436O239832O470263N351126M401147
1495F52346551M489661M351735L602445K717853K298891L210008L574550K737701K124667
$$ y = [517152607, 518765569, 520265996, 521661043, 523396790, 526112258, 530292749, 535058498, 538682699, 540700316, 541296303, 540909886, 539999306, 538960159, 537665069, 535828471, 533799589, 531783104, 529843092, 528284788, 527137399, 526103675, 525391281, 525445998, 526081264, 527179718, 528620780, 530310214, 532184660, 533963799, 535861373, 538340509, 540828824, 543004513, 544703424, 545616865, 545637131, 545019686, 544003785, 542580724, 540281117, 538215458, 538303912, 539629519, 542361736, 547015667, 552730858, 559763730, 569837511, 581205964, 591306746, 600349724, 608813345, 616822124, 623759747, 629884183, 636124015, 642594278, 647945404, 652346551, 656836212, 661187947, 664790392, 667508245, 669807136, 673017144, 676591694, 679329395, 681454062]
1513.4F81454062J763881J897573J977027K054095K052069J656174J521290J377165
1529.7F95753336J084626J076340J105845M73202j90854K06828Q07225R22621N75840
1548.1G01815009P6950k08795l97206o81221j111210l08871M73678p9095n88477q73983
1568.5F98116779p10487k73049o64830j254141q93295p26342j043380j198351j316488
1586.8F90036416j578093j922249k155781k232730k188147k204716k472818k806186
1603.2F72475696l023923l213584l397167l310561l223658l950298m642248l408491
1619.5F44305766k961994l539085l238618k987564k901554k353013k323746k667368
1635.8F21332824j403689j94967N1022L4093J92523J224995J700103J895130L639519
$$ y = [681454062, 683217943, 685115516, 687092543, 689146638, 691198707, 692854881, 694376171, 695753336, 696837962, 697914302, 699020147, 699493349, 699302495, 699509323, 700316548, 701239169, 701815009, 701891959, 701683164, 701285958, 700604737, 699493527, 699184656, 699658334, 699579239, 698990762, 698116779, 697406292, 697133243, 696468413, 695214272, 694320977, 693594635, 692551255, 691352904, 690036416, 688458323, 686536074, 684380293, 682147563, 679959416, 677754700, 675281882, 672475696, 669451773, 666238189, 662841022, 659530461, 656306803, 652356505, 647714257, 644305766, 641343772, 637804687, 634566069, 631578505, 628676951, 626323938, 624000192, 621332824, 619929135, 619734168, 619785190, 619819283, 620011806, 621236801, 622936904, 624832034, 628471553]
1654.1F28471553L863514L217757L276646L945768M534184M087389M183352N126715
1670.5F60706878M900157M890442N405068M882515M213691M311621N802095N529761
1686.8G00642228M372299M242897L621817L195285L115416K796113L009141K568602
1703.1G27563798K021552K173900K111614J804173J553774J546263K393246L201127
1719.4G44369447K774716K309143K147556J910150J774668J678884K014637K507329
1735.7G61486530J982391J626849J784444K009034K114594K087891K227843K458811
1752G77778387K156437J928806K078235J991928J859724J598001J124501R20951J012862
1770.4G92449832J382709J681804J299799P98523P22349R68039J167297J177430P92325
$$ y = [628471553, 632335067, 635552824, 638829470, 642775238, 647309422, 651396811, 655580163, 660706878, 665607035, 670497477, 675902545, 680785060, 684998751, 689310372, 695112467, 700642228, 705014527, 709257424, 712879241, 716074526, 719189942, 721986055, 724995196, 727563798, 729585350, 731759250, 733870864, 735675037, 737228811, 738775074, 741168320, 744369447, 747144163, 749453306, 751600862, 753511012, 755285680, 756964564, 758979201, 761486530, 763468921, 765095770, 766880214, 768889248, 771003842, 773091733, 775319576, 777778387, 779934824, 781863630, 783941865, 785933793, 787793517, 789391518, 790516019, 791436970, 792449832, 793832541, 795514345, 796814144, 797612667, 798335016, 799303055, 800470352, 801647782, 802440107]
1788.8H02440107K55167L88921R70244J100242R53973Q48472P74562O14464N36204
1807.1H08882356O75916R08196R12428O08623L29018L80158N40972N90861O39737M62889
1827.5H14931154J97768L83616N90265N56230N80967M67241L5524k67327Q9407N26846
1847.9H18091691O19530M80414K00688j4483l9101J66893L80814L20911m4822k63095
1868.3H19899440R6440M80473N44787M82142L60071K11299J15871J53542K55167L07560
1888.7H22906792L90709L36289J12891P2301J96159K82943K76446J65701l4690j17898
1909.1H24587643N0366K21670J91152O9678K3901l0935K8909K49922L26633K60651
1929.5H25979590J51217M1366k6882k5153L576M4883J91569K76923J80185J20163J59204
$$ y = [802440107, 802695274, 803084195, 804054439, 805154681, 806108654, 806957126, 807731688, 808346152, 808882356, 809558272, 810466468, 811378896, 811987519, 812316537, 812696695, 813237667, 813828528, 814468265, 814931154, 815128922, 815512538, 816102803, 816659033, 817240000, 817707241, 817742765, 817475438, 817564845, 818091691, 818711221, 819191635, 819392323, 819377840, 819338739, 819505632, 819886446, 820207357, 820162535, 819899440, 819995880, 820476353, 821021140, 821503282, 821863353, 822074652, 822190523, 822344065, 822599232, 822906792, 823297501, 823633790, 823746681, 823818982, 824015141, 824298084, 824574530, 824740231, 824705541, 824587643, 824638009, 824859679, 825050831, 825120509, 825144410, 825113475, 825142384, 825392306, 825718939, 825979590, 826130807, 826172173, 826145291, 826120138, 826123714, 826168597, 826360166, 826637089, 826817274, 826937437, 827096641]
1951.9H27096641K04921K50876K38597J51277Q7380M0412L3796J89662L09825K25007
1972.3H28828394R7633K5689K9445R1136J58429J51753K9087j06930j24276J371J54733
1994.8H29336464J79887O9201p1585j64568j96994j55687p0393r6142k66493m47810
2015.2H28115880m91738l92556l15487m01080n24402m12345k74419l14534k88427j77503
2035.6H24523389k27570m22120m98414m08292k51115q2969o736q2015k16306k35021
2056H22092831p7605J17898J94371J29163P987n7757l0458R0241K05040J77384L5107
2078.4H22884202q9645j04607K1101K11238K89143J92940K3484n0545M6790K07662
2098.8H23631763K96295K72870J38164j2934j4008J12892K48551K70307J23739o7651
$$ y = [827096641, 827301562, 827552438, 827791035, 827942312, 828029692, 828070104, 828103900, 828293562, 828603387, 828828394, 828926027, 828951716, 828981161, 829072297, 829230726, 829382479, 829411566, 829304636, 829180360, 829181731, 829336464, 829516351, 829585552, 829513967, 829349399, 829152405, 828996718, 828926325, 828830183, 828563690, 828115880, 827624142, 827231586, 826916099, 826515019, 825990617, 825578272, 825303853, 824989319, 824700892, 824523389, 824295819, 823873699, 823375285, 822966993, 822715878, 822632909, 822626173, 822544158, 822327852, 822092831, 822015226, 822133124, 822327495, 822456658, 822464645, 822406888, 822376430, 822466671, 822671711, 822849095, 822884202, 822794557, 822689950, 822711051, 822922289, 823211432, 823404372, 823427856, 823377311, 823424101, 823631763, 823928058, 824200928, 824339092, 824326158, 824312150, 824425042, 824673593, 824943900, 825067639, 824999988]
2119.2H24999988j46151o1869J00791J83106R0956p0214j46627r3162N2511J86682
2139.6H25096011J90079N2214q5652j07229O915J77025K58804K15411J21653O5744
2160H25990975J39058L13282M34517M34936L74674L30389L32296L96847N02646N63920
2180.4H29813540N05447L43383K34544L06129M54188N30898M97759L67045K33233K13802
2200.8H33499968L33309M87864N35131M36842K82943K02895K46524L75331M81427M54962
2221.2H37337196K97546J37747J19686K43962L69489L84032K81096J27971M3094J02222
2241.6H39444041K48432L42250K89321J17421j7941K7359K04384L39508L16799J48475
2262H41460049q285l815J52469L52085M11808K58923N8472k3305O5922K40207L21805
$$ y = [824999988, 824853837, 824791968, 824892759, 825075865, 825166821, 825096607, 824949980, 824856818, 824909329, 825096011, 825286090, 825338304, 825252652, 825145423, 825152338, 825329363, 825588167, 825803578, 825925231, 825990975, 826130033, 826443315, 826877832, 827312768, 827687442, 828017831, 828350127, 828746974, 829249620, 829813540, 830318987, 830662370, 830896914, 831203043, 831657231, 832188129, 832685888, 833052933, 833286166, 833499968, 833833277, 834321141, 834856272, 835293114, 835576057, 835778952, 836025476, 836400807, 836882234, 837337196, 837634742, 837772489, 837892175, 838136137, 838505626, 838889658, 839170754, 839298725, 839341819, 839444041, 839692473, 840034723, 840324044, 840441465, 840423524, 840450883, 840655267, 840994775, 841311574, 841460049, 841451764, 841447949, 841600418, 841952503, 842364311, 842623234, 842681706, 842658401, 842724323, 842964530, 843286335]
2284.4H43286335K49684Q1003q8036j03474M4167K01106K34187J01209p6950j64270
2304.8H43764961q0228R4533J64866J18018k2769j72496j63973m7028L3796K4319j01865
2327.2H43612134k52544k26856l5107M6730m9352j87040l56853m19915j84893Q9347
2347.6H42035651R9540n1737j96636k71141k47717j41203j08779j46747j81913k71499
2368H40517819k76685j47700m6194r119j6868p4149j26004r5427n3942r9003j80185
2390.4H39392543k33352k68460k83718k56896j76251j40965k52068l84509m10199l85523
2410.8H36600602l69728l35216l28303m36544n84781o02901n14448m77970m77552m90010
2431.2H31983149n42164n78701n56946n16236n13673n44667n82278n90563o04450o23465
$$ y = [843286335, 843536019, 843617022, 843528986, 843425512, 843469679, 843670785, 843904972, 844006181, 843929231, 843764961, 843684733, 843779266, 843944132, 844062150, 844039381, 843866885, 843702912, 843655884, 843689680, 843713999, 843612134, 843359590, 843132734, 843097627, 843144357, 843095005, 842907965, 842551112, 842131197, 841946304, 842035651, 842135191, 842083454, 841886818, 841615677, 841367960, 841226757, 841117978, 840971231, 840789318, 840517819, 840241134, 840093434, 840047240, 840038121, 840021253, 839947104, 839821100, 839725673, 839671731, 839572728, 839392543, 839159191, 838890731, 838607013, 838350117, 838173866, 838032901, 837780833, 837396324, 836986125, 836600602, 836230874, 835895658, 835567355, 835130811, 834546030, 833943129, 833428681, 832950711, 832473159, 831983149, 831440985, 830862284, 830305338, 829789102, 829275429, 828730762, 828148484, 827557921, 826953471, 826330006]
2451.6H26330006n59509m77373n06878n73993n65827n26964m98295m61102m28140m53114
2472H21278811n21124n51820n13613m42564l82960l78490m42266m77910m20034l20971
2492.4H16827059k63155k55882k85387l55125l89934l30150k35915j98841k37524l17336
2512.8H13957810l89516m13656l68536l20375l44515m26232n23091n75542n52654m84407
2533.2H09559286m79520n86629o84261o71148n98789n57839n53966n63085o01172o71983
2553.6H03590894o98447o39380n52058n00858n36441o39737o86467n99384n00023n07713
2574G97730386n63800o05226o08444n54263m88759m46915m29511m46379m88162n07534
2594.4G92591393m31597l14415k87354l79681n25296o10590n85556n33521n52058o73414
$$ y = [826330006, 825770497, 825293124, 824786246, 824212253, 823646426, 823119462, 822621167, 822160065, 821731925, 821278811, 820757687, 820205867, 819692254, 819249690, 818866730, 818488240, 818045974, 817568064, 817148030, 816827059, 816563904, 816308022, 816022635, 815667510, 815277576, 814947426, 814711511, 814512670, 814275146, 813957810, 813568294, 813154638, 812786102, 812465727, 812121212, 811694980, 811171889, 810596347, 810043693, 809559286, 809079766, 808493137, 807808876, 807137728, 806538939, 805981100, 805427134, 804864049, 804262877, 803590894, 802892447, 802253067, 801701009, 801200151, 800663710, 800023973, 799337506, 798738122, 798238099, 797730386, 797166586, 796561360, 795952916, 795398653, 794909894, 794462979, 794033468, 793587089, 793098927, 792591393, 792159796, 791845381, 791558027, 791178346, 790653050, 790042460, 789456904, 788923383, 788371325, 787697911]
2614.8G87697911q33511r15527q96693q55922q49128r02415j047313j188099j201928
2633.2G79007375j121402j021206j007974j128018j238465j223684j132846j040995
2649.5G70092785j006424j074374j174092j191557j115918j006424r26972r36210j012623
2667.8G60648191j067758j059174r63032q28982p82013q47757r41634r43064q38399
2686.2G52376378p66278p96675q91805j002610j048148j002907r61364r95695j064599
2704.5G43846297j097977j132548j185834j128256r88842r62913j052796j092315j037598
2722.9G34167218r39250q13007p42018p85828q74341q87870q06988p12394o55830o97792
2743.3G26251900p97212q14915p27415o25133o01888o44445o69420o44207n86987n21481
$$ y = [787697911, 786864400, 785948873, 785052180, 784196258, 783347130, 782444715, 781397402, 780209303, 779007375, 777885973, 776864767, 775856793, 774728775, 773490310, 772266626, 771133780, 770092785, 769086361, 768011987, 766837895, 765646338, 764530420, 763523996, 762597024, 761660814, 760648191, 759580433, 758521259, 757558227, 756729245, 755947232, 755099475, 754157841, 753214777, 752376378, 751610100, 750813425, 749921620, 748919010, 747870862, 746867955, 745906591, 744910896, 743846297, 742748320, 741615772, 740429938, 739301682, 738312840, 737349927, 736297131, 735204816, 734167218, 733227968, 732414961, 731672943, 730887115, 730012774, 729124904, 728317916, 727605522, 726949692, 726251900, 725454688, 724639773, 723912358, 723287225, 722685337, 722040892, 721371472, 720727265, 720140278, 719618797]
2763.7G19618797n05805n64456o32405o96242p60138p74920p55846q04007r47118j070798
2784.1G12107062j103043j096368j114428j197994j335502j445770j491427j519561
2800.4G01802969j556635j619577j733959j888037j989603j997292k013028k070426
2816.7F86934412k158285k295196k410888k455593k479553k550781k681255k830028
2833F67072833k970636l092051l228366l417671l659487l944397m165053m162431l876507
2851.4F34556234l439307l092051k965569l085733l406942l844976m373908m956067
2867.7F05391681n461633n816698o046057o101847n901634n446434m816711m087687
2884E61712980l309786k533019j795351j193881q40783p40588p98225q89183j019775
$$ y = [719618797, 719112992, 718548536, 717916131, 717219889, 716459751, 715684831, 714928985, 714124978, 713177860, 712107062, 711004019, 709907651, 708793223, 707595229, 706259727, 704813957, 703322530, 701802969, 700246334, 698626757, 696892798, 695004761, 693015158, 691017866, 689004838, 686934412, 684776127, 682480931, 680070043, 677614450, 675134897, 672584116, 669902861, 667072833, 664102197, 661010146, 657781780, 654364109, 650704622, 646760225, 642595172, 638432741, 634556234, 631116927, 628024876, 625059307, 621973574, 618566632, 614721656, 610347748, 605391681, 599930048, 594113350, 588067293, 581965446, 576063812, 570617378, 565800667, 561712980, 558403194, 555870175, 554074824, 552880943, 552040160, 551299572, 550501347, 549612164, 548592389]
2902.4E48592389j281977j673043k125800k624392l175080l721058m141450m330337
2918.7E25519252m269779l939092l345490k517461j498342l97384P81238K083123L373265
2937E15789330M480124N382835O018639O317616O394028O452501O568432O610751O560624
2955.4E70574880O502509O373346O109833N716622N283952M943192M678607M455388
2971.7F14638329M273057M111409M025101L970266L749490L373205L042460K792358
2988F43975675K571702K317071J971066J624167J271129Q75830N35369K41876j9610
3006.4F55364275k13265m31478p75815j167476j432955j563728j693368j841366k012014
3024.7F44232810k210796k308309k287507k295614k456486k639890k611875k531469
$$ y = [548592389, 547310412, 545637369, 543511569, 540887177, 537712097, 533991039, 529849589, 525519252, 521249473, 517310381, 513964891, 511447430, 509949088, 509551704, 510332942, 512416065, 515789330, 520269454, 525652289, 531670928, 537988544, 544382572, 550835073, 557403505, 564014256, 570574880, 577077389, 583450735, 589560568, 595277190, 600561142, 605504334, 610182941, 614638329, 618911386, 623022795, 627047896, 631018162, 634767652, 638140857, 641183317, 643975675, 646547377, 648864448, 650835514, 652459681, 653730810, 654606640, 655142009, 655383885, 655364275, 655151010, 654719532, 653943717, 652776241, 651343286, 649779558, 648086190, 646244824, 644232810, 642022014, 639713705, 637426198, 635130584, 632674098, 630034208, 627422333, 624890864]
3041.1F24890864k641142k867758l010750k974033k944350l017843l028095l012299
3057.4F01394594l045917l049671l011585k999842l084958l201127l199935l069639
3073.7E76731920k921939k909600l057182l185690l230810l254950l219068l180444
3090E51772237l238678l280997l181518l015756l037810l232062l238619l033936k965688
3108.4E23547173l132582l122270k863050k803147k957165l163218l339887l300458
3124.7D98865396l086776k930760k972961l063619k946049k741545k761066k977759
3141D75384861l064632k951950k824694k660900k538204k693624k926409k906829k755821
3159.4D50061798k654880k599836k570867k549559k542496k532780k507597k490074
$$ y = [624890864, 622249722, 619381964, 616371214, 613397181, 610452831, 607434988, 604406893, 601394594, 598348677, 595299006, 592287421, 589287579, 586202621, 583001494, 579801559, 576731920, 573809981, 570900381, 567843199, 564657509, 561426699, 558171749, 554952681, 551772237, 548533559, 545252562, 542071044, 539055288, 536017478, 532785416, 529546797, 526512861, 523547173, 520414591, 517292321, 514429271, 511626124, 508668959, 505505741, 502165854, 498865396, 495778620, 492847860, 489874899, 486811280, 483865231, 481123686, 478362620, 475384861, 472320229, 469368279, 466543585, 463882685, 461344481, 458650857, 455724448, 452817619, 450061798, 447406918, 444807082, 442236215, 439686656, 437144160, 434611380, 432103783, 429613709]
3175.7D29613709k432107k312214k259999k275050k259046k236128k248078k263874
3192D11327213k211928k153337k126217k047807j968563j950294j902610j859575j892626
3210.3C93214256j873970j792193j766503j769125j728237j691908j698106j661331
3226.7C79232883j540452j409530j366377j498193j668066j652777j495838j325279
3243C67276371j185745j175315j341849j423121j268953j135558j178831j225590j164139
3261.3C56177270j102626j067787r32902p60377q31485j042902j142323j163602j091599
3279.7C47041667r71169q97169q55774q04543p19071o94751p85440r22353j014947
3298C39376450r54688p56443o05970o80357r43333j175016j205087j071125r53824
$$ y = [429613709, 427181602, 424869388, 422609389, 420334339, 418075293, 415839165, 413591087, 411327213, 409115285, 406961948, 404835731, 402787924, 400819361, 398869067, 396966457, 395106882, 393214256, 391340286, 389548093, 387781590, 386012465, 384284228, 382592320, 380894214, 379232883, 377692431, 376282901, 374916524, 373418331, 371750265, 370097488, 368601650, 367276371, 366090626, 364915311, 363573462, 362150341, 360881388, 359745830, 358566999, 357341409, 356177270, 355074644, 354006857, 353073955, 352313578, 351482093, 350439191, 349296868, 348133266, 347041667, 346070498, 345173329, 344317555, 343513012, 342793941, 342099190, 341313750, 340391397, 339376450, 338421762, 337665319, 337059349, 336378992, 335435659, 334260643, 333055556, 331984431, 331030607]
3316.4C31030607r36448r11504p92295p50482r57668j149654j069904q99851p57307
3334.8C22805494o55591p66606r83536j044124j036674r32425p22051q18342j145869
3353.1C14700276j169712r06825p75158q53092q33034o05017n17905q13454j175732
3371.5C07050347j140862q39323o66976o42419p38591p50840n43892k96116j19626
3389.8C01311702k49953o15686o51747k15351Q5830k46763o90609n53161k07901j37538
3410.2B97828823j88619k62707l13461k44230j68770r0927J15603L27378L60608K34873
3430.6B97598571K81065M73380L25233l8653j00941J34885L65973M63337M75943N01871
3451C00480664N50985O35207P90655R10789P78556P36713J078308J224101Q24153L84688
$$ y = [331030607, 330094159, 329182655, 328390360, 327639878, 326682210, 325532556, 324462652, 323562801, 322805494, 322149903, 321383297, 320399761, 319355637, 318318963, 317386538, 316664487, 315846145, 314700276, 313530564, 312623739, 311848581, 310995489, 310162455, 309557438, 309039533, 308226079, 307050347, 305909485, 305070162, 304403186, 303760767, 303022176, 302271336, 301727444, 301431328, 301311702, 301061749, 300446063, 299794316, 299578965, 299664795, 299418032, 298727423, 298174262, 297966361, 297828823, 297640204, 297377497, 297064036, 296819806, 296651036, 296560109, 296675712, 297003090, 297363698, 297598571, 297879636, 298353016, 298678249, 298639596, 298538655, 298673540, 299039513, 299502850, 299978793, 300480664, 301031649, 301666856, 302457511, 303368300, 304146856, 304883569, 305961877, 307185978, 308010131, 308394819]
3471.4C08394819M50403P97600J077741J073718Q01623P82162J034707J081139J020818
3489.8C16514730J119554J208991J218438J175851J137793J095593R59158R07809J081258
3508.1C26419175J335293J493960J390428J173138J183749J393944J578599J426756
3524.4C37395042J143158J209229J497239J697004J772135J700610J643449J834750
3540.8C49892616J929194J749903J628935J753748J884192J970738K129406K320439
3557.1C65259171K474486K528042K358943K122671K623289L411115L373056L104538
3573.4C87255311L108501L255576L517270L780604L708929L278404L246069L931463
3589.7D15082127M061758L826082M013062M333436M369527M343003M196853L825634
$$ y = [308394819, 308845222, 309642822, 310720563, 311794281, 312595904, 313378066, 314412773, 315493912, 316514730, 317634284, 318843275, 320061713, 321237564, 322375357, 323470950, 324430108, 325337917, 326419175, 327754468, 329248428, 330638856, 331811994, 332995743, 334389687, 335968286, 337395042, 338538200, 339747429, 341244668, 342941672, 344713807, 346414417, 348057866, 349892616, 351821810, 353571713, 355200648, 356954396, 358838588, 360809326, 362938732, 365259171, 367733657, 370261699, 372620642, 374743313, 377366602, 380777717, 384150773, 387255311, 390363812, 393619388, 397136658, 400917262, 404626191, 407904595, 411150664, 415082127, 419143885, 422969967, 426983029, 431316465, 435685992, 440028995, 444225848, 448051482]
3606D48051482L879428M251570M345804M490257M446119M344105M858822M943341M281372
3624.4D87892300L487855L569007M880846N035460M586041M366338M190147M191696
3640.7E22199690M193247L771126L217280L635526M866480M750014M057169M272639
3657E54963171M484475L964961L547311L359437K911686K717615L316283L024936K657473
3675.4E84947348L648340L921092L501356L142535K707541K286196K171397K566040
3691.7F08891845K810776K632558K288998J932680J909316K212047K101720J541137
3708F26321077J065612J493931K380252K283394J732528J418055J372873J373887J528263
3726.4F40969872J755655J447857Q82983Q70168J618445K005458J411080L74317L88623
$$ y = [448051482, 451930910, 456182480, 460528284, 465018541, 469464660, 473808765, 478667587, 483610928, 487892300, 491380155, 494949162, 499830008, 504865468, 509451509, 513817847, 518007994, 522199690, 526392937, 530164063, 533381343, 537016869, 541883349, 546633363, 550690532, 554963171, 559447646, 563412607, 566959918, 570319355, 573231041, 575948656, 579264939, 582289875, 584947348, 588595688, 592516780, 596018136, 599160671, 601868212, 604154408, 606325805, 608891845, 611702621, 614335179, 616624177, 618556857, 620466173, 622678220, 624779940, 626321077, 627386689, 628880620, 631260872, 633544266, 635276794, 636694849, 638067722, 639441609, 640969872, 642725527, 644173384, 645056367, 645926535, 647544980, 649550438, 650961518, 651335835, 651724458]
3744.7F51724458J472354J034975N14030J618028K079069J422763J071394J313329
3761F62250400J233935R44555Q92758Q89540J117825J324833J111626Q28505P79867
3779.4F71373844R03070Q62539Q63552J018167J041472R22441O60777M75407N03719
3797.7F78624988K32935M15980J165808R10699Q40604J278162J047015L36349J25826
3816.1F84978366M57525K57969O84440J298189J008749P46489O15299N86450N85437
3834.4F91218913J29342l9995O64234J086474J106023R80974N52952l59476j034975
3852.8F94304466N64277J834751J251936L73601o9618L28183N42343J84000M11570
3871.2F99725509P71880Q15630O11841J15872K96652O62446N46932O12140L74794J75417
$$ y = [651724458, 653196812, 654231787, 654745817, 656363845, 658442914, 659865677, 660937071, 662250400, 663484335, 664428890, 665321648, 666211188, 667329013, 668653846, 669765472, 670593977, 671373844, 672276914, 673139453, 674003005, 675021172, 676062644, 676985085, 677645862, 678121269, 678624988, 678857923, 679273903, 680439711, 681350410, 682191014, 683469176, 684516191, 684852540, 684978366, 685435891, 685693860, 686378300, 687676489, 688685238, 689431727, 690047026, 690633476, 691218913, 691348255, 691308260, 691972494, 693058968, 694164991, 695145965, 695698917, 695339441, 694304466, 694868743, 696703494, 697955430, 698329031, 698259413, 698587596, 699129939, 699313939, 699725509, 700497389, 701313019, 701924860, 702040732, 702337384, 702999830, 703546762, 704158902, 704533696, 704709113]
3891.6G04709113N83231N64337L4451k40624n7458M00900Q72493Q70288N74469L93987
3912G08705187K00212j3709Q7857L71695K72452L3975K28047L61860J63317K31743
3932.3G10642636M78864M12821J56761l6479N0962L15845L13700K30729L32415L48568
3952.7G13246822K25723J54734K07066K89023L08156K67089J77443R0480R2506J35064
3973.1G15194106J80304K28405J48595R5069K17080K80142J79231P8499R0599J53006
3993.5G16845036K19225K73169
3997.6G17337430
$$ y = [704709113, 705292344, 705856681, 705891132, 705650508, 705593050, 705993950, 706866443, 707736731, 708311200, 708705187, 708905399, 708891690, 708979547, 709351242, 709623694, 709657669, 709885716, 710247576, 710410893, 710642636, 711121500, 711534321, 711691082, 711654603, 711705565, 712021410, 712335110, 712565839, 712898254, 713246822, 713472545, 713627279, 713834345, 714123368, 714431524, 714698613, 714876056, 714966536, 715059042, 715194106, 715374410, 715602815, 715751410, 715846479, 716063559, 716343701, 716522932, 716601431, 716692030, 716845036, 717064261, 717337430]
##END=$$ End of the data block
