##TITLE=$$ Begin of the data block
##JCAMP-DX=5.00 $$ ACD/SpecManager v 10.08
##SPECTROMETER/DATA SYSTEM=Alpha
##DATE=23 Dec 2014 10:50:12
##DATA TYPE=INFRARED SPECTRUM
##DATA CLASS=XYDATA
##ORIGIN=
##OWNER=
##NPOINTS=1765
##FIRSTX=399.76428223
##LASTX=3997.64306641
##MAXX=3997.64306641
##MINX=399.76428223
##MAXY=0.84502387
##MINY=0.22023687
##XFACTOR=1.0000000000
##YFACTOR=1.000000000000000e-9
##FIRSTY=0.57181549
##DELTAX=2.03961372
##XUNITS=1/CM
##YUNITS=ARBITRARY UNITS
##XYDATA=(X++(Y..Y))
399.8E71815491n555809m474997k616048J45495J702010J396537M80950N1260K49863
418.1E63194752L25918q97050k834022m144371m058063l150045k112091j758695k058267
436.5E42508066j419902Q58068L802955N843997N953074M296184J708984J13487L03209
454.8E63968122R03666M00007j213193k826035l782273l713130k788306k264380k873063
473.2E45811415l644049l775537k843440j125753L06308O55234j24454j090885j385271
491.5E32783568q84891m81784r52542k151429l352941l492891k725423k224505k634883
509.9E13882279l851115n109370n822569n587280m377931l150463k583325k246648
526.2D81153578j431168k27838J219809K849668M398644N505174N747050N096645L858983
$$ y = [571815491, 566259682, 561784685, 559168637, 559314132, 561016142, 562412679, 562893629, 562944889, 563194752, 563520670, 562623620, 559789598, 555645227, 551587164, 548437119, 546325028, 544566333, 542508066, 541088164, 541946232, 545749187, 551593184, 557546258, 561842442, 563551426, 563664913, 563968122, 564871788, 565271795, 564058602, 561232567, 557450294, 553737164, 550948858, 548684478, 545811415, 542167366, 538391829, 535548389, 534422636, 534728944, 535384178, 535259724, 534168839, 532783568, 531898677, 531416893, 530464351, 528312922, 524959981, 521467090, 518741667, 516517162, 513882279, 510031164, 504921794, 499099225, 493511945, 489134014, 485983551, 483400226, 481153578, 479722410, 479494572, 480714381, 483564049, 487962693, 493467867, 499214917, 504311562, 508170545]
544.6E08170545K440512R24707p86603k240598l041267l397286l784091m512190n771816
562.9D88001913p323653q362174q228093o685406m223079j629024R63628L583789N936712
581.3D62034613P684350Q470505P890135O002337L702194J797199Q04335N15282J95920
599.6D99096870k71499m88996l16113J54733Q89957J662403K226949K521157K880931
618E08356392L585458M301429M742503M603028L875554L136635K675056K356351K125919
636.4E39758325J943290J741826J455307J138688J006484J149296J372040J446902
652.7E51012158J376093J188099R82225R48250J136899J299084J457810J594007J347065
671E62341690J381815J680970J901567J935839J752198J407921J044691P99775N53012
$$ y = [508170545, 510611057, 511535764, 510749161, 508508563, 505467296, 502070010, 498285919, 493773729, 488001913, 480678260, 472316086, 464087993, 457402587, 453179508, 451550484, 452514112, 456097901, 462034613, 469718963, 478189468, 486079603, 492081940, 495784134, 497581333, 498385668, 498900950, 499096870, 498825371, 498336375, 498020262, 498174995, 499064952, 500727355, 502954304, 505475461, 508356392, 511941850, 516243279, 520985782, 525588810, 529464364, 532600999, 535276055, 537632406, 539758325, 541701615, 543443441, 544898748, 546037436, 547043920, 548193216, 549565256, 551012158, 552388251, 553576350, 554558575, 555506825, 556643724, 557942808, 559400618, 560994625, 562341690, 563723505, 565404475, 567306042, 569241881, 570994079, 572402000, 573446691, 574246466, 574799478]
689.4E74799478J15037o45876j679957k693832l421366l677130l345251k508819j354337
707.7E55587947r0837J245975K716899M223228N510390O367445O646037O466448O210089
726.1E94883621O039381N825460N309283M373074L241360K115011J138866L69609n27561
744.5F22768104j911938l613949n090952n833506n818844n435527n007505m492104
760.8E85563779l554583j816988P69019L772498O498396Q310139R130180R301782R154737
779.1F27128959Q731901P926405O824195N424440M035056L380894L706038M496396
795.4F71654284N097628N043029M300297L467202L043711K952218K755821K129674
811.8G00443864J166522L45946L8922N5313j07229q45909k290726l929078n007089
$$ y = [574799478, 574914515, 574268639, 572588682, 569894850, 566473484, 562796354, 559451103, 556942284, 555587947, 555497110, 556743085, 559459984, 563683212, 569193602, 575561047, 582207084, 588673532, 594883621, 600923002, 606748462, 612057745, 616430819, 619672179, 621787190, 622926056, 623295665, 622768104, 620856166, 617242217, 612151265, 606317759, 600498915, 595063388, 590055883, 585563779, 582009196, 580192208, 580961227, 584733725, 591232121, 599542260, 608672440, 617974222, 627128959, 635860860, 643787265, 650611460, 656035900, 660070956, 663451850, 667157888, 671654284, 676751912, 681794941, 686095238, 689562440, 692606151, 695558369, 698314190, 700443864, 701610386, 701956332, 701995254, 702050567, 701943338, 701097429, 698806703, 694877625, 689870536]
830.1F89870536n461037n617618n676508n737126n824864n676568n033016m125416
846.4F46718383l483057l523231m232168n145013n619109m838705k031147K506256
862.8F20352209P048189J0111451J1789680J2533784J2049019J0036588O762683K873779
879.1F93557382p82550l460824m989684n798399o311179o651282o713807o288171n512774
897.4F47048712m851818m718900n370021o703734q160234r191632r826243j0398567
913.7E87827563j0877430j0823131r772300p603944m823029k291083n89907M11093
930.1E41457832J289010K389312L737926N127847O180585O308436M658818J081288
946.4E72231054l255307p125497j0315120j3042450j5273393j6901731j8007577j8778890
$$ y = [689870536, 684409499, 678791881, 673115373, 667378247, 661553383, 655876815, 650843799, 646718383, 643235326, 639712095, 635479927, 630334914, 624715805, 619877100, 617845953, 620352209, 627400398, 637511849, 649301529, 661835313, 673884332, 683920920, 690683603, 693557382, 692774832, 689314008, 684324324, 678525925, 672214746, 665563464, 658849657, 652561486, 647048712, 642196894, 637477994, 632107973, 625404239, 617244005, 608052373, 598226130, 587827563, 576950133, 566127002, 556354702, 548750758, 543927729, 541636646, 541046739, 541457832, 542746842, 545136154, 548874080, 554001927, 560182512, 566490948, 571149766, 572231054, 568975747, 561850250, 551535130, 538492680, 523219287, 506317556, 488309979, 469531089]
962.7D69531089j9433916k0224601k1204471k2081763k2552609k2493810k1818965
977C19720954k0456374j8445820j5958130j3175547j0278910p505551n094454l174603
993.3B25631565j686365o06730P1034M22075M65691J72168l61904r24498j277149j151115
1013.7B20754772n17904M27812J426831K318337L077805L679112M117683M398971M443214
1032B44126633M079461L197595K035201J186550R46283J177460J641273K282531L273189
1050.4B63946176M678785O337613Q001328R526580J0883719J1952430J1862814R058029
1066.7C36247474K696425n522877j1601299j2664706r559363n164504j275659J737833
1083B94893324L947944N499035O545424P217646P523984P257819O176442M429340K541244
$$ y = [469531089, 450097173, 429872572, 408668101, 386586338, 364033729, 341539919, 319720954, 299264580, 280818760, 264860630, 251685083, 241406173, 233900622, 228806168, 225631565, 223945200, 223338470, 223409504, 223831579, 224297270, 224469438, 224107534, 223183036, 221905887, 220754772, 220236868, 220664680, 222091511, 224409848, 227487653, 231166765, 235284448, 239683419, 244126633, 248206094, 251403689, 253438890, 254625440, 255571723, 256749183, 258390456, 260672987, 263946176, 268624961, 274962574, 282963902, 292490482, 303374201, 315326631, 327189445, 336247474, 338943899, 333421022, 321819723, 309155017, 299595654, 294431150, 293155491, 294893324, 298841268, 304340303, 310885727, 318103373, 325627357, 332885176, 339061618, 343490958, 346032202]
1101.4C46032202J219809J073748K164871L783673M970580N242795M674107L655016
1117.7C72816801K689332K172589K221674K822697L780693M621327M756808L677875
1134C99559796J213908k216101n750954q515060r922206r931058q881748p214337n303383
1152.4C43038857l360808j478106M14372K503454M856855P318288R723604J1934727
1168.7C74951243J3798476J5262246J6326338J6822100J6664207J6005247J4965445
1183D84795302J3667107J2191504J0429561Q280575N937398L809988K324582J681089
1199.3E43117106J703322K060056K484142K926588L551722M391134N159557N478918
1215.6E70872545N069733L899455K322793Q47280k33650r23634j402616j815319k124369
$$ y = [346032202, 347252011, 348325759, 350490630, 354274303, 359244883, 364487678, 369161785, 372816801, 375506133, 377678722, 379900396, 382723093, 386503786, 391125113, 395881921, 399559796, 400773704, 398557603, 392806649, 384291589, 374369383, 364438325, 355556577, 348342240, 343038857, 339678049, 338199943, 338614315, 341117769, 345974624, 353292912, 363016516, 374951243, 388749719, 404011965, 420338303, 437160403, 453824610, 469829857, 484795302, 498462409, 510653913, 521083474, 529364049, 535301447, 539111435, 541436017, 543117106, 544820428, 546880484, 549364626, 552291214, 555842936, 560234070, 565393627, 570872545, 575942278, 579841733, 582164526, 583011806, 582778156, 581854522, 580451906, 578636587, 576512218]
1234E76512218k183855j910567j357794o23346K07007R61185J491308J858115K150953
1252.3E77105224K297938K149045J692594J168787Q92758J072348J678824K291739
1268.6E90349257K391517J887202J051188J99556l92019o45996p62939r53734j223922
1287E91900110j451730j570702j664698j823187k031386k239048k361656k325535k165794
1305.4E74266374j970291j761794j604438j591504j653313j722694j841008k229870
1321.7E59891462l133237m397094n570710o161571n922853n010784l810167k636493
1338E23248553j483917l97146L10660O22809N91457K51173k21371o95050j022041j174390
1358.4E20030737j271188j246214q98719o14703m50074R834O32763J265466J575828
$$ y = [576512218, 574328363, 572417796, 571060002, 570436656, 570643663, 571604848, 573096156, 574954271, 577105224, 579403162, 581552207, 583244801, 584413588, 585306346, 586378694, 588057518, 590349257, 592740774, 594627976, 595679164, 595878720, 595486701, 594840705, 594077766, 593124032, 591900110, 590448380, 588877678, 587212980, 585389793, 583358407, 581119359, 578757703, 576432168, 574266374, 572296083, 570534289, 568929851, 567338347, 565685034, 563962340, 562121332, 559891462, 556758225, 552361131, 546790421, 540628850, 534705997, 529695213, 525885046, 523248553, 521764636, 521367490, 521678150, 522300959, 522892416, 523143589, 522922218, 522227168, 521205127, 520030737, 518759549, 517513335, 516614616, 515999913, 515549839, 515559673, 516192436, 517457902, 519033730]
1376.7E19033730J479089J401663J754940K729356M169047M722953L573298J983941
1393.1E40848017N94139l72470r17494j064837j305461j822889k013087j997530j918197
1411.4E30030191j547217j124204j008093p16507N1915O63281J150727J473069J685560
1429.8E30658722J865029J781822J900732K446532K448917K162099J687049R10938
1446.1E45861840N9188n64397r91702j420021k284050k063572O5982J330495K753258
1464.5E42747021M651367N715013P062197J0084331J1302948J0006487Q989871Q473456
1480.8F09032691Q054852O982207O151021O245851O449819N344570M441917M522442
1497.1F57225370M318297L570736K731144K344668L270447L589750K707123K098263
$$ y = [519033730, 520512819, 521914482, 523669422, 526398778, 530567825, 535290778, 538864076, 540848017, 541442156, 541069686, 540152192, 539087355, 537781894, 535959005, 533945918, 531948388, 530030191, 528482974, 527358770, 526350677, 525634170, 525686085, 526349366, 527500093, 528973162, 530658722, 532523751, 534305573, 536206305, 538652837, 541101754, 543263853, 544950902, 545861840, 545921028, 545356631, 544364929, 542944908, 540660858, 538597286, 538663268, 539993763, 542747021, 547398388, 553113401, 560175598, 570259929, 581562877, 591569364, 600559235, 609032691, 617087543, 624069750, 630220771, 636466622, 642916441, 648261011, 652702928, 657225370, 661543667, 665114403, 667845547, 670190215, 673460662, 677050412, 679757535, 681855798]
1513.4F81855798J776874J921117J976371K063811K064407J637399J492560J372277
1529.7F96160614J135529J158833J141727N06103j63853J31845P45356Q88348N44250
1548.1G02248752P4804j74105l40581o10352j005232k86222M07041j44542o30259q67248
1568.5F98672056p21454k94924o31213j232386r35495p52091j036883j206338j343489
1586.8F90517783j587391j911998k143323k221465k172828k190411k463281k780378
1603.2F73046708k985895l185391l381789l303945l198921l904582m628777l402114
1619.5F45055294k902031l488302l250301k998054k898157k337575k258956k584398
1635.8F22337520j398623k07186P1407R5963K84970J239479J668036J915514L626347
$$ y = [681855798, 683632672, 685553789, 687530160, 689593971, 691658378, 693295777, 694788337, 696160614, 697296143, 698454976, 699596703, 700102806, 699938953, 700070798, 700816154, 701704502, 702248752, 702323556, 702149451, 701808870, 701198518, 700193286, 699907064, 700314105, 700169563, 699539304, 698672056, 697950602, 697655678, 697024465, 695792079, 694856584, 694104493, 693067610, 691861272, 690517783, 688930392, 687018394, 684875071, 682653606, 680480778, 678290367, 675827086, 673046708, 670060813, 666875422, 663493633, 660189688, 656990767, 653086185, 648457408, 645055294, 642153263, 638664961, 635414660, 632416606, 629518449, 627180874, 624921918, 622337520, 620938897, 620731711, 620803118, 620899081, 621184051, 622423530, 624091566, 626007080, 629633427]
1654.1F29633427L799557L204525L308296L972650M532933M112840M256606N143881
1670.5F61964715M821896M820883N370140M867495M245758M411161N868792N449534
1686.8G01820374M262805M162788L581047L213286L166736K797901K927125K484262
1703.1G28416324J984000K155542K090693J787007J557409J563549K376795L140450
1719.4G45071769K730071K290428K144456J931190J811684J727521K055168K470911
1735.7G62233198J932263J616359J773059J983226K107739K100229K210796K403498
1752G78360367K138972J955807K089620J979649J862407J622140J148939R42767J033306
1770.4G93133974J370490J620531J247942P99239P43866R71556J157879J150608P72596
$$ y = [629633427, 633432984, 636637509, 639945805, 643918455, 648451388, 652564228, 656820834, 661964715, 666786611, 671607494, 676977634, 681845129, 686090887, 690502048, 696370840, 701820374, 706083179, 710245967, 713827014, 717040300, 720207036, 723004937, 725932062, 728416324, 730400324, 732555866, 734646559, 736433566, 737990975, 739554524, 741931319, 745071769, 747801840, 750092268, 752236724, 754167914, 755979598, 757707119, 759762287, 762233198, 764165461, 765781820, 767554879, 769538105, 771645844, 773746073, 775956869, 778360367, 780499339, 782455146, 784544766, 786524415, 788386822, 790008962, 791157901, 792100668, 793133974, 794504464, 796124995, 797372937, 798172176, 798916042, 799887598, 801045477, 802196085, 802968681]
1788.8H02968681K89023M44412R75549J081527R33408Q29160P73371O26147N47051
1807.1H09468329O70910R04322R28759O25908L39210L71933N23270O00576O63340M73976
1827.5H15570533J85848L37839N79416O00458N93185M20630N662k34723J30833N23150
1847.9H18712831N86211M54426J93000j7822l5524J82748L97324L25620k9564k31087
1868.3H20538163Q3864M23491N12063N05090L97265K08616R7037J49250K48492L18467
1888.7H23481798M20451L18766N3227N6028K37108L16441K70009J43468k1696q8215
1909.1H25187385M6253K05577J86383P7665N1201p689J8656K27809L17216K51472J54018
1931.5H26715946O0916j2040j4722J6749N8710J79708K24292J38760J23262J73331
$$ y = [802968681, 803257704, 803702116, 804677665, 805759192, 806692600, 807521760, 808295131, 808921278, 809468329, 810139239, 811043561, 811972320, 812598228, 812937438, 813309371, 813832641, 814433217, 815096557, 815570533, 815756381, 816094220, 816673636, 817274094, 817867279, 818287909, 818293571, 818058848, 818189681, 818712831, 819299042, 819753468, 819946468, 819928646, 819893122, 820075870, 820473194, 820798814, 820769250, 820538163, 820622027, 821045518, 821557581, 822062671, 822459936, 822668552, 822765589, 822914839, 823163331, 823481798, 823902249, 824221015, 824274242, 824330270, 824567378, 824883819, 825153828, 825297296, 825275600, 825187385, 825233638, 825439215, 825625598, 825703263, 825754464, 825746775, 825765431, 825993240, 826310456, 826561928, 826715946, 826776862, 826764822, 826750100, 826766849, 826825559, 827005267, 827229559, 827368319, 827491581, 827664912]
1951.9H27664912K08378K61306K63632J72376R0480N1916Q3744K26379K89440J94251
1972.3H29506814Q3745M292r120O7532J70887J75178M8816q7738j14441Q225J66834
1994.8H30021024J76608M1068r8348j62720j59800j06872n5968j18971k87354m58598
2015.2H28790069n04196l95715l16024m03106n05269m00841k83480l10063k84434j95682
2035.6H25191259k27332l75330m67122m11987k49326p0751J2875p1228k26617k53618
2056H22850823q6724J21712K02358J45853J8894q4042n8413Q8573J94669J63376L9816
2078.4H23596895o5148o3181M2140K09272L13044K31624M4167l5763N3823J95443K54930
2100.8H24777246K12311J18852M113j6392J06931K36809K65301J60992l8445j48297
$$ y = [827664912, 827873290, 828134596, 828398228, 828570604, 828661084, 828713000, 828796744, 829023123, 829312563, 829506814, 829590559, 829594851, 829585731, 829653263, 829824150, 829999328, 830048144, 829960406, 829845965, 829854190, 830021024, 830197632, 830238700, 830140352, 829977632, 829817832, 829710960, 829654992, 829536021, 829248667, 828790069, 828285873, 827890158, 827574134, 827171028, 826665759, 826264918, 825981438, 825671375, 825386941, 825191259, 824963927, 824588597, 824121475, 823709488, 823460162, 823389411, 823402286, 823331058, 823104441, 822850823, 822764099, 822885811, 823088169, 823234022, 823252916, 823168874, 823110461, 823199034, 823393703, 823557079, 823596895, 823531747, 823468566, 823510706, 823719978, 824033022, 824264646, 824308813, 824273050, 824326873, 824522316, 824777246, 824989557, 825108409, 825112522, 825096130, 825203061, 825439870, 825705171, 825866163, 825827718, 825679421]
2121.2H25679421o6340Q6606J63078J11044k2054j20699r8288K5093J61052J84357
2141.6H26103270O2645o4731q1897k503J31368K40147K30253J45257Q2850J37091L26574
2164.1H27310324M63187M18842L22640K92242L27289M25279N29826N67674N08786L71456
2184.5H31537545K57313K96831M52280N32568M68850L53455K60413K38657L45826M80592
2204.8H35224330M97878M13716K99275K37882K86281L91901M57167M24326K84493J37150
2225.2H38654399J27613K66731L91722L72231K67982J47880L3974N3287K42829L87311
2245.6H40945959L26395J17183l4750J2696J79768L27408L23415J60158K4318L0816
2266H42413366J54495L29375L88086K47061N3347l6478N8174K56121L47972K54273
$$ y = [825679421, 825613081, 825699687, 825862765, 825973809, 825951755, 825831056, 825732768, 825757861, 825918913, 826103270, 826165915, 826101184, 826019287, 826016784, 826148152, 826388299, 826618552, 826763809, 826846659, 826983750, 827310324, 827773511, 828192353, 828514993, 828807235, 829134524, 829559803, 830089629, 830657303, 831166089, 831537545, 831794858, 832091689, 832543969, 833076537, 833545387, 833898842, 834159255, 834397912, 834743738, 835224330, 835722208, 836135924, 836435199, 836673081, 836959362, 837351263, 837808430, 838232756, 838517249, 838654399, 838782012, 839048743, 839440465, 839812696, 840080678, 840228558, 840262532, 840315819, 840558648, 840945959, 841272354, 841389537, 841354787, 841367483, 841547251, 841874659, 842198074, 842358232, 842382550, 842413366, 842567861, 842897236, 843285322, 843532383, 843585730, 843549252, 843607426, 843863547, 844211519, 844465792]
2286.4H44465792N4658j08064q7857Q5712K39610K62559J07407j10983j79947n8234
2306.8H44670653J09256J62661Q1300n8651j45256r1195K7358P9811M5002p4983k30909
2329.3H44575047k27510n0128Q583r4473k15531l39210l38852j31607M8816L8982k3485
2351.7H43250632q6844k72810l88265k49743p5996O616j40905l91543l59297j59860
2372.1H41131985n4419k7120m1306r4175j22071q4579o3717j01566j70291k45511k77937
2394.5H39849293k60293k34843j99496j84000k51591l53575m09901m03523l59655l21567
2414.9H36870849l40462m50134n87165o02722n12600m55618m31359m40300n02705n71430
2435.3H31976354n82456n36502n27859n86152o24060n96285n82040n96046n52177m81248
$$ y = [844465792, 844520450, 844412386, 844324529, 844410241, 844649851, 844912410, 845019817, 844908834, 844728887, 844670653, 844779909, 844942570, 845023870, 844965219, 844819963, 844728768, 844756126, 844835937, 844880939, 844805956, 844575047, 844347537, 844297409, 844305992, 844211519, 843995988, 843656778, 843317926, 843186319, 843235135, 843274117, 843250632, 843163788, 842890978, 842502713, 842252970, 842176974, 842183590, 842042685, 841651142, 841291845, 841131985, 841077566, 841050446, 841009140, 840914965, 840792894, 840708315, 840644598, 840543032, 840372741, 840127230, 839849293, 839589000, 839354157, 839154661, 838970661, 838719070, 838365495, 837955594, 837552071, 837192416, 836870849, 836530387, 836080253, 835493088, 834890366, 834377766, 833922148, 833490789, 833050489, 832547784, 831976354, 831393898, 830857396, 830329537, 829743385, 829119325, 828523040, 827941000, 827344954, 826792777, 826311529]
2455.7H26311529m96507n53310n47886n13136m84407m39823m11510m53890n33819n72681
2476.1H21304560n24879m40597l82185l79324m31180m59969m22955l39687k77042k61188
2496.5H17385554k73168l37243m04119l72529k46644j60396k12014l27230l92556m09901
2516.9H14249754l82304l24428l32237m31597n37157n67973n37276m94301m95672n65052
2537.3H09581757o30022o39498o21915n98132n62072n53608o26326p05778o80804n76318
2557.7H03387284m91857m90368n62369o48916o76036n86987m76360n04732o06299o33239
2578.1G97710121n96166n41031m76659m22895m20510m60446m89116m78864m04715l10362
2598.5G93109357l01003m08709n45919o05285n80073n51700n66304o44743p87497q89242
$$ y = [826311529, 825815022, 825261712, 824713826, 824200690, 823716283, 823276460, 822864950, 822411060, 821877241, 821304560, 820779681, 820339084, 819956899, 819577575, 819146395, 818686426, 818263471, 817923784, 817646742, 817385554, 817112386, 816775143, 816371024, 815998495, 815751851, 815591455, 815379441, 815052211, 814659655, 814249754, 813867450, 813543022, 813210785, 812779188, 812242031, 811674058, 811136782, 810642481, 810146809, 809581757, 808951735, 808312237, 807690322, 807092190, 806530118, 805976510, 805350184, 804644406, 803963602, 803387284, 802895427, 802405059, 801842690, 801193774, 800517738, 799930751, 799454391, 798949659, 798343360, 797710121, 797113955, 796572924, 796096265, 795673370, 795252860, 794792414, 794303298, 793824434, 793419719, 793109357, 792808354, 792399645, 791853726, 791248441, 790668368, 790116668, 789550364, 788905621, 788118124, 787228882]
2618.9G87228882q98122q90136q81434q98599j016081j152813j193047j134276j030564
2637.2G78133810j019419j128733j211822j199543j130879j029253r81033j059532
2653.5G69373596j172662j209557j139820j006782r14037r41157j032174j061082j003921
2671.9G59892404r17554q52704q22544q43883r24885r64641q89361p86305p48694q22186
2692.3G51319647r75907j070738j034558r56714r62972j052320j142979j195789j181602
2710.7G41746068j084089r82166r56595j016199j073957j021921r05097q01861p67887
2729G33136296q32379r04083q72254p71225p14123p06017p18713p55012p70032p13587
2749.4G25378871o21676n94318o45519o86407o50227n59389m90904m86970n59211o83904
$$ y = [787228882, 786330760, 785440624, 784559190, 783660591, 782644510, 781491697, 780298650, 779164374, 778133810, 777114391, 775985658, 774773836, 773574293, 772443414, 771414161, 770433128, 769373596, 768200934, 766991377, 765851557, 764844775, 763930738, 762989581, 761957407, 760896325, 759892404, 758974850, 758122146, 757299602, 756455719, 755530834, 754566193, 753676832, 752890527, 752141833, 751319647, 750343740, 749273002, 748238444, 747281730, 746318758, 745266438, 744123459, 742927670, 741746068, 740661979, 739679813, 738723218, 737707019, 736633062, 735611141, 734706044, 733904183, 733136296, 732303917, 731399834, 730527580, 729756355, 729042232, 728336215, 727617502, 726862490, 726092458, 725378871, 724757195, 724162877, 723517358, 722830951, 722180724, 721621335, 721130431, 720643461, 720084250, 719400346]
2769.8G19400346p52985p34508p10070p32899q30531r71496j067937j096666j081466
2788.2G11421788j095772j200557j337886j455307j525640j536608j539409j601160
2804.5G00129449j728475j867234j956404j968085j970530k040029k171993k332926
2820.8F84093773k439439k467573k493858k551913k659917k820075k979993l089309
2837.1F62591696l206253l420830l683209l950119m162550m161895l892958l473043
2853.4F32640839l116012k983630l114521l438175l848493m354596m957676n498409
2869.7F01329327n870223o108404o158769n902409n409420m811346m107178l320694
2886.1E59640884k533912j812756j249731q94606p48992p84576q92401j047730j295745
$$ y = [719400346, 718647361, 717912853, 717202783, 716469884, 715639353, 714667857, 713599920, 712503254, 711421788, 710326016, 709125459, 707787573, 706332266, 704806626, 703270018, 701730609, 700129449, 698400974, 696533740, 694577336, 692609251, 690638721, 688598692, 686426699, 684093773, 681654334, 679186761, 676692903, 674140990, 671481073, 668660998, 665681005, 662591696, 659385443, 655964613, 652281404, 648331285, 644168735, 640006840, 636113882, 632640839, 629524827, 626541197, 623426676, 619988501, 616140008, 611785412, 606827736, 601329327, 595459104, 589350700, 583191931, 577289522, 571880102, 567068756, 562961578, 559640884, 557106972, 555294216, 554044485, 553149879, 552400887, 551616311, 550723910, 549676180, 548380435]
2904.4E48380435j635731k087235k625823l195882l759682m185319m350007m275918
2920.7E22264838l965020l385246k521932j457929l47496Q18611K096653L359973M451036
2939.1E21313488N347908N976737O292402O418765O515682O636560O651640O557107
2955.4E71710289O489932O399870O151319N748212N316257M957438M688620M488171
2971.7F15950108M315733M161239M081071M016041L802538L451765L099978K806485
2988F45684958K586305K355456K010047J638651J287759R33706O00994K89619R179
3006.4F57396674k27809m51088p47800j115739j408279j581192j707852j810312j969338
3024.7F46377265k185285k267539k239287k274573k444506k628922k634466k587795
$$ y = [548380435, 546744704, 544657469, 542031646, 538835764, 535076082, 530890763, 526540756, 522264838, 518299818, 514914572, 512392640, 510934711, 510587215, 511405826, 513502479, 516862452, 521313488, 526661396, 532638133, 538930535, 545349300, 551864982, 558501542, 565153182, 571710289, 578200221, 584600091, 590751410, 596499622, 601815879, 606773317, 611461937, 615950108, 620265841, 624427080, 628508151, 632524192, 636326730, 639778495, 642878473, 645684958, 648271263, 650626719, 652636766, 654275417, 655563176, 656496882, 657097876, 657387495, 657396674, 657168865, 656717777, 655969977, 654854238, 653445959, 651864767, 650156915, 648346603, 646377265, 644191980, 641924441, 639685154, 637410581, 634966075, 632337153, 629702687, 627114892]
3041.1F27114892k683401k866030k987206k961278k929210k994836l033221l045916
3057.4F03613794l073454l041565k986730k992451l093600l217518l214598l087878
3073.7E78906000k924025k874077l035247l205001l251315l266394l218710l154278
3090E53976953l224730l284991l192425l062189l069102l200531l213048l073037l015101
3108.4E25641799l122807l097236k873838k823531k990783l211855l366054l308475
3124.7E00847220l082662k914966k977997l091246k981513k776027k768338k955913
3141D77298558l054172k977312k864867k698541k570897k712459k930819k922416k807141
3159.4D51759934k715945k645194k616585k567917k490371k475560k503872k473295
$$ y = [627114892, 624431491, 621565461, 618578255, 615616977, 612687767, 609692931, 606659710, 603613794, 600540340, 597498775, 594512045, 591519594, 588425994, 585208476, 581993878, 578906000, 575981975, 573107898, 570072651, 566867650, 563616335, 560349941, 557131231, 553976953, 550752223, 547467232, 544274807, 541212618, 538143516, 534942985, 531729937, 528656900, 525641799, 522518992, 519421756, 516547918, 513724387, 510733604, 507521749, 504155695, 500847220, 497764558, 494849592, 491871595, 488780349, 485798836, 483022809, 480254471, 477298558, 474244386, 471267074, 468402207, 465703666, 463132769, 460420310, 457489491, 454567075, 451759934, 449043989, 446398795, 443782210, 441214293, 438723922, 436248362, 433744490, 431271195]
3175.7D31271195k408236k346903k296060k286464k304107k322734k312034k247214
3192D12747443k177954k153307k122849k067924k027184j966417j877278j888394j949012
3210.3C94517124j921386j860946j782000j714200j699239j711696j731396j711875
3226.7C80384386j585424j353056j281797j549423j771540j670390j468122j300961
3243C68403673j183420j228869j396418j420587j254082j145750j179934j201987j172095
3261.3C57220531j160115j093269r07451p61777q65757j098633j187444j117885r94772
3279.7C48033428r36538r46134r04620q04305p11471p22736q06570q98302j009315
3298C40293437r88394p76827n95242o84678r94802j253426j244843j027048r03785
$$ y = [431271195, 428862959, 426516056, 424219996, 421933532, 419629425, 417306691, 414994657, 412747443, 410569489, 408416182, 406293333, 404225409, 402198225, 400231808, 398354530, 396466136, 394517124, 392595738, 390734792, 388952792, 387238592, 385539353, 383827657, 382096261, 380384386, 378798962, 377445906, 376164109, 374614686, 372843146, 371172756, 369704634, 368403673, 367220253, 365991384, 364594966, 363174379, 361920297, 360774547, 359594613, 358392626, 357220531, 356060416, 354967147, 354059696, 353297919, 352432162, 351333529, 350146085, 349028200, 348033428, 347096890, 346150756, 345246136, 344441831, 343730360, 343007624, 342201054, 341302752, 340293437, 339305043, 338528216, 337932974, 337248296, 336253494, 335000068, 333755225, 332728177, 331824392]
3316.4C31824392r33707r24736q06808p80315j004159j154959j000107q33720p73221
3334.8C23612660p16477q08478j004159j069993j041144q74907o53028p99090j150400
3353.1C15494984j175344r23723p79479q44747q37803o25461n46962q21203j154513
3371.5C07785749j149952q80569p06136p15018p94261p44105n15491k22325l2425k17885
3391.9C01807582o06089o14048j73658N9337l38912p67857n96404k35677j25229j77324
3412.3B98231721k99513l24756j84715r6351m9323J20580K92182L23862K36035K78323
3432.7B98528045M35561K93136n4061q7709K21789M55022M61549M48048N21451N78314
3453.1C01801145O25223P48783Q48741P48485P76887J108408J198530P92146L64512
$$ y = [331824392, 330890685, 329965949, 329159141, 328378826, 327374667, 326219708, 325219601, 324385881, 323612660, 322896183, 322087705, 321083546, 320013553, 318972409, 318097502, 317444474, 316645384, 315494984, 314319640, 313395917, 312616438, 311771691, 310933888, 310308427, 309761465, 308940262, 307785749, 306635797, 305755228, 305049092, 304334074, 303539813, 302795708, 302280217, 302057892, 302025467, 301807582, 301201493, 300587445, 300413787, 300473124, 300134212, 299366355, 298769951, 298534274, 298409045, 298231721, 297932208, 297607452, 297422737, 297326386, 297277063, 297397643, 297689825, 298013687, 298249722, 298528045, 298963606, 299256742, 299202681, 299114972, 299336761, 299791783, 300253332, 300701380, 301222831, 301801145, 302426368, 303175151, 304023892, 304772377, 305549264, 306657672, 307856202, 308648348, 309012860]
3471.4C09012860M43488Q35419J142264J070559P28756P55638J082927J112192R91196
3489.8C17175299J083076J207799J249075J204937J168043J155823R97275Q73894J003176
3508.1C27118397J283556J543432J496524J222789J178652J389832J567423J415491
3524.4C38216096J152933J226991J506269J684219J748890J681476J629949J850426
3540.8C50697249K019882J851589J624733J721442J885593J990497K189606K387524
3557.1C66368115K518386K528071K339035K144754K667159L444314L345698L010512
3573.4C88366044L052473L278195L585578L844231L731578L324837L316522L954768
3589.7D16454226M068970L853471M062980M362494M356473M326821M198640L841967
$$ y = [309012860, 309456348, 310291767, 311434031, 312504590, 313233346, 313988984, 315071911, 316184103, 317175299, 318258375, 319466174, 320715249, 321920186, 323088229, 324244052, 325241327, 326115221, 327118397, 328401953, 329945385, 331441909, 332664698, 333843350, 335233182, 336800605, 338216096, 339369029, 340596020, 342102289, 343786508, 345535398, 347216874, 348846823, 350697249, 352717131, 354568720, 356193453, 357914895, 359800488, 361790985, 363980591, 366368115, 368886501, 371414572, 373753607, 375898361, 378565520, 382009834, 385355532, 388366044, 391418517, 394696712, 398282290, 402126521, 405858099, 409182936, 412499458, 416454226, 420523196, 424376667, 428439647, 432802141, 437158614, 441485435, 445684075, 449526042]
3606D49526042L913134M322320M430801M505724M377216M260719M810869M930020M288405
3624.4D89365250L549337L670693M879206M988492M566550M333913M187525M210114
3640.7E23751080M202843L826022L329217L772438M857600M581689L943146M283428
3657E56547463M503787L923475L537417L427863K966404K685845L286719L127337K773642
3675.4E86779952L523052L661632L360629L210724K872050K396047K233028K569556
3691.7F10606670K721370K552271K262413J909018J863062K204120K166987J617491
3708F27903402J085877J461506K339304K252936J748800J470805J400709J398086J583874
3726.4F42645299J792372J443863Q73565P78258J494169K065301J532734M27544L75330
$$ y = [449526042, 453439176, 457761496, 462192297, 466698021, 471075237, 475335956, 480146825, 485076845, 489365250, 492914587, 496585280, 501464486, 506452978, 511019528, 515353441, 519540966, 523751080, 527953923, 531779945, 535109162, 538881600, 543739200, 548320889, 552264035, 556547463, 561051250, 564974725, 568512142, 571940005, 574906409, 577592254, 580878973, 584006310, 586779952, 590303004, 593964636, 597325265, 600535989, 603408039, 605804086, 608037114, 610606670, 613328040, 615880311, 618142724, 620051742, 621914804, 624118924, 626285911, 627903402, 628989279, 630450785, 632790089, 635043025, 636791825, 638262630, 639663339, 641061425, 642645299, 644437671, 645881534, 646755099, 647533357, 649027526, 651092827, 652625561, 653053105, 653428435]
3744.7F53428435J399875J026392N96344J572669J956284J364112J028180J295984
3761F63668275J258969R60529R05037R09984J140416J359105J169324Q54611P36833
3779.4F72963083Q63254Q51333Q41498R73940R99511Q89241O39320N14745O15180L17335
3799.8F80468440L80695J108885R50217Q83877J237989R97901K89499N2512M45545
3818.1F86815560L40044P59542J274348R52303P07388N26786M60744N77807L36230
3836.5F92750752J91390O80149R83894J007855R30428N48363l39627r85325O53625
3854.8F96421504J857340J181007M23729J29283L18229L77059K06411N12779P36594
3873.2G02163935P67350O55770K31505L46183N38767M09245O00517M25160J80960N36799
$$ y = [653428435, 654828310, 655854702, 656451046, 658023715, 659979999, 661344111, 662372291, 663668275, 664927244, 665887773, 666792810, 667702794, 668843210, 670202315, 671371639, 672226250, 672963083, 673826337, 674677670, 675519168, 676493108, 677492619, 678381860, 679021180, 679535925, 680151105, 680468440, 680849135, 681958020, 682908237, 683792114, 685030103, 686028004, 686317503, 686370015, 686815560, 687155604, 687915146, 689189494, 690141797, 690849185, 691375971, 691836715, 692414522, 692750752, 692942142, 693622291, 694606185, 695614040, 696544468, 697092831, 696753204, 695767879, 696421504, 698278844, 699459851, 699883580, 700012863, 700331092, 700708151, 700914562, 701427341, 702163935, 702931285, 703587055, 703818560, 704164743, 704703510, 705112755, 705713272, 706138432, 706319392, 706856191]
3893.6G06856191N57244P2300j95145j3232L93509Q11875Q51572N92232L79741J54614
3914G10460901p8261K7836L36051K98917J52648K78770K97368J33693K67148M87030
3934.4G12662101L64721J86503J08003J26422K24650J77145J90317L58761L51905K17915
3954.8G14968443J39177J90377L06427L34383K82049J96635J20044J27495J39713J09494
3975.2G16914237J18792J20103J64986K94804K97785J45495R0837J69814J95146J47164
3995.6G18659163J77979
3997.6G18837142
$$ y = [706856191, 707413435, 707485735, 707290590, 707277358, 707670867, 708482742, 709334314, 709926546, 710306287, 710460901, 710382640, 710410476, 710746527, 711045444, 711198092, 711476862, 711774230, 711907923, 712175071, 712662101, 713026822, 713213325, 713321328, 713447750, 713672400, 713849545, 714039862, 714398623, 714750528, 714968443, 715107620, 715297997, 715604424, 715938807, 716220856, 716417491, 716537535, 716665030, 716804743, 716914237, 717033029, 717153132, 717318118, 717612922, 717910707, 718056202, 718147039, 718316853, 718511999, 718659163, 718837142]
##END=$$ End of the data block
