##TITLE=$$ Begin of the data block
##JCAMP-DX=5.00 $$ ACD/SpecManager v 10.08
##SPECTROMETER/DATA SYSTEM=Alpha
##DATE=23 Dec 2014 10:50:12
##DATA TYPE=INFRARED SPECTRUM
##DATA CLASS=XYDATA
##ORIGIN=
##OWNER=
##NPOINTS=1765
##FIRSTX=399.76428223
##LASTX=3997.64306641
##MAXX=3997.64306641
##MINX=399.76428223
##MAXY=0.84608763
##MINY=0.22021402
##XFACTOR=1.0000000000
##YFACTOR=1.000000000000000e-9
##FIRSTY=0.57172477
##DELTAX=2.03961372
##XUNITS=1/CM
##YUNITS=ARBITRARY UNITS
##XYDATA=(X++(Y..Y))
399.8E71724772o362259m965961k418756M78029J936018J738131P02680k41817k83360
$$ 571724772 565362513 560396552 557977796 558455825 560391843 562129974 562832654 562590837 562307477
418.1E62307477L11732p20739k628982l807783l864408k936840j844883j665234k154708
$$ 562307477 562619209 561898470 559269488 555461705 551597297 548660457 546815574 545150340 542995632
436.5E42995632j681924P46071L887177N778134N802094M227043J794755K31266K31564
$$ 542995632 541313708 542059779 545946956 551725090 557527184 561754227 563548982 563780248 564011812
454.8E64011812P90715N30601r36985k749503l876269l663182k622843k302050l175557
$$ 564011812 564802527 565333128 564396143 561646640 557770371 554107189 551484346 549182296 546006739
473.2E46006739l819167l666461k712071j055956M10140P50243j04308j082182j493334
$$ 546006739 542187572 538521111 535809040 534753084 535163224 535913467 535809159 534726977 533233643
491.5E33233643j229585p02083q05259j854836l167868l563583k973974k441525k694249
$$ 533233643 532004058 531301975 530496716 528641880 525474012 521910429 518936455 516494930 513800681
509.9E13800681l832877n120873n790711n403727m151106l081977k630353k288104
$$ 513800681 509967804 504846931 499056220 493652493 489501387 486419410 483789057 481500953
526.2D81500953j471668k02328J387745K993167M332512N301506N539894N019188L993630
$$ 481500953 480029285 479826957 481214702 484207869 488540381 493841887 499381781 504400969 508394599
544.6E08394599K570689R22024p75933k229393k999186l212035l625989m589707n898237
$$ 508394599 510965288 511887312 511111379 508881986 505882800 502670765 499044776 494455069 488556832
562.9D88556832p331461q487939q402944o673575m125028j499266J032382L508717
$$ 488556832 481225371 472737432 464334488 457660913 453535885 452036619 453069001 456577718
579.3D56577718N831093P603228Q419812P920295O043374L649414J796543R21131N45919
$$ 456577718 462408811 470012039 478431851 486352146 492395520 496044934 497841477 498762608 499308527
597.6D99308527J38700k52426m27544l24220R8765Q79705J741439K302110K532483
$$ 499308527 499447227 499194801 498767257 498443037 498541802 499421507 501162946 503465056 505997539
616E05997539K953529L743231M414976M705965M487813L882646L227771K722204K411127
$$ 505997539 508951068 512694299 517109275 521815240 526303053 530185699 533413470 536135674 538546801
634.3E38546801K247810K036273J666606J297712J106560J093328J170636J282453
$$ 538546801 540794611 542830884 544497490 545795202 546901762 547995090 549165726 550448179
650.6E50448179J389146J426935J245559R71436R84907J248837J305997J334310J625716
$$ 550448179 551837325 553264260 554509819 555481255 556466162 557714999 559020996 560355306 561981022
669E61981022J469553J370787J644969J921416K009451J793921J343847R54985P27415
$$ 561981022 563450575 564821362 566466331 568387747 570397198 572191119 573534966 574489951 575217366
687.3E75217366N10276J51634n20110j566828k702534l500461l718675l295064k429127
$$ 575217366 575727642 575879276 575359166 573792338 571089804 567589343 563870668 560575604 558146477
705.7E58146477j377106j83046J214504K740086M217147N483091O414235O768346O569326
$$ 558146477 556769371 556586325 557800829 560540915 564758062 570241153 576655388 583423734 589993060
724.1E89993060O265878O073594N820871N263328M334033L187179K064705J135826
$$ 589993060 596258938 602332532 608153403 613416731 617750764 620937943 623002648 624138474
740.4F24138474M00603m83393j974166l767431n178392n824863n765439n393505n004346
$$ 624138474 624539077 624055684 622081518 618314087 613135695 607310832 601545393 596151888 591147542
758.7E91147542m553616l655970j876652Q20636L894627O562293Q305609R114921R309233
$$ 591147542 586593926 582937956 581061304 581881940 585776567 592338860 600644469 609759390 619068623
777.1F19068623R158611Q757472Q007944O809473N332887M045129L465712L767132
$$ 619068623 628227234 636984706 644992650 651802123 657135010 661180139 664645851 668412983
793.4F68412983M503489N066693M985928M237593L418147K974212K900601K842366
$$ 668412983 672916472 677983165 682969093 687206686 690624833 693599045 696499646 699342012
809.7F99342012K268017J123726J77205j3709J44601l5882q82745k350629l980755
$$ 699342012 701610029 702733755 702910960 702897251 703041852 703005970 702123225 699772596 695791841
828.1F95791841n162180n629420n624175n633652n802513n933880n702913m991055
$$ 695791841 690629661 685000241 679376066 673742414 667939901 662006021 656303108 651312053
844.4F51312053m137277l564895l552734m197717n127072n598784m807413k000331
$$ 651312053 647174776 643609881 640057147 635859430 630732358 625133574 620326161 618325830
860.7F18325830K556741P087230J0128320J1787712J2502015J2012303R970963O664157
$$ 618325830 620882571 627969801 638098121 649885833 662387848 674400151 684371114 691035271
877F91035271K816617q19146l548742n091846n832672o316543o681203o714583o279707
$$ 691035271 693851888 693032742 689484000 684392154 678559482 672242939 665561736 658847153 652567446
895.4F52567446n524277m853428m744708n435706o749749q147776r170711r844065
$$ 652567446 647043169 642189741 637445033 632009327 625259578 617111802 607941091 598097026
911.7E98097026j0425567j0888338j0805250r745240p617652m850149k291382n66482
$$ 598097026 587671459 576783121 565977871 556232631 548614979 543764830 541473448 540906966
928E40906966M54306J322389K406955L764748N162657O177604O208479M547119J098454
$$ 540906966 541361272 542683661 545090616 548855364 554018021 560195625 566404104 570951223 572049677
946.4E72049677l190636p174909j0413707j3035416j5219927j6927183j8055588j8785357
$$ 572049677 568859041 561684132 551270425 538235009 523015082 506087899 488032311 469246954
962.7D69246954j9447029k0257622k1215409k2076964k2557170k2478431k1758586
$$ 469246954 449799925 429542303 408326894 386249930 363692760 341214329 319455743
977C19455743k0401091j8432050j5925736j3086199j0201380p498309n090356l129318
$$ 319455743 299054652 280622602 264696866 251610667 241409287 233910978 228820622 225691304
993.3B25691304j653955n86808P8351L98353M41953J55658l88518r56640j291290j152188
$$ 225691304 224037349 223450541 223528892 223927245 224369198 224524856 224136338 223179698 221888408 220736220
1013.7B20736220n22196M42580J472637K354651L052533L641203M117310M370064M360661
$$ 220736220 220214024 220656604 222129241 224483892 227536425 231177628 235294938 239665002 244025663
1032B44025663L968313L127038K102584J335263J021952J139879J588195K281189L309191
$$ 244025663 247993976 251121014 253223598 254558861 255580813 256720692 258308887 260590076 263899267
1050.4B63899267M732340O377548P987738R467214J0832310J1879802J1735677Q969486
$$ 263899267 268631607 275009155 282996893 292464107 303296417 315176219 326911896 335881382
1066.7C35881382K700746n461633j1515379j2596339r518236n120128j247317J756847
$$ 335881382 338582128 333120495 321605116 309008777 299490541 294370413 293123096 294879943
1083B94879943L977806N490779O498844P185608P506490P225454O151586M448682K588660
$$ 294879943 298857749 304348528 310847372 318032980 325539470 332764924 338916510 343365192 345953852
1101.4C45953852J272023J116246K156794L718167M901797N199462M664004L678650
$$ 345953852 347225875 348342121 350498915 354217082 359118879 364318341 368982345 372660995
1117.7C72660995K710640K166629K191096K781213L767877M660965M795312L658742
$$ 372660995 375371635 377538264 379729360 382510573 386278450 390939415 395734727 399393469
1134C99393469J178652k243429n784005q492619r840816r860605q853644p221640n311071
$$ 399393469 400572121 398328692 392544687 384052068 374211252 364350647 355497003 348275363 342964292
1152.4C42964292l363014j465678M68940K558380M868597P316649R705662J1874259
$$ 342964292 339601278 338135600 338604540 341162920 346031517 353348166 363053828 374928087
1168.7C74928087J3730168J5230656J6314507J6797333J6657204J6028136J4969736
$$ 374928087 388658255 403888911 420203418 437000751 453657955 469686091 484655827
1183D84655827J3623894J2142330J0423303Q289694N934179L813088K348066J705229
$$ 484655827 498279721 510422051 520845354 529135048 535069227 538882315 541230381 542935610
1199.3E42935610J707613K057076K500176K968848L578067M375279N134225N451917
$$ 542935610 544643223 546700299 549200475 552169323 555747390 560122669 565256894 570708811
1215.6E70708811N045176L912926K340495Q08537k91765r40442j393795j807391k105117
$$ 570708811 575753987 579666913 582007408 582815945 582524180 581583738 580189943 578382552 576277435
1234E76277435k149165j877189j330971n81444K50042R70840J480043J853228K143085
$$ 576277435 574128270 572251081 570920110 570338666 570588708 571559548 573039591 574892819 577035904
1252.3E77035904K264380K133727J740396J224876R05871J073242J677155K265632
$$ 577035904 579300284 581434011 583174407 584399283 585305154 586378396 588055551 590321183
1268.6E90321183K375841J892448J049161K03967l77298o39855p53343r32515j199365
$$ 590321183 592697024 594589472 595638633 595842600 595465302 594825447 594072104 593139589 591940224
1287E91940224j432597j579583j676440j813710k030552k249658k385020k353728k149701
$$ 591940224 590507627 588928044 587251604 585437894 583407342 581157684 578772664 576418936 574269235
1305.4E74269235j914084j735151j613140j580775j627028j717507j839400k193689
$$ 574269235 572355151 570620000 569006860 567426085 565799057 564081550 562242150 560048461
1321.7E60048461l105462m426360n590081o129920n880237m978657l798187k637386
$$ 560048461 556942999 552516639 546926558 540796638 534916401 529937744 526139557 523502171
1338E23502171j481354m00305K88367N98491N88715K56002k30372p16269j046300j192689
$$ 523502171 522020817 521620512 521908879 522507370 523096085 523352087 523121715 522405446 521359146 520166457
1358.4E20166457j276851j249909r10223o19292m46558M172O12378J267135J604379
$$ 520166457 518889606 517639697 516729474 516110182 515663624 515667796 516280174 517547309 519151688
1376.7E19151688J476109J375198J743197K696932M083216M642069L551960J984239
$$ 519151688 520627797 522002995 523746192 526443124 530526340 535168409 538720369 540704608
1393.1E40704608N76794l78132q84652j019299j280188j821816j998902j957476j881003
$$ 540704608 541281402 540903270 540018618 538999319 537719131 535897315 533898413 531940937 530059934
1411.4E30059934j519144j100480r85206o99222M9711O36994J110196J475573J733184
$$ 530059934 528540790 527440310 526455104 525755882 525805593 526442587 527552783 529028356 530761540
1429.8E30761540J886427J775205J898170K452552K466917K191782J720608R21964
$$ 530761540 532647967 534423172 536321342 538773894 541240811 543432593 545153201 546075165
1446.1E46075165K0147n95987r49621j363576k309143k127767M1664J298308K735734
$$ 546075165 546095312 545499325 544549704 543186128 540876985 538749218 538790882 540089190 542824924
1464.5E42824924M674017N713106P024228J0063946J1325121J0051370R030938Q466125
$$ 542824924 547498941 553212047 560236275 570300221 581625342 591676712 600707650 609173775
1480.8F09173775P996022O932915O154835O279170O465376N333960M429579M525184
$$ 609173775 617169797 624102712 630257547 636536717 643002093 648336053 652765632 657290816
1497.1F57290816M321754L562987K706885K305210L281474L666520K761007K106666
$$ 657290816 661612570 665175557 667882442 670187652 673469126 677135646 679896653 682003319
1513.4F82003319J744926J883269J958012K083242K142608J717687J527071J358569
$$ 682003319 683748245 685631514 687589526 689672768 691815376 693533063 695060134 696418703
1529.7F96418703J097977J149714J154423M43518k60830K31266R01699R31442N18977
$$ 696418703 697516680 698666394 699820817 700264335 700003505 700234771 701136470 702067912 702586889
1548.1G02586889N7936j77324l56853o27577j030982k97427M20809j41203o32763q60811
$$ 702586889 702644825 702467501 702110648 701483071 700452089 700154662 700575471 700434268 699801505 698940694
1568.5F98940694o69479k23994o12498j267612r56177p48456j037001j197875j312315
$$ 698940694 698271215 698047221 697434723 696167111 695210934 694462478 693425477 692227602 690915287
1586.8F90915287j562834j899719k132714k213955k160788k187967k467930k763987
$$ 690915287 689352453 687452734 685320020 683106065 680945277 678757310 676289380 673525393
1603.2F73525393k964079l174961l349483l251553l166437l873706m559338l339648
$$ 673525393 670561314 667386353 664036870 660785317 657618880 653745174 649185836 645846188
1619.5F45846188k890110l490984l220737k961994k861023k304852k265989k580226
$$ 645846188 642956078 639465094 636244357 633282363 630421340 628116488 625850499 623270273
1635.8F23270273j321912j28209J33216J13964K49863J252472J722277J934766L618479
$$ 623270273 621948361 621820152 621953368 622067332 622317195 623569667 625291944 627226710 630845189
1654.1F30845189L807902L233254L342748L992856M548609M119038M210830N086899
$$ 630845189 634653091 637886345 641229093 645221949 649770558 653889596 658100426 663187325
1670.5F63187325M842877M862726N361557M833341M201948M303933N735397N446970
$$ 663187325 668030202 672892928 678254485 683087826 687289774 691593707 697329104 702776074
1686.8G02776074M311085M184365L562332L138780L058195K711892K898992K500176
$$ 702776074 707087159 711271524 714833856 717972636 721030831 723742723 726641715 729141891
1703.1G29141891K000630K166152K070308J737356J511395J536011K359748L129661
$$ 729141891 731142521 733308673 735378981 737116337 738627732 740163743 742523491 745653152
1719.4G45653152K732873K291441K140701J924932J782239J678288K018928K467275
$$ 745653152 748386025 750677466 752818167 754743099 756525338 758203626 760222554 762689829
1735.7G62689829J932323J612902J793623K020537K131522K101243K186477K377450
$$ 762689829 764622152 766235054 768028677 770049214 772180736 774281979 776468456 778845906
1752G78845906K130449J948774K085566J977087J837968J581252J132488R66370J066625
$$ 778845906 780976355 782925129 785010695 786987782 788825750 790407002 791539490 792505860 793572485
1770.4G93572485J400173J652897J255989P68721P04288R61960J168429J159847P84219
$$ 793572485 794972658 796625555 797881544 798650265 799354553 800316513 801484942 802644789 803429008
1788.8H03429008K77698M00483R57966J106977R84550Q56340P46250N86450N35190
$$ 803429008 803706706 804107189 805065155 806172132 807156682 808013022 808759272 809345722 809880912
1807.1H09880912O87182R08733R07182O18101L58521L82245N24104O11007O70016M82499
$$ 809880912 810568094 811476827 812384009 813002110 813360631 813742876 814266980 814877987 815548003 816030502
1827.5H16030502J86801L29852N94795O22988O12914M40240j0192k95758J00553N59568
$$ 816030502 816217303 816547155 817141950 817764938 818377852 818818092 818807900 818512142 818612695 819172263
1847.9H19172263O25372M46141J57237k6107o914J90973L68715L05354l0041k22206
$$ 819172263 819797635 820243776 820401013 820374906 820367992 820558965 820927680 821233034 821202993 820980787
1868.3H20980787R8944M33385N12064M94361L79264K03967J09911J64509K67267L46244
$$ 820980787 821079731 821513116 822025180 822519541 822898805 823102772 823212683 823377192 823644459 823990703
1888.7H23990703M40955L18706N2273N3763K13206K93613K83479J77384p033q4937
$$ 823990703 824431658 824750364 824802637 824856400 825069606 825363219 825646698 825824082 825817049 825732112
1909.1H25732112N1260J95682J60754M7624M7147K0087K2590J99080L14891K88010
$$ 825732112 825783372 825979054 826139808 826187432 826234579 826254666 826277256 826476336 826791227 827079237
1929.5H27079237J73687L9936l2843k1278K0682R2268K26856K39670J21891J00434
$$ 827079237 827252924 827292860 827260017 827238739 827259421 827351689 827578545 827818215 827940106 828040540
1949.9H28040540J68503K31564K75194K56181J78039R8646M2856P1167K25366L02374
$$ 828040540 828209043 828440607 828715801 828971982 829150021 829248667 829291523 829362690 829588056 829890430
1970.3H29890430K09093J04249M3690K3186P0989J65582J73449N2572r2566j42634
$$ 829890430 830099523 830203772 830247462 830270648 830341637 830507219 830680668 830733240 830640674 830498040
1990.7H30498040j2875J69873J89484O0796p8261j58667j85847j28389l8862r6977
$$ 830498040 830485165 830655038 830844522 830905318 830827057 830668390 830482543 830354154 830315292 830218315
2011.1H30218315k78473m54008m96447l72947k99990m28498n46753m10318k72930k83301
$$ 830218315 829939842 829485834 828989387 828616440 828316450 827887952 827341199 826930881 826657951 826374650
2031.5H26374650k29180j53482k39372m21047m81069l89755k22266o1214j5020r2566
$$ 826374650 826145470 825991988 825752616 825331569 824850500 824460745 824238479 824177265 824162245 824069679
2051.9H24069679k16782k39790q2850J16110K01583J43647J8656n3942l4154P6652
$$ 824069679 823852897 823613107 823530257 823646367 823847950 823991597 824010253 823956311 823922157 823998809
2072.3H23998809K11477K15769N5551r5009r4295N0366K40505L11672J92881J133n2512
$$ 823998809 824210286 824426055 824481606 824386597 824292302 824342668 824583173 824894845 825087726 825088859 825036347
2094.7H25036347N3644J91033K94387K85268J46866J5438J7821J08600J96993K34425
$$ 825036347 825089991 825281024 825575411 825860679 826007545 826022983 826040804 826149404 826346397 826580822
2115.1H26580822J54615l7611j61409p7128J05977J86741R0957n8592j13010o9499
$$ 826580822 826735437 826697826 826536417 826459289 826565266 826752007 826842964 826784372 826671362 826601863
2135.5H26601863L0577J51038J81079P1347o2227q2732M6552K12550K60830J85966
$$ 826601863 826632440 826783478 826964557 827035904 826973677 826890945 826937497 827150047 827410877 827596843
2155.9H27596843Q8930M5956J28448L15189M47690M29035L41951L10660L47018M28677
$$ 827596843 827685773 827731729 827860177 828175366 828623056 829052091 829394042 829704702 830051720 830480397
2176.3H30480397N32508N91159N23448L53991K38836K93315M54783N47588M87089L39687
$$ 830480397 831012905 831604064 832127512 832481503 832720339 833013654 833468437 834016025 834503114 834842801
2196.7H34842801K14338K18451L67880N11587N21362M00424K56717K27630L11077M27842
$$ 834842801 835057139 835275590 835643470 836155057 836676419 837076843 837333560 837561190 837872267 838300109
2217.1H38300109M87208M00067K25782J17779J46329K77043L91125L96908K98977J27434
$$ 838300109 838787317 839187384 839413166 839530945 839677274 839954317 840345442 840742350 841041327 841168761
2237.5H41168761N245Q0288K62678L71515L43860J53780l6717k1398J71304L69191
$$ 841168761 841174006 841254294 841516972 841888487 842232347 842386127 842349410 842328012 842499316 842868507
2257.9H42868507L52919J43349k444K5928J77920L58284L96788K46763O8367j2398
$$ 842868507 843221426 843364775 843362331 843388259 843566179 843924463 844321251 844568014 844636381 844623983
2278.3H44623983N8710K19167L07381K52128Q4936q7261r2208R0062K54095K48432
$$ 844623983 844682693 844901860 845209241 845461369 845546305 845459044 845366836 845456898 845710993 845959425
2298.7H45959425Q9228j01864j64926l7372J26838J49131O7175l1949j06096j00016
$$ 845959425 846048653 845946789 845781863 845744491 845871329 846020460 846087635 846055686 845949590 845849574
2319.1H45849574n5373j9610L2365r358j74582k21729p3969m5002j76191k19703k61247
$$ 845849574 845794201 845774591 845806956 845797598 845623016 845401287 845327318 845282316 845106125 844886422 844625175
2341.5H44625175k97844j12832Q0168N7817n7936k05100l45706l29316j75595m4048
$$ 844625175 844327331 844214499 844294667 844352484 844294548 844089448 843743742 843414426 843238831 843194783
2361.9H43194783l1710j92463l67225l26395j47640K980L8862j7643p0512r8765r3877
$$ 843194783 843163073 842970610 842603385 842276990 842129350 842132330 842171192 842153549 842083037 841984272 841890395
2384.3H41890395q5533j17600j66953k15411k65360k90155k63274j99020j77502k53439
$$ 841890395 841804862 841687262 841520309 841304898 841039538 840749383 840486109 840287089 840109587 839856148
2404.7H39856148l53933l97384l77297l45826l38674l47912m18246n54502n99742n21839
$$ 839856148 839502215 839104831 838727534 838381708 838043034 837695122 837276876 836722374 836122632 835600793
2425.1H35600793m78267m76241m78447n21004n65946n50926n06639m97640n46217o15775
$$ 835600793 835122526 834646285 834167838 833646834 833080888 832529962 832023323 831525683 830979466 830363691
2445.5H30363691o27101n82993n55217n23448m64737m73261n38707n64635n54979n18381
$$ 830363691 829736590 829153597 828598380 828074932 827610195 827136934 826598227 826033592 825478613 824960232
2465.9H24960232m62592m27544m49300n26488n76317n05686m04179l79085l95596m29750
$$ 824960232 824497640 824070096 823620796 823094308 822517991 822012305 821608126 821229041 820833445 820403695
2486.3H20403695m53770m13597l16262k54214k72095l22521l54290l40402k89440k29180
$$ 820403695 819949925 819536328 819220066 818965852 818693757 818371236 818016946 817676544 817387104 817157924
2506.7H17157924k09093k62499l56555l99351l62813l24548l25083l69430m53353n29349
$$ 817157924 816948831 816686332 816329777 815930426 815567613 815243065 814917982 814548552 814095199 813565850
2527.1H13565850n51998n06044m52518m81367n79596o54578o59228o21438n53906n19752
$$ 813565850 813013852 812507808 812055290 811573923 810994327 810339749 809680521 809059083 808505177 807985425
2547.5H07985425n69940o33537o69897o68824o08742n20527m77553n28574o46829p08938
$$ 807985425 807415485 806781948 806112051 805443227 804834485 804313958 803836405 803307831 802661002 801952064
2567.9H01952064o17266m90546m80294n44846o01411o14286n63561m85480m31121m27305
$$ 801952064 801334798 800844252 800363958 799819112 799217701 798603415 798039854 797554374 797123253 796695948
2588.3G96695948m55857m67896m60565m14551l20911k99752m07278n21362n73576n81979
$$ 796695948 796240091 795772195 795311630 794897079 794576168 794276416 793869138 793347776 792774200 792192221
2608.7G92192221n61059n58078o34730p69734q70526q93593q68499q70407r38952j057863
$$ 792192221 791631162 791073084 790438354 789668620 788798094 787904501 787036002 786165595 785226643 784168780
2629.1G84168780j182079j204551j086950r75311r93132j110733j225650j230359j137078
$$ 784168780 782986701 781782150 780695200 779719889 778726757 777616024 776390374 775160015 774022937
2647.4G74022937j019776r55701j037538j187444j210153j093089r74596r32097r52959
$$ 774022937 773003161 772047460 771009922 769822478 768612325 767519236 766544640 765612543 764659584
2665.8G64659584j012922j077771j034796q84712p89821q09610q94129r66192r44912
$$ 764659584 763646662 762568891 761534095 760649383 759859562 759049952 758155823 757189631 756244719
2684.1G56244719q44002p77960p85887q54015r60708j031041j018882r60529r48965
$$ 756244719 755400717 754622757 753836870 752982855 752022147 750991106 749972224 749011695 748062730
2702.5G48062730j019240j125753j201689j186728j052439r27985r70066j080036j094639
$$ 748062730 747043490 745917737 744716048 743529320 742476881 741548896 740578830 739498794 738404155
2720.9G38404155j004756q92222q13543p96676q40187q91149q81493p85351o90997
$$ 738404155 737399399 736507177 735693634 734896958 734056771 733165622 732284129 731498778 730807781
2739.2G30807781o80089p17103p64907p87258p11500n99206n63681o03020o58572o54101
$$ 730807781 730127692 729410589 728645682 727858424 727146924 726547718 725984037 725381017 724722445 724068344
2759.6G24068344n87702n19872m95374n53608o69301p39753p31408o98090p05719q15392
$$ 724068344 723480642 722960770 722465396 721911788 721242487 720502734 719771326 719073236 718367517 717552125
2780G17552125r76264j052260j058460j095593j147747j213312j326680j414955j451790
$$ 717552125 716575861 715523601 714465141 713369548 712221801 711008489 709681809 708266854 706815064
2798.4G06815064j503468j563072j625359j738846j890123j978457j965642j951218
$$ 706815064 705311596 703748524 702123165 700384319 698494196 696515739 694550097 692598879
2814.7F92598879k020299k165794k313495k398610k462745k537191k591252k666414
$$ 692598879 690578580 688412786 686099291 683700681 681237936 678700745 676109493 673443079
2831F73443079k814651k980351l085732l187061l405154l707528l995716m194439m193663
$$ 673443079 670628428 667648077 664562345 661375284 657970130 654262602 650266886 646072447 641878784
2849.3F41878784l914416l470838l144384l046035l138960l418028l847003m416764
$$ 641878784 637964368 634493530 631349146 628303111 625164151 621746123 617899120 613482356
2865.7F13482356n047202n556047n901754o130576o176651n924880n435288m853249
$$ 613482356 608435154 602879107 596977353 590846777 584670126 578745246 573309958 568456709
2882E68456709m159987l346741k555966j859963j263142q68439p34926p77185q97109
$$ 568456709 564296722 560949981 558394015 556534052 555270910 554402471 553667545 552890360 551993251
2900.3E51993251j053393j283884j668751k141655k627075l192782l791690m233658
$$ 551993251 550939858 549655974 547987223 545845568 543218493 540025711 536234021 532000363
2916.6E32000363m378379m256367l941834l391981k539635j466393l34442Q44180K105356
$$ 532000363 527621984 523365617 519423783 516031802 513492167 512025774 511691332 512535512 514640868
2935E14640868L336012M427672N357444O001770O313265O427467O503224O629944O680071
$$ 514640868 517976880 522404552 527761996 533763766 540077031 546504498 553007722 559637666 566317737
2953.4E66317737O604552O533683O426334O175280N798697N383074N026997M751920
$$ 566317737 572922289 579455972 585882306 592057586 597856283 603239357 608266354 613018274
2969.7F13018274M539013M364372M194140M109025M064202L853441L512799L183544
$$ 613018274 617557287 621921659 626115799 630224824 634289026 638142467 641655266 644838810
2986F44838810K874613K614796K386212K101362J768172J363158R30965N98311L18110
$$ 644838810 647713423 650328219 652714431 654815793 656583965 657947123 658878088 659476399 659794509
3004.4F59794509N9009j50561l90411p43508j119614j355886j508236j675189j812338
$$ 659794509 659853518 659702957 659312546 658569038 657449424 656093538 654585302 652910113 651097775
3022.7F51097775j981974k182245k254963k254367k300203k442956k597630k581298
$$ 651097775 649115801 646933556 644678593 642424226 640124023 637681067 635083437 632502139
3039F32502139k540827k674222k867401k946198k917170k939999l013552l054738l098845
$$ 632502139 629961312 627287090 624419689 621473491 618556321 615616322 612602770 609548032 606449187
3057.4F06449187l094137l024340k984583k978861l066063l219247l233969l076732
$$ 606449187 603355050 600330710 597346127 594367266 591301203 588081956 584847987 581771255
3073.7E81771255k884031k869606l068089l222823l280521l323436l249526l156781
$$ 581771255 578887224 576017618 572949529 569726706 566446185 563122749 559873223 556716442
3090E56716442l228843l288746l184974l049672l092289l242671l204346l047884l060162
$$ 556716442 553487599 550198853 547013879 543964207 540871918 537629247 534424901 531377017 528316855
3108.4E28316855l194034l116130k874375k865970l052771l220022l332436l281176
$$ 528316855 525122821 522006691 519132316 516266346 513213575 509993553 506661117 503379941
3124.7E03379941l081620k956480l006547l080189k990395k825678k831489l016620
$$ 503379941 500298321 497341841 494335294 491255105 488264710 485439032 482607543 479590923
3141D79590923l101200k985150k848446k703369k594590k730757k941609k909004k772480
$$ 479590923 476489723 473504573 470656127 467952758 465358168 462627411 459685802 456776798 454004318
3159.4D54004318k727002k706170k645225k580970k547533k526044k529562k523035
$$ 454004318 451277316 448571146 445925921 443344951 440797418 438271374 435741812 433218777
3175.7D33218777k466529k393485k365380k391696k381027k287626k220661k243071
$$ 433218777 430752248 428358763 425993383 423601687 421220660 418933034 416712373 414469302
3192D14469302k241612k194226k157241k097040k025426j958131j892209j923889j994014
$$ 414469302 412227690 410033464 407876223 405779183 403753757 401795626 399903417 397979528 395985514
3210.3C95985514j946360j815468j712352j734465j798094j776188j750112j724511
$$ 395985514 394039154 392223686 390511334 388776869 386978775 385202587 383452475 381727964
3226.7C81727964j583457j371175j313717j536220j747161j676023j491785j357138
$$ 381727964 380144507 378773332 377459615 375923395 374176234 372500211 371008426 369651288
3243C69651288j260311j276314j408279j428187j276731j143187j157463j219392j201063
$$ 369651288 368390977 367114663 365706384 364278197 363001466 361858279 360700816 359481424 358280361
3261.3C58280361j152098j077563r23276p93517q97288j108676j165837j128674j069605
$$ 358280361 357128263 356050700 355127424 354333907 353436619 352327943 351162106 350033432 348963827
3279.7C48963827r74476q95173q79854q55237p37607o92219q21382r65834j040279
$$ 348963827 347989351 347094178 346214324 345359087 344621480 343929261 343107879 342142045 341101766
3298C41101766r76712p68155o16938p04467r91702j238465j251996j086265r52393
$$ 341101766 340125054 339356899 338739961 338035494 337043792 335805327 334553331 333467066 332514673
3316.4C32514673r19669q73775p89433p97064r83119j140534j080960r66669q23259
$$ 332514673 331595004 330721229 329931796 329134732 328151613 327011079 325930119 324963450 324140191
3334.8C24140191o35683p18803r97930j083285j054823r22204o96986q29369j181424
$$ 324140191 323504508 322785705 321787775 320704490 319649667 318727463 318030477 317201108 316019684
3353.1C16019684j207173r66430p97092p91610p47293n69999n60552q83311j221746
$$ 316019684 314812511 313846081 313048989 312257379 311510086 310940087 310379535 309496224 308274478
3371.5C08274478j162619q40693o99193p14123p25806o80208n53101l31611r1076k12758
$$ 308274478 307111859 306271166 305571973 304857850 304132044 303451836 302898735 302567124 302476048 302263290
3391.9C02263290o42866o70910j56969Q6904l80218q01772n79357k21730j12682j36912
$$ 302263290 301620424 300949514 300792545 300879449 300499231 299697459 299118102 298896372 298783690 298646778
3412.3B98646778k53409l13163k02864j14710r2178N7101K90751L65288K43723K99573
$$ 298646778 298393369 298080206 297877342 297762632 297670454 297727555 298018306 298383594 298627317 298926890
3432.7B98926890M77999K90335o7234p9185J99109M09097M54366M57138N04940N80550
$$ 298926890 299404889 299695224 299627990 299548805 299747914 300157011 300611377 301068515 301573455 302154005
3453.1C02154005O71446P84844Q58992P39992P37667J108736J274317Q60215L64810
$$ 302154005 302825451 303610295 304469287 305209279 305946946 307055682 308329999 309190214 309555024
3471.4C09555024L83824P83175J151622J105278P15971P01309J071631J138926J006633
$$ 309555024 309938848 310722023 311873645 312978923 313694894 314396203 315467834 316606760 317613393
3489.8C17613393J094282J193881J209408J182228J147658J116544R81509R19253J075715
$$ 317613393 318707675 319901556 321110964 322293192 323440850 324557394 325538903 326458156 327533871
3508.1C27533871J344234J566440J489192J249164J236737J427144J571059J380384
$$ 327533871 328878105 330444545 331933737 333182901 334419638 335846782 337417841 338798225
3524.4C38798225J104385J191645J506418J770676J887440J768530J637369J826674
$$ 338798225 339902610 341094255 342600673 344371349 346258789 348027319 349664688 351491362
3540.8C51491362K004921J861513J664519J768917J928717K006918K166450K345771
$$ 351491362 353496283 355357796 357022315 358791232 360719949 362726867 364893317 367239088
3557.1C67239088K489060K564311K386302K118915K630085L450095L379226L093183
$$ 367239088 369728148 372292459 374678761 376797676 379427761 382877856 386257082 389350265
3573.4C89350265L177792L368139L585011L805906L733128L342688L318191L980428
$$ 389350265 392528057 395896196 399481207 403287113 407020241 410362929 413681120 417661548
3589.7D17661548M137784L919989M085600M368216M350960M334927M246861L882288
$$ 417661548 421799332 425719321 429804921 434173137 438524097 442859024 447105885 450988173
3606D50988173L931642M331857M426360M522890M441977M308462M792005M909753M316867
$$ 450988173 454919815 459251672 463678032 468200922 472642899 476951361 481743366 486653119 490969986
3624.4D90969986L576606L627151M823715M952311M538596M388929M275500M231871
$$ 490969986 494546592 498173743 502997458 507949769 512488365 516877294 521152794 525384665
3640.7E25384665M198312L855646L372014L744483M815638M587829L906905M210711
$$ 525384665 529582977 533438623 536810637 540555120 545370758 549958587 553865492 558076203
3657E58076203M470289L912270L500580L402353K987087K733707L345370L120303K659441
$$ 558076203 562546492 566458762 569959342 573361695 576348782 579082489 582427859 585548162 588207603
3675.4E88207603L473043L753722L435611L152609K748490K345323K237320K594173
$$ 588207603 591680646 595434368 598869979 602022588 604771078 607116401 609353721 611947894
3691.7F11947894K800763K596915K234637J887441J900434K250433K136469J535952
$$ 611947894 614748657 617345572 619580209 621467650 623368084 625618517 627754986 629290938
3708F29290938J057983J475334K364397K290130J715779J387835J363456J404285J610160
$$ 629290938 630348921 631824255 634188652 636478782 638194561 639582396 640945852 642350137 643960297
3726.4F43960297J833379J485646R01163Q35061J574218K002299J362443K99811L26157
$$ 643960297 645793676 647279322 648180485 649015546 650589764 652592063 653954506 654254317 654580474
3744.7F54580474J400530J064241P09295J726032K019405J330316R91225J320184J266598
$$ 654580474 655981004 657045245 657754540 659480572 661499977 662830293 663821518 665141702 666408300
3763.1F66408300Q82805Q05616Q72433J184225J403094J144647Q50737P95126Q92461
$$ 666408300 667291105 668096721 668969154 670153379 671556473 672701120 673551857 674346983 675239444
3781.4F75239444Q21054Q03232R75847J039148R59158O76870M66108N53191L09646
$$ 675239444 676060498 676863730 677839577 678878725 679837883 680514753 680980861 681534052 681843698
3799.8F81843698M05431J122057R16064Q58605J276553J021564L00467N8651L94404
$$ 681843698 682249129 683371186 684287250 685145855 686422408 687443972 687744439 687803090 688197494
3818.1F88197494K85089P61270J321316R97186P57932O02126N56887O38723K49147
$$ 688197494 688482583 689243853 690565169 691562355 692320287 692922413 693479300 694118023 694367170
3836.5F94367170j19N67079J001596J095236R78767N33820l68894j068890N26071J862228
$$ 694367170 694367051 694934130 695935726 697030962 698009729 698543549 698174655 697105765 697631836 699494064
3856.9F99494064J258135M07934M4882L49343M66526J71244M16875P70807Q97407P26402
$$ 699494064 700752199 701160133 701205015 701554358 702020884 702192128 702609003 703379810 704277217 705003619
3877.3G05003619J82927K84850N58615M26531N79834M09663J61409N40137N98133R3699
$$ 705003619 705186546 705471396 706030011 706456542 707036376 707446039 707607448 708147585 708745718 708839417
3897.7G08839417k40922j15633L53872Q62956Q90792O61373N04255J86324j65939k325
$$ 708839417 708598495 708482862 708836734 709699690 710590482 711251855 711756110 711942434 711776495 711774170
3918.1G11774170L94822L29494J28329K78413L35157J16408K16782N04613M29094K07603
$$ 711774170 712168992 712498486 712626815 712905228 713240385 713356793 713573575 714078188 714507282 714714885
3938.5G14714885M8041M4882K50996L20375K69711L04281K83242K06172J67847K06887
$$ 714714885 714762926 714807808 715058804 715379179 715648890 715953171 716236413 716442585 716610432 716817319
3958.9G16817319K54095K71201K65300J82987J29521J49309J62840J68860J76966J68324
$$ 716817319 717071414 717342615 717607915 717790902 717920423 718069732 718232572 718401432 718578398 718746722
3979.3G18746722J76608K09630J83284J20163J30415J93119J92881J38521J48594
$$ 718746722 718923330 719132960 719316244 719436407 719566822 719759941 719952822 720091343 720239937
3997.6G20239937
$$ 720239937
##END=$$ End of the data block
