##TITLE=$$ Begin of the data block
##JCAMP-DX=5.00 $$ ACD/SpecManager v 10.08
##SPECTROMETER/DATA SYSTEM=16PC
##DATE=Wed Sep 25 13:59:31 2013
##DATA TYPE=INFRARED SPECTRUM
##DATA CLASS=XYDATA
##ORIGIN=
##OWNER=
##NPOINTS=3601
##FIRSTX=400.00000000
##LASTX=4000.00000000
##MAXX=4000.00000000
##MINX=400.00000000
##MAXY=44.50965118
##MINY=21.69680595
##XFACTOR=1.0000000000
##YFACTOR=0.000000100000000
##FIRSTY=37.69228363
##DELTAX=1.00000000
##XUNITS=1/CM
##YUNITS=TRANSMITTANCE
##XYDATA=(X++(Y..Y))
$$ plain form
400 376922836 383395920 382113686 383758774 380770683 365229378 348893166 341640244 341190567 351605644
409 351605644 363738289 366587639 369775772 382301331 395030518 402201653 402694244 388874512
417 388874512 374517899 373355408 377886276 386245270 395255814 401402702 403834839 399434319 391484489
426 391484489 379687805 371668091 379937172 389532547 386207123 380324364 377948303 377730598 382287025
435 382287025 385788689 380671501 374754677 374969940 376413345 375997086 375204315 373528976 373851051
444 373851051 381378403 388619423 387877464 384975662 383943100 382462502 378590355 375233421 374713440
453 374713440 376839142 383795509 390775909 392880936 392573357 390527000 387206306 382484207 378806343
462 378806343 379394073 381791115 385172615 387864609 386161079 385333061 391905289 398407707 398886909
$$ packed form
400C76922836O473084j282234J645088k988091j5541305j6336212p252922m49677J0415077
409C51605644J2132645K849350L188133J2525559J2729187P171135M92591j3819732
417C88874512j4356613j162491M530868Q358994R010544O146888K432137m400520p949830
426C91484489j1796684q019714Q269081R595375l325424n882759k376061k17705M556427
435C82287025L501664n117188n916824K15263J443405m16259p92771j675339L22075
444C73851051P527352P241020p41959k901802j032562j480598l872147l356934n19981
453C74713440K125702O956367O980400K105027l07579k046357l320694m722099l677864
462C78806343N87730K397042L381500K691994j703530q28018O572228O502418M79202
$$ plain form
471 398886909 395316124 384748230 375987778 379962196 387352448 391840935 395347824 397721519 398857346
480 398857346 398378601 396946411 394460678 392827759 394855270 397737274 399667282 400453796 398878098
489 398878098 396212578 392879715 390207748 389765968 391252747 395900726 400673866 402290573 402719040
498 402719040 403447647 402630577 397752304 392310143 389269829 387709389 388396034 389225235 387197266
507 387197266 385764618 387964020 392040253 398217430 403590927 404431114 403434753 401832581 400292397
516 400292397 400412064 400629044 399523964 398263702 397375565 397357216 400370598 401946793 395814171
525 395814171 389542351 390860329 393017273 390801659 387324333 383368988 380703926 382539978 385333290
534 385333290 386519432 386369934 383958588 380312920 376309624 371472130 364719849 358739395 356911659
$$ packed form
471C98886909l570785j0567894q760452L974418P390252M488487L506889K373695J135827
480C98857346m78745j432190k485733j632919K027511K882004J930008P86514j575698
489C98878098k665520l332863k671967m41780J486779M647979M773140J616707M28467
498D02719040P28607q17070m878273n442161l040314j560440O86645Q29201k027969
507C87197266j432648K199402M076233O177177N373497Q40187r96361j602172j540184
516D00292397J19667K16980j105080j260262q88137j8349L013382J576195o132622
525C95814171o271820J317978K156944k215614l477326l955345k665062J836052K793312
534C85333290J186142j49498k411346l645668m003296m837494o752281n980454j827736
$$ plain form
543 356911659 356072197 352955322 351242523 354435425 359806061 366014481 372398148 377830048 382362595
552 382362595 385694046 387759209 388107529 387591858 386599770 386074524 387676468 389638901 390847435
561 390847435 391005287 388731956 386163254 385630379 385163536 382985840 380847702 380051613 380164375
570 380164375 381476898 383115768 384413490 385043640 383997917 382652283 382660370 382179260 379048119
579 379048119 375870476 375039825 375025749 375106354 375248184 375468979 374890823 371648331 368719101 369244804
589 369244804 370865326 371995926 373449783 375770340 378181458 379976997 381488075 382475624 383942604
598 383942604 387890816 391082039 389821548 387478333 386336327 385954857 387128372 388432732 388381729
607 388381729 387954941 387560844 387423744 388130417 389000397 389499893 389774551 390009880 389549026 386908531
$$ packed form
543C56911659q39462l116875j712799L192902N370636O208420O383667N431900M532547
552C82362595L331451K065163L48320n15671r92088n25246J601944J962433J208534
561C90847435J57852k273331k568702n32875m66843k177696k138138p96089J12762
570C80164375J312523J638870J297722O30150j045723j345634Q087m81110l131141
579C79048119l177643q30651j4076Q0605J41830K20795n78156l242492k929230N25703
589C69244804J620522J130600J453857K320557K411118J795539J511078R87549J466980
598C83942604L948212L191223j260491k343215j142006l81470J173515J304360n1003
607C88381729m26788l94097j37100P06673Q69980M99496K74658K35329m60854k640495
$$ plain form
617 386908531 384752502 385835190 388399849 392194519 395459175 395627747 394863853 394522171 394460220
626 394460220 395245781 396102180 396431198 396263351 395213127 393928757 392853241 392214050 392796288 393368492
636 393368492 392486572 391570091 391900787 392445335 392385025 392356873 392820587 393489113 394516220 395038376
646 395038376 393455505 392127991 393818626 395718079 395219345 394475708 395121346 396104355 397122612
655 397122612 397559662 396280518 394537201 393048515 392276993 393202553 394991150 395614624 399634590
664 399634590 417003403 429519882 415403824 395344963 382954102 377685776 388154259 400487671
672 400487671 400511971 397746315 397606621 398224831 399967918 401544342 401471138 400687943 399431686 398326149
682 398326149 398583641 398674736 396882057 394979248 394331932 394445190 395373116 396830559 398865471 400531998
$$ packed form
617C86908531k156029J082688K564659L794670L264656J68572p63894l41682o1951
626C94460220P85561Q56399L29018j67847j050224j284370j075516o39191N82238N72204
636C93368492q81920r16481L30696N44548o0310k8152M63714O68526J027107N22156
646C95038376j582871j327514J690635J899453m98734p43637O45638R83009J018257
655C97122612M37050j279144j743317j488686p71522R25560J788597O23474M019966
664C99634590J7368813J2516479j4116058k0058861j2390861n268326J0468483J2333412
672D00487671K4300k765656j39694O18210J743087J576424p3204p83195j256257j105537
682C98326149K57492R1095j792679j902809o47316J13258R27926J457443K034912J666527
$$ plain form
692 400531998 400703659 399968643 398127785 396416435 396355858 396886597 397326965 398062935 399792175 400895615
702 400895615 399328232 397064438 395586739 394323349 393000603 392206192 392768135 393690834 394000282
711 394000282 394457092 395928612 397120247 396497269 395646095 395918121 396481018 397019882 397333145 397008171
721 397008171 396362762 395881882 394649048 390695114 387661438 389744759 393307915 395916214 398156166
730 398156166 399681091 400852432 402295113 402868729 400952568 398610611 397530556 397217255 398041725
739 398041725 399090996 399486542 399494400 398991356 398263702 397474747 396870117 396680832 397111168 398793945
749 398793945 400673141 401932220 402484169 401446342 400387993 400893211 402033806 403584251 405018806
758 405018806 405410042 405737381 407002945 408208847 408798943 408448944 406061401 403399963 401896477
$$ packed form
692D00531998J71661p35016j840858j711350o0577N30739M40368P35970J729240J103440
702D00895615j567383k263794j477699j263390j322746p94411N61943R22699L09448
711C94000282M56810J471520J191635o22978q51174K72026N62897N38864L13263l24974
721C97008171o45409m80880j232834l953934l033676K083321L563156K608299K239952
730C98156166J524925J171341J442681N73616j916161k341957j080055l13301Q24470
739C98041725J049271L95546P858n03044p27654p88955o04630j89285M30336J682777
749C98793945J879196J259079N51949j037827j058349N05218J140595J550445J434555
758D05018806L91236L27339J265564J205902N90096l49999k387543k661438j503486
$$ plain form
767 401896477 401446114 403124313 404821396 404134750 403017044 402945518 402943840 402487526 401698341 400188446
777 400188446 398961563 399117699 399977684 401488800 402869225 403290749 402838936 400836716 398743401
786 398743401 398052444 397981644 398297539 398845901 399594536 399940491 398793945 397580872 397648315 398140678
796 398140678 398775558 399180183 398589630 397894363 398205032 398093224 395975113 393424988 391468277 390166054
806 390166054 390406113 390730629 389568787 388146896 387612114 386630287 384039879 380469093 375683556
815 375683556 371106377 368087540 366610298 367768059 369580040 370187988 370314369 369590034 369429817
824 369429817 371733437 374675751 377501717 378900070 376716843 372722855 367812386 362458725 357792625
833 357792625 352733841 345596771 339324722 336461792 336519241 340417633 346473236 353467712 360924950
$$ packed form
767D01896477m50363J678199J697083o86646j117706p1526j678m56314p89185j509895
777D00188446j226883J56136Q59985J511116J380425M21524m51813k002220k093315
786C98743401o90957p0800L15895N48362P48635L45955j146546j213073O7443M92363
796C98140678O34880M04625n90553o95267L10669j11808k118111k550125j956711j302223
806C90166054K40059L24516j161842j421891n34782r81827k590408l570786m785537
815C75683556m577179l018837j477242J157761J811981O07948J26381p24335j60217
824C69429817K303620K942314K825966J398353k183227l993988m910469n353661m666100
833C57792625n058784p137070o272049k862930N7449L898392O055603O994476P457238
$$ plain form
842 360924950 368198395 374580841 378862839 381904373 383974304 385634651 387661705 389680862 391686211
851 391686211 393347511 394309540 394639244 394012451 393244743 393153419 393406639 394070854 394767532 395015717
861 395015717 395186424 395551453 395924339 396176834 396405945 396681557 396953583 397219162 397403946 397588005
871 397588005 397303581 395695457 394004364 393335800 393237114 393920670 394496460 393726349 392865410 392883530
881 392883530 393397827 394448776 395733109 396933060 398130646 399186859 400446167 402556190 404466629
890 404466629 405175209 405183334 404512634 403597107 402868500 402354012 402227173 402477264 403185616 404246826
900 404246826 405862350 407190552 407090187 406660538 406747093 406970253 407150726 407530289 408483276 409431229
910 409431229 409890671 409949074 409432907 408639183 407559624 406934967 407844772 409263611 410591125 411628723
$$ packed form
842C60924950P273445O382446M281998L041534K069931J660347K027054K019157K005349
851C91686211J661300R62029L29704o26793p67708r1324K53220O64215O96678K48185
861C95015717J70707L65029L72886K52495K29111K75612K72026K65579J84784J84059
871C97588005k84424j608124j691093o68564r8686O83556N75790p70111q60939J8120
881C92883530N14297J050949J284333J199951J197586J056213J259308K110023J910439
890D04466629P08580Q125o70700r15527p28607n14488j26839K50091P08352J061210
900D04246826J615524J328202j00365m29649Q6555K23160J80473L79563R52987R47953
910D09431229M59442N8403n16167p93724j079559o24657R09805J418839J327514J037598
$$ plain form
920 411628723 411885033 411638031 410897255 409975510 409147034 408534546 408450356 408597221 408770332 409001350
930 409001350 409435997 409524689 408418884 407159081 406502953 406448822 407577286 408896446 409462929 409710655
940 409710655 409760704 409605255 409322014 408773880 407586823 406547546 406440506 406897049 408047447 409176331
950 409176331 409462700 409351807 409052849 408451309 407349586 406205673 405516129 404965401 404405823 403828125
960 403828125 403027039 402442474 402646294 403034935 403132935 403125038 403042068 402867317 402799377 402220230 400276642
971 400276642 397872925 395307770 393541794 394026985 395586739 397602081 399848709 401920547 403743286
980 403743286 405228119 406011810 405437927 404293518 403021584 401994934 401886215 402236481 402949104
989 402949104 403608322 403710594 403421402 402683029 401659470 400361786 399188766 398660889 398423195 398325691
$$ packed form
920D11628723K56310k47002p40776r21745q28476o12488q4190J46865J73111K31018
930D09001350M34647Q8692j105805j259803o56128n4131J128464J319160N66483K47726
940D09710655N0049j55449k83241n48134j187057j039277j07040M56543J150398J128884
950D09176331K86369j10893k98958o01540j101723j143913o89544n50728n59578n77698
960D03828125q01086n84565K03820L88641R8000p897q2970j74751o7940n79147j943588
971D00276642k403717k565155j765976M85191J559754K015342K246628K071838J822739
980D03743286J484833P83691n73883j144409j271934j026650j08719L50266P12623
989D02949104O59218J02272k89192p38373j023559j297684j173020n27877k37694r7504
$$ plain form
999 398325691 398272285 398201447 397859116 396801224 395532150 394349098 393425941 393216133 393175354 392922897
1009 392922897 392419090 391393661 390156250 389079323 387704620 385618210 383056870 380100479 376803398
1018 376803398 373216858 369426727 365398636 361544609 358011703 355557671 354956627 356305122 360448380
1027 360448380 365912666 371797562 377228508 380574455 383203049 386160622 388777733 390698662 392027855
1036 392027855 392512550 392865181 393829575 395056725 396775017 397993088 397298355 396182556 395790558
1045 395790558 395749588 396153679 396743050 397267838 397789955 398430328 398760796 398149490 397327423 396819611
1055 396819611 396610489 396962891 397566795 398271332 398861885 398969650 398906479 398941498 398831596 398295174
1065 398295174 397714157 397431870 397280693 397184372 397210846 397525558 397756805 397402763 397016983 397047997
$$ packed form
999C98325691n3406p0838l42331j057892j269074j183052r23157k09808m0779k52457
1009C92922897n03807j025429j237411j076927j374703k086410k561340k956391l297081
1018C76803398l586540l790131m028091l854027l532906k454032o01044J348495M143258
1027C60448380N464286N884896N430946L345947K628594K957573K617111J920929J329193
1036C92027855M84695L52631R64394J227150J718292J218071o94733j115799l91998
1045C95790558m0970M04091N89371N24788N22117O40373L30468o11306q22067n07812
1055C96819611k09122L52402O03904P04537N90553J07765o3171L5019j09902n36422
1065C98295174n81017k82287j51177r6321K6474L14712K31247l54042l85780L1014
$$ plain form
1075 397047997 397309074 397768250 398409348 399380913 400156250 400087814 399684677 399301300 398752937 397787819
1085 397787819 396960983 396860123 397131920 397762299 398319702 398245087 397904625 397574921 396965752 395695190
1095 395695190 394314041 393476715 392488708 390928497 388630142 384873161 380897980 377591858 375294189
1104 375294189 374832611 375627518 377656708 380072823 381791840 383501053 385718117 387868156 389528046
1113 389528046 390757332 391338806 391678581 392238388 392630577 392540436 392209282 391713867 391232262 390984764
1123 390984764 390918503 391026993 391390076 392239075 393111458 393559227 393767586 393717537 393570404 393565903 393447876
1134 393447876 392811279 392342567 392894020 393559952 393623581 393367043 392780075 392022858 391178856 390467873
1144 390467873 390314560 390187759 389592667 388841858 388041496 387314568 387043228 386554260 385080338 383285294
$$ packed form
1075C97047997K61077M59176O41098R71565P75337o8436m03137l83377n48363r65118
1085C97787819q26836j00860K71797O30379N57403p4615l40462l29704o09169j270562
1095C95695190j381149q37326r88007j560211k298355l756981l975181l306122k297669
1104C75294189m61578P94907K029190K416115J719017J709213K217064K150039J659890
1113C89528046J229286N81474L39775N59807L92189r0141l31154m95415m81605k47498
1123C90984764o6261J08490L63083Q48999Q72383M47769K08359n0049j47133m501j18027
1134C93447876o36597m68712N51453O65932O3629k56538n86968p57217q44002p10983
1144C90467873j53313j26801n95092p50809q00362p26928k71340m88968j473922j795044
$$ plain form
1154 383285294 381751556 379955750 377577782 374589691 370875130 366377831 360957146 354749680 347077370
1163 347077370 340240250 335939636 335290680 340968628 349990845 361356964 371793289 377165565
1171 377165565 379053345 376138229 372977982 374521484 378275375 384009132 389881134 393693924 396282921
1180 396282921 397544403 398096542 398661385 398820877 398302078 397389908 396281967 394964218 393142700
1189 393142700 391853104 392308006 393680801 395877113 397913208 398451309 398459206 398448715 398447037 398797989
1199 398797989 399060974 398825645 398341675 397697678 396964569 396358261 395530930 393980026 392385712 391226997
1209 391226997 390604248 391025314 391746750 392179031 392367363 391994934 391556511 391518822 391645889 391932983
1219 391932983 392152786 392075310 391703835 390957108 389857521 388262749 386584053 385256271 384065170
$$ packed form
1154C83285294j533738j795806k377968k988091l714561m497299n420685o207466p672310
1163C47077370o837120m300614o48956N677948R022217J1366119J0436325N372276
1171C77165565J887780k915116l160247J543502L753891N733757N872002L812790K588997
1180C96282921J261482N52139N64843J59492n18799r12170j107941j317749j821518
1189C93142700j289596M54902J372795K196312K036095N38101P897j0491j678L50952
1199C98797989K62985k35329m83970o43997p33109o06308q27331j550904j594314j158715
1209C91226997o22749M21066P21436M32281J88332l72429m38423l7689J27067K87094
1219C91932983K19803p7476l71475p46727j099587j594772j678696j327782j191101
$$ plain form
1228 384065170 383069763 381881256 379853020 377816925 376708984 375569839 373605270 371254196 368712425
1237 368712425 365911713 362972717 359523773 355213165 350100288 343779564 337290535 331630936 326517105
1246 326517105 321620216 318071594 316927910 318084240 322172890 328037720 334761848 342258453 350333710
1255 350333710 358388176 365880966 372443199 377235641 381126633 384788971 387969742 390583496 392797012
1264 392797012 394643326 396437645 398597717 400846939 403320312 405199051 405419350 404850235 403780212
1273 403780212 402886391 403106461 403944969 405426254 406926651 407756081 408137321 408000946 407532921 406846771
1283 406846771 406090012 405485382 404917717 404280167 403767357 403815994 403589973 402134171 400239716 398697128
1293 398697128 396550674 392382126 388368149 386377792 385914307 388038864 389945030 388682365 385742645
$$ packed form
1228C84065170r95407j188507k028236k036095j107941j139145j964569k351074k541771
1237C68712425k800712k938996l448944m310608n112877o320724o489029n659599n113831
1246C26517105m896889l548622j143684J156330M088650N864830O724128P496605Q075257
1255C50333710Q054466P492790O562233M792442L890992L662338L180771K613754K213516
1264C92797012J846314J794319K160072K249222K473373J878739K20299n69115j070023
1273D03780212q93821K20070Q38508J481285J500397Q29430L81240j36375m68025o86150
1283D06846771p56759o04630n67665o37550n12810M8637k26021j455802j894455j542588
1293C98697128k146454m168548m013977j990357m63485K124557J906166j262665k939720
$$ plain form
1302 385742645 380617142 376354942 376578560 379056206 383396873 387700081 389469604 390100479 389853973
1311 389853973 389635086 390498161 392253647 395657539 398925781 399982681 400456200 401406288 402460327
1320 402460327 403852692 404820213 404358139 403423309 402592659 402000656 402090530 402513046 403141747 403748016
1330 403748016 403920898 404078484 404533615 405191422 406503906 407141190 405634384 402852287 398095627
1339 398095627 394596558 396924973 400368690 401072273 401032677 401086082 400856743 399986992 399255753 399592171
1349 399592171 400187263 400672188 400655746 399207611 397572517 396629562 396544228 398108978 400320282 403372993
1359 403372993 404463043 399007568 392535934 389136543 388549576 393950233 399118881 396478195 393276443
1368 393276443 395644417 399355888 403085480 404258728 397257805 389885178 389745712 391812096 393561134
$$ packed form
1302C85742645n125503m262200K23618K477646M340667M303208J769523O30875k46506
1311C89853973k18887Q63075J755486L403892L268242J056900M73519R50088J054039
1320D02460327J392365R67521m62074r34830q30650n92003Q9874M22516O28701O06269
1330D03748016J72882J57586M55131O57807J312484O37284j506806k782097m756660
1339C98095627l499069K328415L443717P03583l9596N3405k29339q69751p31239L36418
1349C99592171N95092M84925j6442j448135j635094r42955q5334J564750K211304L052711
1359D03372993J090050n455475o471634l399391n86967N400657N168648k640686l201752
1368C93276443K367974L711471L729592J173248p000923p372627j39466K066384J749038
$$ plain form
1377 393561134 395082703 395281296 395188828 395127068 396130791 401045303 404757500 401605377 396079292
1386 396079292 389697304 385712624 389443398 396212807 405139923 410152893 400253296 389339218
1394 389339218 391330261 395160675 392800102 389060745 385006676 383850555 392907143 400931854 395507088
1403 395507088 387463341 384314041 383590469 386519432 389525642 388338814 386270523 385182381 385153046
1412 385153046 387058029 390365601 397446632 400467644 388955345 373198509 357696991 349341393
1420 349341393 363048096 379237671 378054123 375241280 383072624 392102737 396740913 397695541
1428 397695541 391126633 385087013 388068199 394911766 407310715 413200378 393435249 370949745
1436 370949745 365561256 367474556 375637779 383638382 381868134 378859520 381706963 385114670 386401901
$$ packed form
1377C93561134J521569J98593r2468o1760J003723M914512L712197l152123n526085
1386C96079292o381988l984680L730774O769409Q927116N012970r899597j0914078
1394C89339218J991043L830414k360573l739357m054069j156121R056588Q024711n424766
1403C95507088q043747l149300p23572K928963L006210j186828k068291j088142k9335
1412C85153046J904983L307572P081031L021012j1512299j5756836j5501518q355598
1420C49341393J3706703J6189575j183548k812843P831344R030113M638176R54628
1428C97695541o568908o039620K981186O843567J2398949N889663j9765129k2485504
1436C70949745n388489J913300Q163223Q000603j770248l008614K847443L407707J287231
$$ plain form
1445 386401901 384816170 375632286 368086815 373308640 380894432 380294075 383073578 406595955 422918320
1454 422918320 399297256 367495308 349945526 341890564 348674774 362423668 380341034 392535210
1462 392535210 381614685 367279282 365644226 370069504 380365372 393292923 409410248 417133102
1470 417133102 396669846 373200912 370395660 372994919 372164230 372297287 375604172 379798431 383823395
1479 383823395 386199722 382840157 380509605 387373199 395143280 397380600 396702995 394245377 388015747
1488 388015747 371850967 359397163 366783371 380395660 394058685 401584167 389604340 373481293
1496 373481293 365818977 361521225 358701935 360332947 370348701 383972893 405217896 411649933
1504 411649933 366969337 316783676 300759544 300416470 314063301 330995789 335575104 340912323
$$ packed form
1445C86401901j585731r183884p545471N221825P585792o00357K779503K3522377J6322365
1454D22918320k3621064l1801948j7549782q054962O784210J3748894J7917366J2194176
1462C92535210j0920525j4335403j635056M425278J0295868J2927551J6117325P722854
1470D17133102k0463256k3468934k805252K599259q30689J33057L306885M194259M024964
1479C83823395K376327l359565k330552O863594P770081K237320o77605k457618o229630
1488C88015747j6164780j2453804P386208J3612289J3663025P525482j1979827j6123047
1496C73481293p662316m297752k819290J631012J0015754J3624192K1245003O432037
1504D11649933m4680596n0185661j6024132l43074J3646831J6932488M579315N337219
$$ plain form
1512 340912323 360978622 377552986 368814011 359534035 374630203 391846657 395582657 390789032
1520 390789032 370371590 354861755 373054733 393061638 384037476 371645432 374475479 382900009
1528 382900009 395671616 406239014 406429749 399857521 380182495 369091759 398370018 431380997
1536 431380997 439453125 430474281 392385941 356352577 359962692 371883850 368008842 364246826
1544 364246826 371360054 380679359 387096405 390687714 387374878 384511719 391318550 398116112 392512550
1553 392512550 391862869 424781075 445096512 396279564 338017464 316770782 315689087 342218857
1561 342218857 369929314 366175880 357043495 362757187 368251801 363862991 353611221 332000961
1569 332000961 317915192 336950760 363467941 381239395 387624016 364731293 342079887 351282349
$$ packed form
1512C40912323K0066299J6574364q738975r279976J5096168J7216454L736000m793625
1520C90789032k0417442j5509835J8192978K0006905r024162j2392044K830047Q424530
1528C82900009J2771607J0567398J90735o572228j9675026j1090736K9278259L3010979
1536D31380997Q072128q978844l8088340l6033364L610115J1921158l875008l762016
1544C64246826P113228R319305O417046L591309l312836k863159O806831O797562n603562
1553C92512550o49681L2918206K0315437m8816948n8262100k1246682j081695K6529770
1561C42218857K7710457l753434r132385N713692N494614m388810j0251770k1610260
1569C32000961j4085769J9035568K6517181J7771454O384621k2892723k2651406R202462
$$ plain form
1577 351282349 368163605 378003845 384046783 383002777 379750977 379000168 377968788 374846687 371425400
1586 371425400 369420776 367247086 363407135 359351158 356500854 353442917 348427544 343882790 341991425
1595 341991425 341739655 343389969 345296135 345767746 345199585 342829704 340436478 339721451 340151787
1604 340151787 342025299 344549904 346865425 349474411 352004776 356219521 364243279 374618073
1612 374618073 392205238 400167923 372379532 341569672 337080231 342947235 356737595 367199173
1620 367199173 356323967 341946106 337107162 338174362 349645844 360169907 354473572 348814735
1628 348814735 357339134 371107330 388556252 401699066 401292572 389541168 356542587 329373856
1636 329373856 342416534 363852005 368235588 370823631 380136490 390937805 405092697 409816971
$$ packed form
1577C51282349J6881256R840240O042938j044006l251800p50809j031380l122101l421287
1586C71425400k004624k173690l839951m055977k850304l057937n015373m544754j891365
1595C41991425k51770J650314J906166M71611n68161k369881k393226p15027M30336
1604C40151787J873512K524605K315521K608986K530365M214745Q023758J0374794
1612C74618073J7587165P962685k7788391l0809860m489441N867004J3790360J0461578
1620C67199173j0875206j4377861m838944J067200J1471482J0524063n696335n658837
1628C48814735Q524399J3768196J7448922J3142814m06494j1751404l2998581k7168731
1636C29373856J3042678K1435471M383583K588043R312859J0801315J4154892M724274
$$ plain form
1644 409816971 382736664 354485016 350851517 363993149 409422646 442861328 407120934 356443405
1652 356443405 327621002 315810680 337091217 365487328 375827789 381776581 392082214 396318436
1660 396318436 380413780 364050369 365590096 374920616 391606102 404977570 401012650 389333954
1668 389333954 369683495 357678185 380366554 403192291 391288528 372634659 364563217 364145737
1676 364145737 378496895 394818535 398294678 402092209 426300278 435332794 377254944 321200600
1684 321200600 338143120 370626450 379003067 380820045 377737503 377766838 395330887 412854691
1692 412854691 415475616 409477005 389621277 375607491 400585175 418963661 375533829 332298737
1700 332298737 348812828 377211571 385553360 385622749 374615898 364355545 369500656 378737221
$$ packed form
1644D09816971k7080307k8251648l633499J3141632M5429497L3438682l5740394n0677529
1652C56443405k8822403j1810322K1280537K8396111J0340461N948792J0305633M236222
1660C96318436j5904656j6363411J539727R330520J6685486J3371468l964920j1678696
1668C89333954j9650459j2005310K2688369K2825737j1903763j8653869q071442m17480
1676C64145737J4351158J6321640L476143L797531K4208069R032516n8077850n6054344
1684C21200600J6942520L2483330Q376617J816978l082542K9335J7564049J7523804
1692D12854691K620925n998611j9855728j4013786K4977684J8378486m3429832m3235092
1700C32298737J6514091K8398743Q341789O9389j1006851j0260353N145111R236565
$$ plain form
1708 378737221 384509583 390199661 397311935 403921356 410434494 411359329 398644676 380374680
1716 380374680 357784271 343365898 357875099 377755394 383163452 383712540 381138573 379226685
1724 379226685 384480476 390478859 391217232 391946793 396809807 403125305 415928612 416212311 368709106
1733 368709106 327231636 352250824 388525238 394057045 389586678 379473457 370859604 376338234
1741 376338234 383913498 382861633 381958008 389577408 396196136 393397331 386234741 375226021 365561981
1750 365561981 362952728 366355171 381401520 393773575 384439697 373171310 377752533 385110130
1758 385110130 388080368 386716118 373815308 363978882 375622025 390100250 391582489 390039902
1766 390039902 390706062 391960602 397036552 396605263 374978065 354467850 358013153 368046989
$$ packed form
1708C78737221N772362N690078P112274O609421O513138R24835j2714653j8269996
1716C80374680k2590409j4418373J4509201J9880295N408058N49088k573967j911888
1724C79226685N253791N998383P38373P29561M863014O315498J2803307K83699m7503205
1733C68709106m1477470K5019188L6274414N531807m470367j0113221q613853N478630
1741C76338234P575264j051865r03625P619400O618728k798805p162590j1008720r664040
1750C65561981k609253L402443J5046349J2372055r333878j1268387M581223P357597
1758C85110130K970238j364250j2900810r836426J1643143J4478225J482239j542587
1766C90039902O66160J254540N075950m31289k1627198k0510215L545303J0033836
$$ plain form
1774 368046989 373136520 377817612 384559402 388128052 380132217 372510681 378968735 385815620 380059242
1783 380059242 373307953 374083023 378651123 387994537 396484375 399144173 394997368 375673294 358375320
1792 358375320 362794151 373096237 379189720 383538971 385335197 384305000 378314247 372136345
1800 372136345 370555420 371403198 374705811 378664742 381369362 383182068 384156952 383307228 378282089
1809 378282089 373226624 372055511 373106232 377167473 380799522 379558105 377243042 376313934 376345406
1818 376345406 377685547 380470047 387194405 391124001 381865997 372888794 378477554 385789146 385711899
1827 385711899 381334763 369272461 359833946 366674881 376368294 378106117 377684593 377595177 376943588
1836 376943588 374157677 373759499 382833023 392117729 394663315 390621643 372318993 356281509
$$ packed form
1774C68046989N089531M681092O741790L568650p995835p621536O458054O846885n756378
1783C80059242o751289P75070M568100R343414Q489838K659798m146805j9324074j7297974
1792C58375320M418831J0302086O093483M349251J796226j030197n990753o177902
1800C72136345j580925Q47778L302613L958931K704620J812706R74884q49724n025139
1809C78282089n055465j171113J050721M061241L632049j241417k315063r29108L1472
1818C76345406J340141K784500O724358L929596r258004q977203N588760P311592p7247
1827C85711899m377136j2062302r438515O840935R693413J737823m21524q9416o51589
1836C76943588k785911l98178R073524R284706K545586m041672j8302650j6037484
$$ plain form
1844 356281509 362527618 372904778 373028259 371610870 373618355 375905762 376676331 376850853 376674194
1853 376674194 376375656 376437416 376344452 375519028 374630699 374085426 374094009 374880791 376810303 381228447
1863 381228447 385414124 387910614 386269073 374052773 361767769 359686623 362069855 367677689
1871 367677689 373281937 374136696 373554459 373404999 373269310 373475075 373650780 373307724 373123894 374051094
1881 374051094 374779205 373315811 372658730 377179642 380762100 376799583 371131668 367075424 365588913
1890 365588913 371157150 376514206 373619080 369279633 368431816 368649712 369179726 369937897 370694160
1899 370694160 371130447 370544662 369858017 369873276 370240440 371166954 371783485 370958786 369686127 368276367
1909 368276367 367643356 369154930 371758690 375669250 378451347 377031326 373535881 367628822 363624344
$$ packed form
1844C56281509O246109J0377160J23481j417389K007485K287407P70569J74522j76659
1853C76674194k98538O1760r2964q25424q88329n45273Q583P86782J929512M418144
1863C81228447M185677K496490j641541j2216300j2285004k081146K383232N607834
1871C67677689N604248Q54759n82237j49460j35689K05765J75705l43056j83830R27200
1881C74051094P28111j463394o57081M520912L582458l962517n667915m056244j486511
1890C65588913N568237N357056k895126m339447q47817K17896N30014P58171P56263
1899C70694160M36287n85785o86645J5259L67164R26514O16531q24699j272659j409760
1909C68276367o33011J511574K603760L910560K782097j420021l495445n907059m004478
$$ plain form
1918 363624344 368618965 373927116 370870132 366523743 365855713 366509438 368111610 369677544 369622726
1927 369622726 369371872 370196114 370969543 370777588 370254288 369790573 369197388 367963333 367444534 369431000
1937 369431000 372108002 375100861 375875931 369280319 362796555 364301224 367457886 367698212 367593994
1946 367593994 368653297 369498253 368743172 367919197 368633995 369268646 368183365 367045403 367424736
1955 367424736 367973099 367599487 367100945 366896400 367026825 367800941 368831406 370342712 370804291 367673416
1965 367673416 364210587 363215218 363525391 365416298 367375374 367623825 367235413 366611481 365988007
1974 365988007 365852585 365848541 365746994 365649948 365571976 365546227 365590820 365764389 366291275 366689911 366218796
1985 366218796 365882149 366992950 367881317 367054214 365291138 362154236 359800110 361306686 363469353
$$ packed form
1918C63624344M994621N308151l056984m346389o68030O53725J602172J565934n4818
1927C69622726k50854Q24242P73429j91955n23300m63715n93185j234055n18799J986466
1937C69431000K677002K992859P75070o595612o483764J504669L156662K40326j04218
1946C67593994J059303Q44956p55081q23975P14798O34651j085281j137962L79333
1955C67424736N48363l73612m98542k04545J30425P74116J030465J511306M61579l130875
1965C67673416l462829r95369L10173J890907J959076K48451l88412o23932o23474
1974C65988007j35422m044j01547r7046p7972k5749M4593J73569N26886L98636m71115
1985C66218796l36647J110801Q88367q27103j763076l136902k354126J506576K162667
$$ plain form
1994 363469353 363535652 363225937 363592606 363885155 363417397 363047600 363786469 364489059 364026299 363361588
2004 363361588 363335114 363187065 362065315 361087074 361331482 362060318 362967491 363833199 364507446 364472160
2014 364472160 362614136 360566139 359818230 359683762 360111008 360681992 360870590 360949020 361033440 361063957
2024 361063957 360983124 360898247 360946884 360979080 360887527 360679855 360279083 359831810 359433403 359157562 359141350
2035 359141350 359288445 359652748 359918594 359661102 359261284 358922501 358751755 359095802 359436035 359206924
2045 359206924 358895073 358862877 358916779 358993988 359062424 359052429 359009972 358998528 358894806 358457108 358102798
2056 358102798 358269691 358653564 359108200 359594574 360221405 360395660 359166870 357713928 356956711 356719971
2066 356719971 357381363 358198891 358437538 358452072 358332138 358134995 357931366 357768059 357723694 357772598
$$ packed form
1994C63469353O6299l09715L66669K92549m67758l69797P38869P02590m62760o64711
2004C63361588k6474j48049j121750r78241K44408P28836R07173Q65708O74247l5286
2014C64472160j858024k047997p47909j34468M27246N70984J88598P8430Q4420L0517
2024C61063957q0833q4877M8637L2196r1553k07672m00772m47273l98407k75841j6212
2035C59141350J47095L64303K65846k57492l99818l38783j70746L44047L40233k29111
2045C59206924l11851l2196N3902P7209O8436r995m2457j1444j03722m37698l54310
2056C58102798J66893L83873M54636M86374O26831J74255j228790j452942p57217k36740
2066C56719971O61392Q17528K38647J4534j19934j97143k03629j63307m4365M8904
$$ plain form
2076 357772598 357941132 358149757 358388176 358471375 358077049 357605438 357425232 357308617 357147942 356952209
2086 356952209 356623421 356373787 356436958 356648941 357003441 357259521 357069740 356744766 356465836 356272202
2096 356272202 356333504 356437683 356333504 356306801 356688995 357089043 357203255 357098351 356635323 356126556
2106 356126556 355909805 355768433 355548630 355396996 355468979 355581741 355610619 355534782 355192909 354879379
2116 354879379 354886780 355056305 355411301 355695724 355538139 355304489 355356445 355334778 354879837 354351501 353980560
2127 353980560 353792419 354012489 354271889 354191551 354027023 353939285 353831787 353595734 353425026 353514900
2137 353514900 353749275 354132423 354498138 354675522 354681015 354419937 354053726 353702316 353394012 353164902
2147 353164902 353111496 353430748 353856583 354198456 354424477 354401093 354242783 354006538 353730202 353452225
$$ packed form
2076C57772598J68534K08625K38419Q3199l94326m71611j80206j16615j60675j95733
2086C56952209l28788k49634O3171K11983L54500K56080j89781l24974k78930j93634
2096C56272202O1302J04179j04179k6703L82194M00048J14212j04904m63028n08767
2106C56126556k16751j41372k19803j51634P1983J12762K8878p5837l41873l13530
2116C54879379P401J69525L54996K84423j57585k33650N1956k1667m54941n28336l70941
2127C53980560j88141K20070K59400q0338j64528q7738j07498k36053j70708Q9874
2137C53514900K34375L83148L65715J77384N493k61078l66211l51410l08304k29110
2147C53164902n3406L19252M25835L41873K26021k3384j58310k36245k76336k77977
$$ plain form
2157 353452225 353226166 353159180 353128891 352998734 352915764 353085518 353195190 352907410 352501373 352103004
2167 352103004 351832886 351922035 352165222 352480659 352726707 352685928 352502098 352235565 351917038 351533432
2177 351533432 351275444 351420403 351692429 351957550 352065315 351664047 351222763 351167679 351274033 351514816
2187 351514816 351720352 351618271 351485977 351577301 351689110 351717949 351618271 351257553 350793114 350264053
2197 350264053 349891434 349992294 350317001 350785484 351203690 351315498 351226082 350892067 350500832 350218544
2207 350218544 350065460 350221634 350371361 350096703 349884262 350340843 350684395 350103149 349291573 348671417
2217 348671417 348245850 348215561 348409424 348751068 349154701 349538574 349814186 349844933 349690666 349288940
2227 349288940 348867416 348611107 348585587 349088440 349608421 349654427 349460373 349003792 348562698 348486671
$$ packed form
2157C53452225k26059o6986l0289j30157q2970J69754J09672k87780m06037l98369
2167C52103004k70118Q9149K43187L15437K46048m0779j83830k66533l18527l83606
2177C51533432k57988J44959K72026K65121J07765m01268m41284n5084J06354K40783
2187C51514816K05536j02081j32294R1324J11809K8839r9678l60718m64439n29061
2197C50264053l72619J00860L24707M68483M18206J11808q9416l34015l91235k82288
2207C50218544j53084J56174J49727k74658k12441M56581L43552n81246q11576o20156
2217C48671417m25567l0289J93863L41644M03633L83873K75612L0747j54267m01726
2227C49288940m21524k56309k5520N02853N19981M6006j94054m56581m41094p6027
$$ plain form
2237 348486671 348535767 348603249 348636398 348539124 348333817 347947617 347570648 347384949 347339172 347461929 347693214
2248 347693214 348029137 348326683 348400841 348373642 348336945 348196259 347822418 347410202 347104568 346923103
2258 346923103 347012024 347130775 346982956 346880913 347166786 347455025 347381363 347220650 347192307 347097397 346764069
2269 346764069 346327286 345790863 345373383 345426331 345553894 345433960 345195541 344706306 344425430 344965439
2279 344965439 345731277 346265564 346765747 347341537 347796211 347867966 347858429 348042717 348235855 348346481
2289 348346481 348365326 348157883 348006020 348234901 348578949 348870506 349137535 349392662 349510918 349105110
2299 349105110 348971863 349966774 351521988 353601227 355463486 356048126 356276741 357026825 357370377
2308 357370377 356320381 354928017 353696098 353279572 354795456 357358932 361002922 364089508 364703178
$$ packed form
2237C48486671M9096O7482L3149r7274k05307l86200l76969j85699m5777J22757K31285
2248C47693214L35923K97546P4158k7199l6697j40686l73841m12216l05634j81465
2258C46923103Q8921J18751j47819j02043K85873K88239p3662j60713k8343r4910l33328
2269C46764069m36783n36423m17480N2948J27563j19934k38419m89235k80876N40009
2279C44965439P65838N34287N00183N75790M54674P1755r537J84288J93138J10626
2289C48346481J8845k07443j51863K28881L44048K91557K67029K55127J18256m05808
2299C49105110j33247R94911J555214K079239J862259N84640K28615P50084L43552
2308C57370377j049996j392364j231919m16526J515884K563476L643990L086586O13670
$$ plain form
2317 364703178 363706818 360919952 357555161 354508629 352549057 353442917 355092049 356089592 356126328
2326 356126328 353914986 350981216 348332176 346232910 345323563 345482597 347587357 349278679 347485771
2335 347485771 345221291 345540771 345243225 342037201 336246719 326839218 315592766 300806770 291882038
2344 291882038 299902191 318117619 347682724 375966301 388315430 391947250 387295723 380057106
2352 380057106 378065338 375340958 366872063 357585907 351622581 346328964 340123405 333930016 327951889
2361 327951889 322770348 319373856 316741219 314121475 311690807 309149971 307173500 306538811 306635132
2370 306635132 307287693 307964325 307716370 307616234 308666954 310128212 311393967 313063145 315720081
2379 315720081 318800697 321937332 325121651 328376541 331238518 333126793 334412575 335121384 335707664
$$ packed form
2317C64703178r96360k786866l364791l046532j959572Q93860J649132R97543L6736
2326C56126328k211342k933770k649040k099266r09347J59034K104760J691322j792908
2335C47485771k264480L19480k97546l206024n790482r407501j1246452j4785996q924732
2344B91882038Q020153J8215428K9565105K8283577J2349129L631820m651527p238617
2352C80057106j991768k724380q468895r286156n963326n293617o205559o193389n978127
2361C27951889n181541l396492k632637k619744k430668k540836j976471o34689R6321
2370C06635132O52561O76632k47955j00136J050720J461258J265755J669178K656936
2379C15720081L080616L136635L184319L254890K861977J888275J285782P08809N86280
$$ plain form
2388 335707664 336794624 337898979 338754196 339333038 339494934 339310417 338680725 337970734 337493668 337305069
2398 337305069 337739716 338269958 338373184 338367004 338461151 338454971 338124771 337746849 337518692 337451935 337734451
2409 337734451 338032951 337997894 337862473 337779274 337637177 337295532 336993942 336996803 337088089 337121964 337152481
2420 337152481 337170372 337219009 337411880 337527275 337308655 336972961 336589088 336342087 336530914 336879272
2430 336879272 337301025 337524414 337120514 336474648 335802536 335180511 334726562 334529419 334821472 335286865
2440 335286865 335723152 336020966 335977783 335668793 334967117 334273834 334036331 333988190 334009399 334104767 334288597
2451 334288597 334409256 334235191 334017029 333962936 333965073 334064026 334022980 333420525 332848778 332921753 333149910
2462 333149910 333235245 333215714 332947960 332676163 332647552 332706680 332794647 332865944 332842827 332762947 332621078
$$ packed form
2388C35707664J086960J104355Q55217N78842J61896j84517o29692p09991m77066j88599
2398C37305069M34647N30242J03226o180R4147o180l30200l77922k28157o6757K82516
2409C37734451K98500l5057j35421q3199j42097l41645l01590K861R1286L3875L0517
2420C37152481J7891M8637J92871J15395k18620l35694l83873k47001J88827L48358
2430C36879272M21753K23389m03900o45866o72112o22025m53949j97143K92053M65393
2440C35286865M36287K97814m3183l08990p01676o93283k37503m8141K1209R5368J83830
2451C34288597J20659j74065k18162n4093K137R8953m1046o02455n71747P2975K28157
2462C33149910Q5335j9531k67754k71797k8611N9128Q7967P1297k3117p9880j41869
$$ plain form
2473 332621078 332466583 332358360 332259178 332098961 332033386 332360039 332581291 332093735 331511002 331366768
2483 331366768 331296692 331042786 330817223 330770035 330827942 331019897 331187744 331125717 331005554 330956230 330899963
2494 330899963 330788116 330659409 330534439 330417633 330376625 330239525 329721451 329228172 329159508 329246292
2504 329246292 329368820 329476585 329425583 329374313 329460144 329600830 329844246 329934120 329497337 328929901 328464737
2515 328464737 328217506 328493843 328955421 329379311 329723587 329872131 329822998 329487572 329008827 328396568
2525 328396568 327958832 328145027 328538437 328899612 329143066 329033127 328780174 328543167 328239212 327737083
2535 327737083 327340126 327433586 327639084 327673416 327636490 327534447 327364197 327047348 326816330 327021370
2545 327021370 327230453 327015648 326714287 326552162 326432953 326363335 326258888 326003799 325698128 325385323
$$ packed form
2473C32621078j54495j08223r9182j60217o5575L26653K21252m87556n82733j44234
2483C31366768p0076k53906k25563m7188N7907J91955J67847o2027j20163m9324n6267
2494C30899963j11847j28707j24970j16806m1008j37100n18074m93279o8664Q6784
2504C29246292J22528J07765n1002n1270Q5831J40686K43416Q9874m36783n67436m65164
2515C28464737k47231K76337M61578M23890L44276J48544m9133l35426m78745o12259
2525C28396568m37736J86195L93410L61175K43454j09939k52953k37007l03955n02129
2535C27737083l96957R3460K05498L4332l6926j02043j70250l16849k31018K05040
2545C27021370K09083k14805l01361j62125j19209o9618j04447k55089l05671l12805
$$ plain form
2555 325385323 325117569 324959259 324917564 325046310 325266342 325543633 325796127 325894356 325945854 326024551 326099625
2566 326099625 326164474 326219559 326258659 326292496 326340179 326369514 326358566 326292496 326133003 325927505 325717201
2577 325717201 325480690 325164795 324904213 324878235 324899673 324801941 324702988 324646225 324688416 325007935 325280190
2588 325280190 325133553 324885139 324727783 324661713 324870834 324994812 324544678 324089775 324169159 324384460
2598 324384460 324480782 324564438 324680328 324754944 324740639 324601898 324175606 323793411 323832283 323991051 324085693
2609 324085693 324141273 324123611 324026108 323817024 323534966 323176613 322836380 322622757 322490234 322393646 322439651
2620 322439651 322819214 323233604 323474884 323459854 322818298 322200050 322285652 322610626 322988281 323265533
2630 323265533 323133926 322870979 322667847 322472801 322268486 322141876 322200546 322365532 322643051 322882156
$$ packed form
2555C25385323k67754j58310m1695J28746K20032K77291K52494R8229N1498P8697P5074
2566C26099625O4849N5085L9100L3837M7683K9335j0948o6070j59493k05498k10304
2577C25717201k36511l15895k60582k5978K1438r7732r8953n6763M2191L19519K72255
2588C25280190j46637k48414j57356o6070K09121J23978m50134m54903P9384K15301
2598C24384460R6322Q3656J15890P4616j4305j38741m26292l82195L8872J58768R4642
2609C24085693N5580j7662r7503k09084k82058l58353l40233k13623j32523r6588M6005
2620C22439651L79563M14390K41280j5030o41556o18248Q5602L24974L77655K77252
2630C23265533j31607k62947k03132j95046k04315j26610N8670J64986K77519K39105
$$ plain form
2640 322882156 322914581 322798958 322465897 322130928 322017212 322029114 322233200 322366486 322038879 321697235
2650 321697235 321768036 321921349 321975937 321911583 321501732 321181297 321485748 321883202 321920853 321897049 322053452
2661 322053452 322105408 321709633 321283112 321246376 321243744 320957909 320690880 320684891 320798645 321008911 321200867
2672 321200867 321195602 321159363 321249733 321311226 321197052 321037521 320921173 320826530 320747375 320724716 320837021
2683 320837021 320963860 321024399 320975075 320678482 320333939 320069313 319961777 320205917 320575943 321005325
2693 321005325 321210136 320703049 320024719 319577942 319289207 319264889 319366455 319483986 319635391 319868813
2703 319868813 319981804 319702148 319286575 318833351 318545113 318789005 319169273 319422493 319517365 319199333
2713 319199333 318872929 318977127 319151154 319130898 319063663 319037666 318963280 318734169 318486443 318330040 318237076
$$ packed form
2640C22882156L2425j15623l33061l34969j13716J1902K04086J33286l27607l41644
2650C21697235P0801J53313N4588o4354m09851l20435L04451L97454L7651k3804J56403
2661C22053452N1956l95775m26521l6736k632k85835k67029n989J13754K10266J91956
2672C21200867n265l6239R0370O1493j14174j59531j16348r4643p9155k2659J12305
2683C20837021J26839O0539m9324k96593l44543k64626j07536K44140L70026M29382
2693C21005325K04811n07087o78330m46777k88735k4318J01566J17531J51405K33422
2703C19868813J12991k79656m15573m53224k88238K43892L80268K53220R4872l18032
2713C19199333l26404J04198J74027k0256o7235k5997p4386k29111k47726j56403r2964
$$ plain form
2724 318237076 318234444 318265438 318320999 318284035 317913532 317570210 317623367 317806015 318024158 318126907 317789078
2735 317789078 317437649 317491760 317648659 317730904 317778358 317682991 317707787 318259716 318796883 318815956 318604698
2746 318604698 318235397 317848434 317673454 317514896 317172527 316889038 316944351 317024002 316824188 316589355
2756 316589355 316428413 316441765 316896915 317398300 317628136 317618847 317167053 316660404 316489449 316442261 316435337
2767 316435337 316471329 316536179 316595554 316659203 316579342 316053162 315552711 315554619 315742016 315945148 316198120
2778 316198120 316513062 316783428 316923618 316882362 316430817 316014519 316092968 316394806 316877842 317313194
2788 317313194 317406654 317311764 317086220 316721916 316170692 315609207 315157890 314937363 315235615 315668335
2798 315668335 315965176 316070080 315752983 315264702 314715157 314294090 314350128 314515343 314482689 314418564
$$ packed form
2724C18237076k632L0994N5561l6964l70503l43322N3157J82648K18143J02749l37829
2735C17789078l51429N4111J56899Q2245M7454r5367K4796N51929N37167J9073k11258
2746C18604698l69301l86963j74980j58558l42369k83489N5313P9651j99814k34833
2756C16589355j60942J3352M55150N01385K29836r289m51794n06649j70955m7188o924
2767C16435337L5992O4850N9375O3649p9861n26180n00451J908J87397K03132K52972
2778C16198120L14942K70366J40190m1256m51545m16298P8449L01838M83036M35352
2788C17313194R3460r4890k25544l64304n51224n61485m51317k20527K98252M32720
2798C15668335K96841J04904l17097m88281n49545m21067N6038J65215l2654o4125
$$ plain form
2808 314418564 314438820 314386139 314074039 313702106 313419571 313191185 313033333 312937260 312881699 312919846 313122025
2819 313122025 313413391 313789368 314107170 314246902 314134369 313529491 312807560 312293053 311896095 311651230
2829 311651230 311506042 311485767 311388969 310987244 310383568 309496403 308650246 308138371 307969570 308380127
2839 308380127 308980465 309446335 309816132 310012589 310058117 309906235 309684029 309473038 309362888 309566269
2849 309566269 309794903 309817314 309673080 309259644 308769951 308357716 308036327 307911873 307857990 307763824
2859 307763824 307686577 307593822 307642212 308139801 308596840 308481216 308227310 308186302 308074226 307602406 307132721
2870 307132721 307030678 306996574 306815147 306598434 306398392 306177139 305778275 305608521 306173096 307020187
2880 307020187 307958126 308711052 308781147 308640251 308617115 308642159 308788776 308955917 309079399 309121609 308982124
$$ packed form
2808C14418564K0256n2681l12100l71933k82535k28386j57852r6073n5561L8147K02179
2819C13122025K91366L75977L17802J39732j12533o04878p21931n14507l96958k44865
2829C11651230j45188k0275r6798m01725o03676q87165q46157n11875j68801M10557
2839C08380127O00338M65870L69797J96457M5528j51882k22206k10991j10150K03381
2849C09566269K28634K2411j44234m13436m89693m12235l21389j24454n3883r4166
2859C07763824p7247r2755M8390M97589M57039j15624k53906m1008j12076m71820m69685
2870C07132721j02043l4104j81427k16713k00042k21253l98864j69754N64575Q47091
2880C07020187R37939P52926P0095j40896k3136K5044J46617J67141J23482M2210j39485
$$ plain form
2891 308982124 308782806 308639755 308468819 308188667 307904472 307730446 307557106 307296753 306997776 306563854
2901 306563854 306338081 306884041 307441483 307242165 306870689 306693802 306594849 306570282 306647301 306936989
2911 306936989 307182312 307091942 306878567 306688786 306427956 305985680 305553207 305319786 305177460 305077076
2921 305077076 305031548 305021286 305093536 305371513 305605888 305524597 305317154 305124054 304819336 304203262 303635826
2932 303635826 303480873 303525448 303636322 303937187 304625740 305344105 305739880 305993805 306179771 306264153
2942 306264153 306180725 306100616 306245804 306396961 306318054 306279907 306535721 306899548 307330856 307644367 307551155
2953 307551155 307318459 307170391 306944618 306500206 305997124 305526505 305150986 305099964 304964790 304276237
2963 304276237 303444862 302696228 302113762 301936150 301921616 301857719 301894913 302107582 302510262 303220520
$$ packed form
2891C08982124j99318j43051j70936k80152k84195j74026j73340k60353k98977m33922
2901C06563854k25773N45960N57442j99318l71476j76887r8953k4567P7019K89688
2911C06936989K45323r0370k13375j89781k60830m42276m32473k33421j42326j00384
2921C05077076m5528j0262P2250K77977K34375q1291k07443j93100l04718o16074n67436
2932C03635826j54953M4575J10874L00865O88553P18365L95775K53925J85966Q4382
2942C06264153q3428q0109J45188J51157p8907l8147K55814L63827M31308L13511r3212
2953C07551155k32696j48068k25773m44412n03082m70619l75519n1022j35174o88553
2963C04276237q31375p48634n82466j77612j4534o3897L7194K12669M02680P10258
$$ plain form
2973 303220520 304002991 304686069 305193672 305258026 305282364 305685272 306150436 306518078 306735268 306587944
2983 306587944 306399822 306581268 306658516 306034088 305487156 305843830 306365490 306551933 306512833 306123734
2993 306123734 305586338 305052986 304546356 304084053 303830147 304120541 304454327 304320812 304083347 303868771
3003 303868771 303873787 304487953 305257072 305846443 306284676 306403160 306458244 306740532 306975365 306940804 306767941
3014 306767941 306434402 306178570 306310883 306590080 306958675 307174454 306856880 306361198 305890083 305520535
3024 305520535 305450211 305520058 305681229 305800209 305583229 305461407 306007156 306502342 306236496 305757523
3034 305757523 305266609 305090179 305923462 306859016 307073116 307009220 306834698 306553116 306176414 305845032
3044 305845032 305812111 305749168 305157890 304800262 305600395 306571236 306967258 306985626 306410789 305734863
$$ packed form
2973C03220520P82471O83078N07603O4354K4338M02908M65164L67642K17190j47324
2983C06587944j88122J81446P7248o24428n46932L56674N21660J86443l9100l89099
2993C06123734n37396n33352n06630m62303k53906K90394L33786j33515k37465k14576
3003C03868771N016O14166P69119N89371M38233J18484N5084K82288K34833l4561j72863
3014C06767941l33539k55832J32313K79197L68595K15779l17574m95682m71115l69548
3024C05520535p0324O9847J61171J18980k16980j21822N45749M95186k65846m78973
3034C05757523m90914j76430Q33283R35554K14100o3896j74522k81582l76702l31382
3044C05845032l2921o2943n91278l57628Q00133R70841L96022J8368n74837o75926
$$ plain form
3054 305734863 305459976 305339813 305262337 305326233 305665016 306058655 306412926 306483498 305836449 304942856
3064 304942856 304042339 303392410 303441525 303853512 304511070 305206070 305743446 305964947 305484772 304786911
3074 304786911 304185143 303803444 303984642 304385910 304792633 305160999 305316925 305436363 305719147 305916557
3084 305916557 305778027 305506935 305160046 304923534 305148354 305397263 305275688 305004120 304650078 304276695
3094 304276695 303940048 303727627 303849697 303990364 303755035 303587189 303940048 304386616 304656506 304732323
3104 304732323 304404259 303979149 303714752 303545227 303460846 303551197 304069519 304513454 304333458 303924561
3114 303924561 303421497 303052425 303267002 303535461 303390503 303093185 302680740 302357197 302483330 302625427
3124 302625427 302299500 302015076 302317390 302611828 302352905 301937103 301558723 301278114 301314125 301385403
$$ packed form
3054C05734863k74887j20163p7476O3896L38783L93639L54271P0572o47049q93593
3064C04942856r00517o49929M9115M11987O57558O95000N37376K21501m80175o97861
3074C04786911o01768l81699J81198M01268M06723L68366J55926J19438K82784J97410
3084C05916557j38530k71092l46889k36512K24820K48909j21575k71568l54042l73383
3094C04276695l36647k12421J22070J40667k35329j67846L52859M46568K69890P5817
3104C04732323l28064m25110k64397j69525q4381R0351N18322M43935j79996m08897
3114C03924561n03064l69072K14577K68459j44958k97318m12445l23543J26133J42097
3124C02625427l25927k84424L02314K94438k58923m15802l78380k80609L6011P1278
$$ plain form
3134 301385403 301198235 301007042 301038017 301082134 300946960 300805321 300818443 300826797 300617447 300511837 300954342
3145 300954342 301363220 301135788 300775757 300686836 300565948 300153255 299720535 299484024 299350014 299300423
3155 299300423 299324760 299414864 299543858 299693108 299828300 299943447 299932709 299597511 299207458 299006462
3165 299006462 298871765 298768768 298674812 298526039 298411140 298465500 298483124 298299313 297925720 297132969
3175 297132969 296478500 296641827 297026405 297205925 297346344 297526588 297578087 297225227 296866188 296916008
3185 296916008 297047386 297068119 296984673 296672344 296330223 296159973 296028862 295852890 295685539 295535564
3195 295535564 295451164 295561066 295631180 295362701 295078049 295088768 295127869 295024872 294800758 294373283 293878555
3206 293878555 293406963 293012142 292821407 292702904 292563438 292412987 292170753 292016029 292245140 292424431
$$ packed form
3134C01385403j87168j91193L0975M4117j35174j41639J3122Q354k09350j05610M42505
3145C00954342M08878k27432l60031q8921j20888m12693m32720k36511j34010m9591
3155B99300423K4337R0104J28994J49250J35192J15147j0738l35198l90053k00996
3165B99006462j34697j02997r3956j48773j14899N4360J7624j83811l73593p92751
3175B97132969o54469J63327L84578J79520J40419J80244N1499l52860l59039M9820
3185B96916008J31378K0733q3446l12329l42121j70250j31111j75972j67351j49975
3195B95535564q4400J09902P0114k68479k84652J0719L9101j02997k24114m27475m94728
3206B93878555m71592l94821j90735j18503j39466j50451k42234j54724K29111J79291
$$ plain form
3216 292424431 292098274 291625252 291231632 290857086 290518761 290209541 289918423 289671669 289517403 289377441
3226 289377441 289150238 288952827 288865814 288896332 289148102 289411068 289496193 289443493 289155483 288852921 288805962
3237 288805962 288767815 288519859 288245926 288164139 287950745 287134171 286375771 286339531 286543617 286725769
3247 286725769 286889801 286986122 286911964 286425362 285892715 285703430 285543919 285150528 284761658 284503708
3257 284503708 284446945 284863472 285272121 285159111 284891853 284708023 284481525 284054756 283758392 284028282
3267 284028282 284390926 284502754 284408340 283914795 283388615 283185234 283141365 283325920 283396244 282879601
3277 282879601 282235374 281805763 281466961 281234016 281030178 280670643 280494213 280953884 281519890 281803131
3287 281803131 281832695 281424522 280828247 280221939 279632797 279143810 278764725 278525124 278448830 278688908
$$ packed form
3216B92424431l26157m73022l93620l74546l38325l09220k91118k46754j54266j39962
3226B89377441k27203j97411q7013L0518K51770K62966Q5125n2700k88010l02562m6959
3237B88805962l8147k47956k73933q1787k13394q16574p58400l6240K04086J82152
3247B86725769J64032R6321p4158m86602n32647j89285j59511l93391l88870k57950
3257B84503708n6763M16527M08649j13010k67258j83830k26498m26769k96364K69890
3267B84028282L62644J11828r4414m93545n26180k03381m3869J84555P0324n16643
3277B82879601o44227m29611l38802k32945k03838l59535j76430M59671N66006K83241
3287B81803131K9564m08173n96275o06308n89142m88987l79085k39601p6294K40078
$$ plain form
3297 278688908 278886566 278609753 278229713 277952919 277841797 278224716 278508663 278020859 277328262 276731720
3307 276731720 276353359 276638985 276917458 276444912 275882721 275814056 275726089 275178185 274535904 273994446
3317 273994446 273623943 273678055 273799667 273712387 273425102 272734165 271998882 271544228 271268368 271227837
3327 271227837 271269321 271273613 271191826 270939827 270501862 269699821 268933773 268632889 268530846 268554211 268550873
3338 268550873 268296242 267932415 267511597 267078171 266767502 266355515 265568962 264690628 263832321 263233662
3348 263233662 263397217 263644695 263373375 262856712 262049675 261303425 261085510 261000862 260781059 260510921
3358 260510921 260169983 259803295 259508858 259105206 258310089 257521400 257127991 256873360 256643295 256398430
3368 256398430 256084213 255628586 254839897 254022121 253403664 253017197 253092537 253266563 253267288 253050079 252348900
$$ packed form
3297B78688908J97658k76813l80040k76794j11122L82919K83947m87804o92597n96542
3307B76731720l78361K85626K78473m72546n62191o8665q7967n47904o42281n41458
3317B73994446l70503N4112J21612q7280k87285o90937p35283m54654k75860m0531
3327B71227837M1484M292q1787k51999m37965q02041p66048l00884j02043K3365l338
3338B68550873k54631l63827m20818m33426l10669m11987p86553q78334q58307n98659
3348B63233662J63555K47478k71320n16663q07037p46250k17915q4648k19803k70138
3358B60510921l40938l66688k94437m03652p95117p88689l93409k54631k30065k44865
3368B56398430l14217m55627p88689q17776o18457l86467P5340J74026P25k17209p01179
$$ plain form
3379 252348900 251554966 251008511 250595322 250385761 250163803 249626884 249101868 248920212 248764038 248369694
3389 248369694 247903824 247411728 246990929 246821632 246698151 246391773 246151199 246264229 246381531 246153603
3399 246153603 245866051 245737305 245616436 245384216 245161285 245018005 244982719 245222816 245390892 245104561
3409 245104561 244633904 244078159 243565559 243271103 243150940 243418465 243475189 242577076 241373062 240123272
3419 240123272 239247322 239501724 240133286 240604877 241024246 241412888 241492500 240701199 239908218 240001678
3429 240001678 240363350 240759621 240924835 240251312 239528427 239456406 239693642 240193367 240768909 241130600
3439 241130600 241538525 242430458 242980957 242285252 241016159 239252090 237871399 238124847 238970528
3448 238970528 239795208 240561008 240947723 241189003 241433620 241615295 241700172 241738091 241766701 241788139 241811028
$$ packed form
3379B52348900p93934n46455m13189k09561k21958n36919n25016j81656j56174l94344
3389B48369694m65870m92096m20799j69297j23481l06378k40574J13030J17302k27928
3399B46153603k87552j28746j20869k32220k22931j43280l5286K40097J68076k86331
3409B45104561m70657n55745n12600k94456j20163K67525N6724q98113j204014j249790
3419B40123272q75950K54402O31562M71591M19369L88642P9612p91301p92981R3460
3429B40001678L61672L96271J65214o73523p22885p2021K37236M99725N75542L61691
3439B41130600M07925Q91933N50499o95705j269093j764069j380691K53448Q45681
3448B38970528Q24680P65800L86715K41280K44617J81675Q4877L7919K8610K1438K2889
$$ plain form
3459 241811028 241851807 241922379 242043018 242349854 242507458 242001762 241501083 241619339 242003670 242567787
3469 242567787 243123055 243399849 243553886 243554115 243687859 244474182 245184422 245199432 244709969 243381023
3479 243381023 242168427 242084732 242623329 243899574 245057831 244910469 244566441 244916439 245427132 245856514
3489 245856514 246218452 246394882 246538887 246753693 247068405 247511139 248185158 249597321 250562897 249730587
3499 249730587 248103867 245723000 244125137 245686054 247927189 249144554 249388695 247441769 245403519
3508 245403519 245358238 246132374 247401714 248699417 249243736 249653816 250249863 251146545 252962837 254503021
3518 254503021 254593849 253783951 251882076 249933968 249261131 248843670 247896671 247035980 246416092 246633053
3528 246633053 248902550 251518974 253201485 253890266 252466927 250826607 250559082 251461029 254380455
$$ packed form
3459B41811028M0779P0572J20639L06836J57604n05696n00679J18256L84331N64117
3469B42567787N55268K76794J54037K29J33744P86323P10240J5010m89463j328946
3479B43381023j212596q3695N38597J276245J158257j47362l44028L49998N10693M29382
3489B45856514L61938J76430J44005K14806L14712M42734O74019J412163R65576q32310
3499B49730587j626720k380867j597863J560917K241135J217365K44141j946926k038250
3508B45403519m5281P74136J269340J297703N44319M10080N96047Q96682J816292J540184
3518B54503021R0828q09898j901875j948108o72837m17461r46999q60691o19888K16961
3528B46633053K269497K616424J682511O88781j423339j640320k67525R01947K919426
$$ plain form
3537 254380455 257749786 260503998 261982918 260790100 258069038 253684044 250073910 250333786 252358208
3546 252358208 255788326 258476734 257139206 254826546 253418198 253141174 255578766 258539925 260041008
3555 260041008 261042824 261381626 262446175 266336212 270754089 275355816 276377678 267782440 256046066
3564 256046066 244245052 236540318 240753174 248977661 255959034 261563530 263117313 262984753 262646198
3573 262646198 262078056 261632195 261661301 262469063 264552841 269047737 274343014 280410538 283635864
3582 283635864 279186726 270687580 257759094 247578850 249638329 256615868 265647411 272848854
3590 272848854 271345367 267244816 264453659 262698898 263834000 265383492 264771233 264150848 264526367
3599 264526367 266767979 273555279 280461082 283966064 284023285 277559757 270133495 266912231 265991936
$$ packed form
3537B54380455L369331K754212J478920j192818k721062m384994l610134K59876K024422
3546B52358208L430118K688408j337528k312660j408348k77024K437592K961159J501083
3555B60041008J001816L38802J064549L890037M417877M601727J021862q595238j1736374
3564B56046066j1801014p704734M212856Q224487O981373N604496J553783j32560l38555
3573B62646198n68142m45861K9106Q07762K083778M494896N295277O067524L225326
3582B83635864m449138q499146j2928486j0180244K059479O977539R031543P201443
3590B72848854j503487m100551k791157j754761J135102J549492o12259o20385L75519
3599B64526367K241612O787300O905803L504982N7221o463528p426262l221264r20295
$$ plain form
3608 265991936 267923355 270507336 270627499 271585941 278109074 282805672 277854919 269268990 258539677
3617 258539677 251406898 255969048 266640663 282461166 297652721 307059765 307852268 291863441
3625 291863441 269944420 247314453 232701778 243103256 258931637 263380280 265101433 267289162
3633 267289162 269509792 272998581 275941124 275616875 275979519 280577183 287905693 299059868 309788933
3642 309788933 318360100 318312645 297468910 271244049 249942551 236715546 241685867 254240513
3650 254240513 269390583 280386200 274516106 264673710 259960651 259039879 265693436 273662567
3658 273662567 276203632 278551331 284250031 291624546 302082539 309917679 308788528 302005043
3666 302005043 287284374 275063515 279379120 287146339 291660786 287815571 259340057 233019600
$$ packed form
3608B65991936J931419K583981J20163R58442O523133M696598m950753q585929j0729313
3617B58539677p132779M562150J0671615J5820503J5191555R407044P92503j5988827
3625B91863441k1919021k2629967j4612675J0401478J5828381M448643J721153K187729
3633B67289162K220630L488789K942543l24249L62644M597664P328510J1154175J0729065
3642C09788933Q571167m7455k0843735k6224861k1301498j3227005M970321J2554646
3650B54240513J5150070J0995617n870094r842396m713059r20772O653557P969131
3658B73662567K541065K347699N698700P374515J0457993P835140j129151o783485
3666C02005043j4720669j2220859M315605P767219M514447l845215k8475514k6320457
$$ plain form
3674 233019600 237660637 250928154 258173466 265143871 272575150 280852089 291681767 301829815
3682 301829815 310244331 312081814 299053669 280440331 260728359 246009827 247058640 254312515
3690 254312515 261593094 269519806 276927948 282991180 286231995 287438869 287377586 284635315 275397530
3699 275397530 267631760 269594669 276604176 288686028 299972534 304578056 302581787 289696465
3707 289696465 273132095 257153511 246309280 248778572 257930984 271596680 284572601 289499283
3715 289499283 290676346 289757957 287318001 284498215 281247139 277568340 274437904 272372475 272750626
3724 272750626 277502060 285487652 299293747 309670925 305566788 294974098 281762123 267245770
3732 267245770 251824856 242113590 246924877 260061035 281517754 301525345 309460163 307880173
$$ packed form
3674B33019600M641037J3267517P245312O970405P431279Q276939J0829678J0148048
3682C01829815Q414516J837483j3028145j8613338j9711972j4718532J048813P253875
3690B54312515P280579P926712P408142O063232L240815J206874o1283k742271r237785
3699B75397530p765770J962909P009507J2081852J1286506M605522j996269j2885322
3707B89696465j6564370j5978584j0844231K469292R152412J3665696J2975921M926682
3715B89499283J177063r18389k439956k819786l251076l678799l130436k065429L78151
3724B72750626M751434P985592J3806095J0377178m104137j0592690j3211975j4516353
3732B67245770j5420914r711266M811287J3136158K1456719K0007591P934818j579990
$$ plain form
3740 307880173 291646481 273222446 263225784 262052059 282007217 297976017 279830704 254913559
3748 254913559 241786232 236660957 244537125 257612000 271245956 280947685 277619133 270440578
3756 270440578 265313148 262976646 267776260 274796963 281080246 285101166 282915840 278822174 276815186
3765 276815186 273859501 266418934 259988556 259561310 263106823 271896133 281017075 285583267 286788216
3774 286788216 283501148 277807961 269937744 264328003 268029213 273427963 274389496 273528328 270445099
3783 270445099 268046608 270144939 273623466 276279926 279183617 282988548 286735058 289815674 291826973
3792 291826973 291676750 290823212 290967216 290285339 288269043 282673836 266708145 253502121 259011745
3801 259011745 267968178 269088268 266370296 256387234 250131836 261946678 278355370 290524712
$$ packed form
3740C07880173j6233692j8424035r996662j173725J9955158J5968800j8145313k4917145
3748B54913559j3127327n125275P876168J3074875J3633956R701729l328552p178555
3756B70440578n127430k336502M799614P020703O283283M020920k185326m093666k006988
3765B76815186k955685p440567o430378m27246L545513Q789310R120942M566192J204949
3774B86788216l287068n693187p870217n609741L701210N398750R61533q61168l083229
3783B70445099k398491K098331L478527K656460K903691L804931L746510L080616K011299
3792B91826973j50223q53538J44004o81877k016296n595207j5965691j3206024N509624
3801B59011745Q956433J120090k717972r983062o255398J1814842J6408692J2169342
$$ plain form
3809 290524712 298866749 300117970 296469212 286878586 277778625 277962914 279302826 276331902 269855499
3818 269855499 254664192 243335724 251713524 264790058 271558037 275857697 276905289 277564278
3826 277564278 281715622 285522232 285004139 284470787 288890114 292305717 289834976 283220768 270335197
3835 270335197 257907143 253271580 252479076 254682064 257906685 258304119 260648003 269245625 281644344
3844 281644344 298785210 314792862 325727005 326720734 308238983 280344238 244379768 216968060
3852 216968060 221761475 239011765 257637501 275289764 285064926 289543152 288064957 283442497
3860 283442497 277358532 272538662 273588905 276548615 280436745 280919800 269724369 257686615
3868 257686615 254503021 255318871 258927345 264078369 268742085 274049034 282477608 287952652 282199860
$$ packed form
3809B90524712Q342037J251221l648758r590626r099961J84289J339912k970924o476403
3818B69855499j5191307j1328468Q377800J3076534O767979M299660J047592O58989
3826B77564278M151344L806610n18093n33352M419327L415603k470741o614208j2885571
3835B70335197j2428054m635563p92504K202988L224621L97434K343884Q597622J2398719
3844B81644344J7140866J6007652J0934143R93729j8481751k7894745l5964470k7411708
3852B16968060M793415J7250290J8625736J7652263R775162M478226j478195m622460
3860B83442497o083965m819870J050243K959710L888130M83055j1195431j2037754
3868B57686615l183594Q15850L608474N151024M663716N306949Q428574N475044n752792
$$ plain form
3877 282199860 274292469 271557808 270958672 273358345 274379005 266471634 260010719 266655693 275000343
3886 275000343 276591301 274227867 264858017 257582436 263234615 273560524 285019875 294303417
3894 294303417 295931091 292871952 285337448 276117554 268524399 261201134 252769947 246602783 246259212
3903 246259212 249795189 257717609 266230812 270810127 274147034 277762184 280643234 282538185 282685509
3912 282685509 279683342 275198460 269516945 265379181 267035713 270239830 272071114 272799263 270956993
3921 270956993 268834591 268219471 269152412 273651848 277571201 276552200 273245583 267941704 263362160
3930 263362160 262967110 264829407 268733978 273003578 275775909 277389526 277500629 276292572 273149261
3939 273149261 270122757 269332886 269958019 272824059 275105247 273121109 270259380 268910637 268383980
$$ packed form
3877B82199860p907391k734661n99136K399673J020660p907371o460915O644974Q344650
3886B75000343J590958k363434r369850p275581N652179J0325909J1459351R283542
3894B94303417J627674l059139p534504r219894p593155p323265q431187o167164l43571
3903B46259212L535977P922420Q513203M579315L336907L615150K881050J894951J47324
3912B82685509l002167m484882n681515m137764J656532L204117J831284P28149j842270
3921B70956993k122402o15120R32941M499436L919353j019001l306617n303879m579544
3930B63362160l95050J862297L904571M269600K772331J613617J11103j208057l143311
3939B73149261l026504p89871O25133K866040K281188j984138k861729j348743n26657
$$ plain form
3948 268383980 268970013 270112038 271510601 272683144 272768250 272602558 272971878 273165703 272585392 271678448
3958 271678448 270558834 269627571 269345055 269645920 270924797 272261620 272706032 272739887 272460461 272071362
3968 272071362 271890411 271671295 271233559 270694962 269920578 269486427 270287991 271229744 271352291 271140099
3978 271140099 270636787 270205021 270282516 270686626 271484604 272363186 273130417 273486137 272823811 271869659
3988 271869659 271145096 270654449 270682106 270907879 271113396 271275291 271213055 271176815 271494141 271750450
3998 271750450 271440735 271161804
4000 271161804
$$ packed form
3948B68383980N86033J142025J398563J172543Q5106j65692L69320J93825n80311r06944
3958B71678448j119614r31263k82516L00865J278877J336823M44412L3855k79426l89099
3968B72071362j80951k19116m37736n38597p74384m34151Q01564R41753J22547k12192
3978B71140099n03312m31766P7495M04110P97978Q78582P67231L55720o62326r54152
3988B71869659p24563m90647K7657K25773K05517J61895o2236l6240L17326K56309
3998B71750450l09715k78931
4000B71161804
##END=$$ End of the data block
