##TITLE=$$ Begin of the data block
##JCAMP-DX=5.00 $$ ACD/SpecManager v 10.08
##SPECTROMETER/DATA SYSTEM=16PC
##DATE=Mon Sep 30 11:06:29 2013
##DATA TYPE=INFRARED SPECTRUM
##DATA CLASS=XYDATA
##ORIGIN=
##OWNER=
##NPOINTS=3401
##FIRSTX=600.00000000
##LASTX=4000.00000000
##MAXX=4000.00000000
##MINX=600.00000000
##MAXY=101.37293243
##MINY=94.90823364
##XFACTOR=1.0000000000
##YFACTOR=0.000001000000000
##FIRSTY=97.89399719
##DELTAX=1.00000000
##XUNITS=1/CM
##YUNITS=TRANSMITTANCE
##XYDATA=(X++(Y..Y))
600I7893997P18262Q52089Q68965N58777k88513o22864o94252n53230K6565J90140
610I8949936K8557L2402Q1184J65917L92051L46733J2879j28342k02606j88477n554
621I9484680L197k38350q2848N45052O96464N27863L62320P4554j57310m44580n20371
632A00250671m01664k87743r3101L9482K24609J46317l28156l51860J9241J61812K18033
643I9597641K42523K72156J04446m17892m63463r3391J05499L58490L50922K0957o9473
654A00008415N2170o6238n70458m25392N09743O36650J28982j09886m22149l42530
664I9399307K29950M25987M38614L64853J21903n6191k91900l29682j64726p2098N8960
675A00124977O0158j61553o6047N08240L74626n11910p84797p78176n22140K99286
$$ y = [97893997, 98612259, 99464348, 100333313, 100892090, 100603577, 99980713, 99286461, 98733231, 98759796, 98949936, 98978493, 99010895, 99092079, 99257996, 99650047, 99996780, 100009659, 99881317, 99678711, 99490234, 99484680, 99487877, 99249527, 99166679, 99711731, 100408195, 100936058, 101298378, 101372932, 101215622, 100771042, 100250671, 99849007, 99561264, 99468163, 99507645, 99732254, 99878571, 99550415, 99198555, 99217796, 99379608, 99597641, 99840164, 100112320, 100216766, 99798874, 99335411, 99242020, 99347519, 99706009, 100056931, 100077888, 100008415, 100060585, 99994347, 99423889, 98998497, 99508240, 100144890, 100273872, 100163986, 99741837, 99399307, 99629257, 100055244, 100493858, 100858711, 100980614, 100924423, 100632523, 100302841, 100138115, 100066017, 100124977, 100185135, 100023582, 99957535, 100465775, 100840401, 100328491, 99543694, 98765518, 98243378, 98542664]
685I8542664M51995N1712j30439k50840m55116q70392q42765m32129n2887N95070P25509
696I7332382K97951K60185M79317N38971N60478M74876K92733M0817m89113m90974
706I9297623J39831J78642l20793l48899l0396J23955K38846L26278M26811L65929
716A00397827R2171j4259m2222j6548J39504J43692J9119m4418q8524j36566k00608
727A00249168k09114j96502r6939J72470K14073Q0490m1267l39417k48146L78799L90458
738A00354073j60881l33428l45734k65571K5772J21048J18751L1998k11120l36411
748I8998497m08722m42886m79431l41515O6071J85607M7257Q7997K65480L11829K96875
759I8587059K09000k3842j02089q2802l7651Q3229J52069K77229J52878l65829l93891
$$ y = [98542664, 98994659, 99046371, 98915932, 98665092, 98209976, 97339584, 96496819, 96064690, 96011803, 96606873, 97332382, 97630333, 97890518, 98369835, 98908806, 99469284, 99944160, 100236893, 100277710, 99788597, 99297623, 99437454, 99616096, 99295303, 98946404, 98916008, 99039963, 99278809, 99605087, 100031898, 100397827, 100489998, 100475739, 100433517, 100416969, 100556473, 100700165, 100719284, 100674866, 100586342, 100449776, 100249168, 100040054, 99843552, 99746613, 99919083, 100133156, 100213646, 100172379, 99832962, 99584816, 99963615, 100354073, 100193192, 99859764, 99514030, 99248459, 99274231, 99395279, 99514030, 99546028, 99334908, 98998497, 98589775, 98146889, 97667458, 97325943, 97392014, 97577621, 97624878, 97712875, 97978355, 98290184, 98587059, 98796059, 98772217, 98670128, 98587326, 98549675, 98632904, 98784973, 99062202, 99215080, 98849251, 98455360]
770I8455360J6564J88858L02124L16376J95907J23337K7824J0041N5313J21521L12950
781A00126175K54341j03859j88415p5364l4149J6052K1363k3583m3441p6081m5440
792I9827599P8086R9869L8384J4305J4046k8779j07933j82243k97668l11661k05895
803I8938110j96411l11538k22214J41029J71326m7257k44423o20941o44134l31757
813I6631790j45553M6821J77529K37747L30452M66560M99367M33731L96919L97110
823I9472473K74162k1171j31943j31485q3572J14967J15181p5554j38023j52344j17355
834I9125336N386O0875P6073R7969J26053J15249M4327M3152J26861J04950n9700k8129
846I9838402K46429K37633m3251j15250r9205P103L76557L15262k26426l56346k18582
$$ y = [98455360, 98471924, 98660782, 98962906, 99279282, 99475189, 99598526, 99626350, 99636391, 99691704, 99813225, 100126175, 100380516, 100276657, 100088242, 100012878, 99978729, 99994781, 100016144, 99992561, 99949120, 99873039, 99827599, 99905685, 100005554, 100043938, 100058243, 100072289, 100043510, 99935577, 99753334, 99455666, 99144005, 98938110, 98741699, 98430161, 98207947, 98348976, 98520302, 98473045, 98228622, 97607681, 96963547, 96631790, 96486237, 96533058, 96710587, 96948334, 97278786, 97745346, 98244713, 98678444, 99075363, 99472473, 99746635, 99725464, 99593521, 99462036, 99378464, 99493431, 99608612, 99533058, 99395035, 99242691, 99125336, 99130722, 99191597, 99267670, 99365639, 99491692, 99606941, 99651268, 99694420, 99821281, 99926231, 99866531, 99838402, 100084831, 100322464, 100279213, 100163963, 100064758, 100071861, 100448418, 100763680, 100537254, 100180908, 99962326]
857I9962326j29074P3265N9959k50122k03994K23091K79045M1725m8401o3827j55182
868I9788811m00734l36983J25336J65680j69205k45956j95023j28082J6166J03928
878I8723938J82915J95884J04042J19690K42020K61711K34719J46438o6948j35948
888A00008461j05263o5681K9259Q4327J59020J10367j13297j62552r4795l0045J23719
899I9943520J18278m9377j19187j46789j69709j98272j53824k3842O2843J49727J91597
910I9604965J95885J77765J41075N5000j42959j72303n9410K0523J78986J45096j41762
921A00002861j68327M6516O5018j03089n9036K46742K17270j85898k12097P2243J81816
932A00104019K51320K27333P5958j3801j02448j37283j29509q7235L8407N9936l3493
$$ y = [99962326, 99833252, 99906517, 99966476, 99716354, 99512360, 99735451, 100014496, 100056221, 100007820, 99943993, 99788811, 99388077, 99051094, 99176430, 99342110, 99172905, 98926949, 98731926, 98603844, 98620010, 98723938, 98906853, 99102737, 99206779, 99326469, 99568489, 99830200, 100064919, 100211357, 100144409, 100008461, 99903198, 99837517, 99866776, 99951103, 100110123, 100220490, 100107193, 99944641, 99849846, 99819801, 99943520, 100061798, 100012421, 99893234, 99746445, 99576736, 99378464, 99224640, 99200798, 99263641, 99413368, 99604965, 99800850, 99978615, 100119690, 100174690, 100031731, 99859428, 99800018, 99820541, 99999527, 100144623, 100002861, 99834534, 99881050, 99946068, 99842979, 99783943, 100030685, 100247955, 100062057, 99849960, 99922203, 100104019, 100355339, 100582672, 100658630, 100644829, 100542381, 100405098, 100275589, 100188354, 100226761, 100286697, 100253204]
943A00253204j1352J56975J18354j24603k29355l33313k29713J62956L11760L62396
953A00437309K64641r9564k07923j12511j27548k31629j96434k1194O2584J23886J18110
964A00009727L8888m3778j93428k26189j54251j12747o4308k3270L1357K9778l2067
975I9259712o8359j52825p6385K15980K95090K31384J72257M5036p248r1j4588o7001
987I9832962j1299K22252K08526p8613j09596J07597P5218k09571k37793p8606L5255
998I9756332K45316K18224r1027j69044r3697o7207m6158k029Q1512J10268J18858
1009A00061348O2965j26983j28678N2216J15753J60004R2315j70974k02843r178O340
1020I9912285j19064j30608o3446l1731R636n966j05095j14845n6458j8188K3414O2775
$$ y = [100253204, 100241852, 100398827, 100517181, 100392578, 100163223, 99829910, 99600197, 99763153, 100074913, 100437309, 100701950, 100602386, 100394463, 100281952, 100154404, 99922775, 99726341, 99705147, 99767731, 99891617, 100009727, 100048615, 100004837, 99811409, 99585220, 99430969, 99318222, 99253914, 99230644, 99262001, 99291779, 99259712, 99191353, 99038528, 98962143, 99178123, 99473213, 99704597, 99876854, 99921890, 99914642, 99914551, 99899963, 99832962, 99821663, 100043915, 100252441, 100173828, 100064232, 100171829, 100247047, 100037476, 99799683, 99721077, 99756332, 100001648, 100219872, 100128845, 99959801, 99866104, 99798897, 99752739, 99750710, 99832222, 99942490, 100061348, 100124313, 99997330, 99868652, 99920868, 100036621, 100196625, 100288940, 100117966, 99915123, 99905945, 99912285, 99793221, 99662613, 99599167, 99567436, 99577072, 99571106, 99466011, 99351166, 99294708, 99276520, 99299934, 99362709]
1032I9362709J25999J13991j1345J328J36734K04521L09486K22474j45485k09572q942
1043A00101898K8015k0691l8963o8184n8937M051J0086l7262m1793r255j3038n5054
1055I9800873n4642k4490N417Q0200M9118j29585j38237J5091M5013j1917j6762K007
1067I9622086J9165R1766J6884k92565k85362N0804J15464k1882l8932N645K3964M364
1079I9311401Q1177L32123L12012m578p0831O5231M8782q8668j18592r0881l4760J09642
1091I9852058J32111N5862j907j25526r5131J46438J50490o3537j24886q8600j05454
1102I9731918j50299j73156k18613j58524K3728J33224K48436K50191J27678M3060
1112I9857643r5253q3160J16325J50993Q2947J5854j26793j42860l1540J694l3028
$$ y = [99362709, 99488708, 99602699, 99591354, 99592682, 99729416, 99933937, 100243423, 100465897, 100320412, 100110840, 100101898, 100129913, 100109222, 100070259, 100002075, 99943138, 99947189, 99957275, 99920013, 99878220, 99868965, 99855927, 99800873, 99746231, 99721741, 99727158, 99807358, 99856476, 99726891, 99588654, 99603745, 99648758, 99636841, 99620079, 99622086, 99641251, 99733017, 99749901, 99457336, 99171974, 99222778, 99338242, 99316360, 99277428, 99283073, 99307037, 99311401, 99392578, 99724701, 100036713, 100032135, 99961304, 100026535, 100075317, 99986649, 99868057, 99777176, 99742416, 99852058, 99984169, 100040031, 100038124, 99912598, 99817467, 99963905, 100114395, 100050858, 99925972, 99837372, 99731918, 99581619, 99408463, 99189850, 99031326, 99055054, 99188278, 99436714, 99686905, 99814583, 99857643, 99762390, 99679230, 99795555, 99946548, 100029495, 100045349, 99918556, 99775696, 99744156, 99745850, 99712822]
1123I9712822K9068K41371K25334l6293r6245J885j5091j18210j50322j98654p1693
1134I9523972L70048L77014m4151j70830j33491j33156j18324r4010n8014j4328N6793
1145I9561523Q0185P7599L6911p2456j16349j26960j10024m6448o912L2379M6585N4741
1157I9410774N318j35948j80603j44600j52779j71516k10572k97599l12348k72705
1167I7537422k27669j43905j05881j45767n0575J82945L28605M69498M99489M28337
1177I8772499L22968J06140J9668K9305K9968R7107L3882j75476k71133l11943l22319
1188I8330666k90780k38822j82770l6049K57492L86642M41407L72985P9201J7189J37497
1199I9274658J80695K33276K08664J00182K1049r1049j00136L266M5036P4623O8169
$$ y = [99712822, 99741890, 99983261, 100208595, 100172302, 100076057, 100077942, 100062851, 99944641, 99794319, 99595665, 99523972, 99894020, 100271034, 100226883, 100056053, 99922562, 99789406, 99671082, 99577072, 99519058, 99504730, 99561523, 99641708, 99719307, 99756218, 99683762, 99567413, 99440453, 99330429, 99283981, 99277069, 99309448, 99356033, 99410774, 99416092, 99280144, 99099541, 98954941, 98802162, 98630646, 98420074, 98122475, 97810127, 97537422, 97309753, 97165848, 97059967, 96914200, 96863625, 97046570, 97375175, 97844673, 98344162, 98772499, 99095467, 99201607, 99221275, 99250580, 99280548, 99377655, 99411537, 99236061, 98964928, 98652985, 98330666, 98039886, 97801064, 97618294, 97582245, 97839737, 98226379, 98667786, 99040771, 99119972, 99137161, 99274658, 99455353, 99688629, 99897293, 99997475, 100018524, 99927475, 99827339, 99830605, 99875641, 99950264, 100018433]
1210A00018433J1772j5328l2447m1703l6094m1771q8333l1449J79794J97144N6435
1221A00176453l7506j84433j90476m4655J5091O4156L8818j00090j32324r5009o0013
1232I9450012P775L9459M3251N5214P3745O9115M6753J4359l7316p9345j38855j36399
1244I9407768p4791k2339N7030Q7143P8865O4636K4056O012J4854j5953j11656j04828
1256I9410797n249N8701J40480J54251J08337N5313n0972p8727m1291j7334K7970L4042
1268I9796318j022r087L098n814m1916l9818K7207j3497j98097k09190p9155L959J26595
1281I9359581J31035j7113k2842J13128R8488o1554r5611m9942j0880Q5121P0282q0276
1293I9519417r9442j0467J2230m311O027M6898L7483k1820n1880n5618j00616k21970
$$ y = [100018433, 100030205, 100014877, 99982430, 99940727, 99904633, 99862862, 99774529, 99743080, 99922874, 100120018, 100176453, 100138947, 99954514, 99764038, 99719383, 99734474, 99798630, 99837448, 99737358, 99605034, 99510025, 99450012, 99457787, 99497246, 99540497, 99595711, 99669456, 99738571, 99785324, 99799683, 99762367, 99683022, 99544167, 99407768, 99332977, 99310638, 99367668, 99454811, 99533676, 99598312, 99622368, 99628380, 99643234, 99627281, 99515625, 99410797, 99405548, 99464249, 99604729, 99758980, 99867317, 99922630, 99871658, 99792931, 99751640, 99734306, 99762276, 99796318, 99795296, 99786209, 99789307, 99783493, 99741577, 99701759, 99728966, 99715469, 99517372, 99308182, 99229027, 99232986, 99359581, 99490616, 99473503, 99450661, 99563789, 99662277, 99600723, 99505112, 99455170, 99444290, 99529411, 99599693, 99519417, 99419975, 99409508, 99421738, 99417427, 99423454, 99470352, 99507835, 99486015, 99434135, 99378517, 99277901, 99055931]
1305I9055931k11693q9210J5136J78170K22824J67801J15066O531k7565j2489K2430
1316I9442932J11176J47155J70823J26602j1254q4564j57623j31676M0459P1075%m4441
1328I9680664j36520j07506M4182J43219L08059K40158j16439k39495k44522j91711
1338I9380089p347P3578J05094J05690N4795J6136k9732o8779j26388j15395l0373
1349I9357368J9715P2220Q6662N3642N0957Q5518N1590n9174j07887j33270j19446
1360I9357895l5126k1576p2098p2502m2488j7517J4923M0123O5186P6172Q5090N7656
1372I9435738m0841l7551P8720R0004J2802j236K9106K7016o081P86M3800O7261J12915
1385I9812439O9473j01166j35345n9677l1494j7624O485P3410K8015j95740j78673
$$ y = [99055931, 98844238, 98755028, 98770164, 98948334, 99171158, 99338959, 99454025, 99460556, 99432991, 99420502, 99442932, 99554108, 99701263, 99872086, 99998688, 99987434, 99902870, 99745247, 99613571, 99654030, 99725105, 99725105, 99680664, 99544144, 99436638, 99480820, 99624039, 99932098, 100172256, 100055817, 99816322, 99571800, 99380089, 99372742, 99446320, 99551414, 99657104, 99711899, 99728035, 99698303, 99629524, 99503136, 99387741, 99357368, 99377083, 99449303, 99535965, 99589607, 99640564, 99726082, 99777672, 99718498, 99610611, 99477341, 99357895, 99322769, 99301193, 99229095, 99156593, 99114105, 99096588, 99111511, 99151634, 99216820, 99292992, 99378082, 99435738, 99394897, 99357346, 99436066, 99526070, 99538872, 99537636, 99566742, 99593758, 99587677, 99588463, 99632263, 99699524, 99812439, 99881912, 99780746, 99645401, 99585724, 99554230, 99536606, 99543091, 99616501, 99644516, 99448776, 99270103]
1396I9270103Q2474J55350J39473O8954j54449j72165n42O7185J28288Q6624q3855
1407I9587440j82937l22487k55440J03806J65466k7252n7770j0513L5644J43143J40999
1418I9320099J7074r201K9892M3732P7698M0603r2987j30409j18904o2561J01830J25190
1430I9342056L3097k7970j42952j18683P5478J23787P6225M8233J5999m1008j56784
1441I9227478j75026j05690o5521J648j2398j34727j48964j04096k0622J72111K11838
1452I8846031J00060R2773J84631J40854o7825q9531O9000Q2848k6627k0149J02402
1463I9414467J01356M380n9624j45226j63337j29082p1281O4849Q8906K7603l5713
1474I9097298j61621j91307j20499j25336j33774k57904n86670o52458o00792l17169
$$ y = [99270103, 99352577, 99507927, 99647400, 99716354, 99561905, 99389740, 99389198, 99456383, 99584671, 99671295, 99587440, 99404503, 99082016, 98826576, 98930382, 99095848, 99068596, 99010826, 99000313, 99035957, 99179100, 99320099, 99337173, 99327972, 99357864, 99401596, 99479294, 99519897, 99426910, 99296501, 99177597, 99115036, 99216866, 99342056, 99375153, 99347183, 99204231, 99085548, 99161026, 99284813, 99361038, 99409271, 99425270, 99384262, 99227478, 99052452, 98946762, 98881241, 98882889, 98870491, 98735764, 98586800, 98482704, 98462082, 98634193, 98846031, 98946091, 99038864, 99223495, 99364349, 99296524, 99206993, 99275993, 99358841, 99332214, 99312065, 99414467, 99515823, 99520203, 99460579, 99315353, 99152016, 99022934, 98951653, 99016502, 99105408, 99133011, 99097298, 98935677, 98744370, 98623871, 98498535, 98364761, 98106857, 97520187, 96867729, 96266937, 95949768]
1484I5949768L79280O50307O51100N99190L75511K38846J23268L3569k8045p5364j27143
1495I8770287r4964N8434R5604N6580J8478m5944j05072k55181j43142L68995L76107
1506I9100182r2766k48741k64428k38304r8442l4141m1176N2765L03291L15620Q7616
1517I8841476K2271L7788N8052J36902J34827M1648L7316J18614J18347N0163K6421
1528I9623825K9923J6830o104k2338l1144n2208j28578o8741K11243J84151j95381
1539I9561478k18773O5513J42624J29395P3242j03981j37253l9940k3842m0763p1793
1550I9335907j70967j41243N2833P2220o2248r5154r8205m0055J79627J28197k27974
1561I8932938l21747k30080k12593k16843j93283j30844j23413j65054j85867k60521
$$ y = [95949768, 96329048, 96979355, 97630455, 98229645, 98605156, 98844002, 98967270, 99000839, 98972794, 98897430, 98770287, 98675323, 98733757, 98829361, 98885941, 98904419, 98858475, 98753403, 98498222, 98355080, 98724075, 99100182, 99007416, 98758675, 98494247, 98255943, 98157501, 98123360, 98082184, 98134949, 98438240, 98753860, 98841476, 98863747, 98901535, 98959587, 99096489, 99231316, 99272964, 99310280, 99428894, 99547241, 99597404, 99623825, 99653748, 99670578, 99664474, 99642136, 99610992, 99558784, 99430206, 99361465, 99572708, 99756859, 99561478, 99342705, 99408218, 99550842, 99680237, 99753479, 99649498, 99512245, 99472305, 99448463, 99407700, 99335907, 99164940, 99023697, 99076530, 99148750, 99086502, 98991348, 98893143, 98853088, 99032715, 99160912, 98932938, 98611191, 98381111, 98168518, 97951675, 97758392, 97627548, 97504135, 97339081, 97153214, 96892693]
1571I6892693j60485J43769L05366M86641L85162j30821k31933K4177L8597n3901j93573
1582I7505692m74053n80788n89080n12337l14880j26320J06384L00598N07782O04446
1592I6427444O24268N55756L44970K19056J26510M5967j8287o2325o8619j11221j88660
1603I7894859k32818k88719k44645p8750R750O5308J09268J45668J36711L9986O2561
1614I7619179K51693K11335m723k15713o03417o21727k45643j21590j27075j05881
1624I6036438j60629l7171L55347L99200J12442M0368P2479J05423J24962K91389P74910
1635I8115158P34261J45881n4809m9683m6921L3638P9277J40404J28029J5572j908
1646I9238899N1880P6386J12823R6794J5236j5137m440k9083j04759r2629J9837M3418
$$ y = [96892693, 96732208, 96875977, 97181343, 97667984, 98053146, 97922325, 97690392, 97714569, 97753166, 97699265, 97505692, 97031639, 96450851, 95861771, 95349434, 95034554, 94908234, 95014618, 95315216, 95822998, 96427444, 97051712, 97607468, 97952438, 98171494, 98298004, 98343971, 98325684, 98263359, 98194740, 98083519, 97894859, 97662041, 97373322, 97128677, 97049927, 97059677, 97124985, 97234253, 97379921, 97516632, 97556618, 97619179, 97870872, 98082207, 98077484, 97861771, 97258354, 96636627, 96390984, 96269394, 96142319, 96036438, 95875809, 95838638, 96193985, 96593185, 96705627, 96745995, 96818474, 96923897, 97048859, 97340248, 98115158, 98849419, 98995300, 98940491, 98890808, 98843887, 98877525, 98956802, 99097206, 99225235, 99240807, 99238899, 99290779, 99367165, 99479988, 99576782, 99592018, 99576881, 99572441, 99543358, 99438599, 99345970, 99365807, 99409225]
1658I9409225L167j2040l4477k3979J5564N9395J39046J52992J23352O2942p1571j19896
1670I9703720j26533p3769J04935J25450o600k9731J6929K8130K6611K6413L3547R628
1682I9838730o4583p3746k2697p363O051k1912j29364j24695m6K1607m8996l2189N4024
1695I9394821J02020J46866J55594J47293P8346j06216j42960m8606j9768j6190k479
1706I9688721K0721K0332M128k5818q8478j10367j27098o9954R9800J58242J65245
1717I9735474J04904r9777j25145J7715M9278J5686J1856L1182N104j03623p7842J13609
1729I9678421J28769l2135k8183J40121J33843k9160q1413o7955p6294q5472r1957
1740I9588585j16325p9819L8406P5890O7970L5408q8097n8319J34301K07191K60399
$$ y = [99409225, 99412392, 99400352, 99365875, 99341896, 99357460, 99416855, 99555901, 99708893, 99832245, 99895187, 99823616, 99703720, 99577187, 99503418, 99608353, 99733803, 99727203, 99697472, 99714401, 99742531, 99769142, 99795555, 99829102, 99838730, 99774147, 99700401, 99677704, 99670341, 99676392, 99654480, 99525116, 99400421, 99400375, 99421982, 99372986, 99340797, 99394821, 99496841, 99643707, 99799301, 99946594, 100024940, 99918724, 99775764, 99727158, 99707390, 99691200, 99688721, 99709442, 99729774, 99733902, 99708084, 99619606, 99509239, 99382141, 99312187, 99411987, 99570229, 99735474, 99840378, 99740601, 99615456, 99633171, 99682449, 99698135, 99709991, 99741173, 99746277, 99642654, 99564812, 99678421, 99807190, 99775055, 99746872, 99886993, 100020836, 99991676, 99910263, 99842308, 99766014, 99680542, 99588585, 99472260, 99392441, 99430847, 99506737, 99574707, 99610115, 99522018, 99463699, 99598000, 99805191, 100065590]
1751A00065590J76193j22574k09640j51993j08238k0294L8101Q3633J23215J87805
1761A00061798J46294k0600j04713j79077j59859k0500M8874J16081R9731k6466p6004
1772I9885559r9495q1154J8906K5009p3791n8098Q7257Q1871q1535r3796K8397M2411
1784I9681541k3002m0512n1377j8165P9292J22910J53968J25008K3743n3429j74759
1795I9825218j63940p889O4705J32629J09177m9118q1871j0040j0537o3247p1984n9127
1807I9613976l1258L4454N3169M5990J3161q7166q7951R056M3678O1203M0581o3446
1819I9645447m9111R9587J16562L8238j5304j05568j07002j4237K5604O3973M2198
1830I9740387q0895q1947L0235O7254Q4114M9118q8196r4338L4592M9332l6003k8847
$$ y = [100065590, 100241783, 100119209, 99909569, 99757576, 99649338, 99629044, 99667145, 99750778, 99873993, 100061798, 100208092, 100187492, 100082779, 99903702, 99743843, 99723343, 99772217, 99888298, 99988029, 99961563, 99885559, 99786064, 99704910, 99723816, 99748825, 99675034, 99616936, 99704193, 99786064, 99704529, 99610733, 99639130, 99681541, 99658539, 99618027, 99566650, 99548485, 99627777, 99750687, 99904655, 100029663, 100053406, 99999977, 99825218, 99661278, 99653389, 99718094, 99850723, 99959900, 99910782, 99828911, 99818871, 99808334, 99745087, 99673103, 99613976, 99582718, 99617172, 99670341, 99716331, 99729492, 99642326, 99554375, 99563431, 99607109, 99668312, 99708893, 99645447, 99596336, 99695923, 99812485, 99850723, 99835419, 99729851, 99622849, 99608612, 99634216, 99698189, 99740387, 99659492, 99577545, 99607780, 99675034, 99759148, 99808266, 99720070, 99625732, 99660324, 99709656, 99673653, 99644806]
1842I9644806O8237P2663k167k7535k9709l2470k8778k3316j9432P17N0377N8693L8483
1855I9770569R064n1003p5531r4459n4261P9315J15616R6291M5113q9242j25572r8854
1867I9527046n0545O9573J01974O5346M4251N49K151O9756N2315n8777p8171j8913
1879I9726555j4519o6803l5286R9709J18805N0758j45r1217r7755k0623J8715P7011
1891I9765205M8378j08146j22933j0895J7716L075n463l2661k8992N890K1003L2357
1903I9584534K6581j3901n623O5040O0059k9663k9846O5780N7549m8325p7201o8879
1915I9586105l8864M0482P4127R5535O5850m9828p3174k2384l220P393K2911O0845
1927I9765778L7506o1066r5673j07833p0931N5405Q3015L9437K670q3687p2044N4573
$$ y = [99644806, 99713043, 99785706, 99783539, 99756004, 99726295, 99693825, 99665047, 99641731, 99622299, 99623016, 99673393, 99732086, 99770569, 99779633, 99728630, 99653099, 99558640, 99504379, 99583694, 99699310, 99795601, 99840714, 99751472, 99625900, 99527046, 99476501, 99546074, 99648048, 99713394, 99757645, 99758194, 99760345, 99830101, 99882416, 99823639, 99745468, 99726555, 99712036, 99645233, 99609947, 99709656, 99828461, 99879219, 99879074, 99787857, 99690102, 99669479, 99688194, 99765205, 99813583, 99705437, 99582504, 99571609, 99589325, 99592400, 99586937, 99554276, 99525284, 99531174, 99552177, 99584534, 99611115, 99597214, 99591591, 99656631, 99716690, 99687027, 99657181, 99722961, 99780510, 99732185, 99654984, 99586105, 99547241, 99587723, 99661850, 99757385, 99823235, 99773407, 99700233, 99677849, 99674629, 99682022, 99704933, 99765778, 99803284, 99742218, 99646545, 99538712, 99467781, 99523186, 99606201, 99645638, 99648308, 99564621, 99492577, 99547150]
1939I9547150Q0345L1730J8502J7837J0918R994j5098r1644q0559L1135N2330K861
1951I9615501n531m532K0699J00418R8640J7304j5640l2898l1907J412Q201j0131l82
1964I9761154L1517N5863J07025P7034m8233j04332j44028j20689J3832J9996j11953
1975I9537186j03478K0073Q1635J53518J23337n9082q0803M0009O2896L9574L464r6634
1987I9721695q9645L6956O1676J0682N26Q964Q393J907M532J2634K5650N1766N8502
2000I9914238O3614K8610q1970q8051J1162L2280J907l189Q316n768n7457n6579r133
2013I9757980J8547O3065M3991o0516q2894n5717j6571P7675R1789L8505J984n4436
2025I9823402o8428m2457k9228j8387J022L1067N2193Q4022O7543R54m9782j29204
$$ y = [99547150, 99627495, 99659225, 99677727, 99695564, 99706482, 99716476, 99701378, 99609734, 99529175, 99560310, 99612640, 99615501, 99609970, 99605438, 99626137, 99726555, 99825195, 99842499, 99826859, 99793961, 99762054, 99763466, 99771667, 99761536, 99761154, 99792671, 99848534, 99955559, 100032593, 99984360, 99880028, 99736000, 99615311, 99629143, 99649139, 99537186, 99433708, 99453781, 99535416, 99688934, 99812271, 99753189, 99672386, 99712395, 99775291, 99814865, 99818329, 99721695, 99632050, 99669006, 99730682, 99741364, 99741890, 99750854, 99759247, 99761154, 99765686, 99778320, 99803970, 99855736, 99914238, 99977852, 100006462, 99924492, 99836441, 99847603, 99879883, 99881790, 99878601, 99886917, 99881149, 99823692, 99767113, 99757980, 99776527, 99839592, 99883583, 99823067, 99740173, 99684456, 99667885, 99745560, 99837349, 99875854, 99877838, 99823402, 99754974, 99712517, 99683289, 99664902, 99665924, 99696991, 99749184, 99833206, 99900749, 99901703, 99851921, 99722717]
2037I9722717j25457k8847R727L0426K3293n2857k3414J35490J53710O1493P652o6879
2049I9847054p4860o203J1444K098k861j9790j4710K388L7285J40427J04118j21590
2061I9904800j29249O8428J14799P4814M5014j9501l6026J4946k7634k03865j92482
2072I9614044N158P3021Q4022O2393m3937n1117L7307N1453K3392n654o9069p4623
2084I9706390j7379r468n8846k1622J28815J41937L8956j4763p8842q0299j2780K5246
2096I9747345Q0467O4568l5477p9346j20407q5708O0989J01685Q2710L6430j05362
2107I9747894j02516N5382Q6334J8166K1362R6466P0595o9336r8343m9690j5732M4579
2119I9805161N9295L9604J2566n9822n2757N0232N8197j3039l5835m2107l2021R423
$$ y = [99722717, 99597260, 99568413, 99578140, 99608566, 99631859, 99579002, 99555588, 99691078, 99844788, 99906281, 99913933, 99847054, 99772194, 99765991, 99777435, 99779533, 99776672, 99756882, 99742172, 99744560, 99781845, 99922272, 100026390, 99904800, 99775551, 99843979, 99958778, 100033592, 100078606, 100059105, 100023079, 100038025, 100010391, 99806526, 99614044, 99619202, 99692223, 99776245, 99838638, 99794701, 99743584, 99780891, 99832344, 99855736, 99850082, 99781013, 99706390, 99689011, 99679543, 99620697, 99599075, 99727890, 99869827, 99908783, 99894020, 99815178, 99734879, 99722099, 99747345, 99827812, 99892380, 99856903, 99777557, 99657150, 99571442, 99632431, 99734116, 99816826, 99853256, 99747894, 99645378, 99700760, 99787094, 99805260, 99826622, 99923088, 99993683, 99924347, 99826004, 99776314, 99760582, 99805161, 99864456, 99904060, 99916626, 99856804, 99804047, 99854279, 99912476, 99899437, 99863602, 99821495, 99789474, 99798897]
2131I9798897K2362J5541J3664J4809J831l1281m3320m5082l4668j816J0567J9287
2143I9740791j45p3715p3006l669K8564N8624N2498J740k6154o4064m8088M0322O2797
2156I9696495L5591L2021L4981L9192O8474L2592j08505j04713O5879O5232j07628
2167I9749611j10771L2592P3319O5514M1679m0749m4204L1120M8157L1898J9432j0635
2179I9886963j0132K0317L4828N9967L5164m8378r5169j53190j26244J5427N6244K4459
2191I9700256K2416K7229K8015K7702K5391J9859J6884J7281J1970q156K076O8733
2203I9959656M2106j01997j17249k1125R636J3969J2756k5344M028J32583J29059J259
2215A00039337n0850q0993p4433j0322J3084J2207J9554N0995J0178j44333j50490
$$ y = [99798897, 99821259, 99836800, 99850464, 99865273, 99867104, 99835823, 99792503, 99747421, 99712753, 99710937, 99721504, 99740791, 99740646, 99666931, 99593925, 99590256, 99618820, 99677444, 99729942, 99731682, 99705528, 99641464, 99593376, 99633698, 99696495, 99732086, 99764107, 99799088, 99838280, 99906754, 99939346, 99830841, 99726128, 99792007, 99857239, 99749611, 99638840, 99671432, 99744751, 99810265, 99851944, 99811195, 99766991, 99798111, 99846268, 99878166, 99897598, 99886963, 99876831, 99897148, 99931976, 99991943, 100027107, 99978729, 99883560, 99730370, 99604126, 99619553, 99675797, 99700256, 99722672, 99749901, 99777916, 99805618, 99831009, 99850868, 99867752, 99885033, 99897003, 99888847, 99890923, 99959656, 100001762, 99899765, 99782516, 99761391, 99771027, 99784996, 99797752, 99772408, 99776436, 99909019, 100038078, 100039337, 99988487, 99907494, 99833061, 99822739, 99835823, 99848030, 99867584, 99918579, 99928757, 99784424, 99633934]
2226I9633934j4069K5727L792J9523P2411O4872j1947k5009Q491K3979M8066L8910
2238I9888680K555m3563j47316j34636m6O0440R9754J02020N6214K2270l2516l7438
2250I9836418R064K9945O4705L2211r6084j25046q7143m7783L3715N9700M0771L1899
2262I9782372J4091Q011Q987J4733M1725K5986m5533n6938j526k2125j42838j24526
2274I9502419N0735P2029n4481m2771R1744J24572J10245N5100r5223j29700q9622
2285I9595047k0836J50871J74233P1457M722j06048j03028L5408O4919J9455P461J5885
2297I9909546j1780q8264j06072q3282n5405M700K3674J785J1231O9145L4759j29013
2309I9581024j33247R079O0562Q5258O4011l3020o7490j01143k5436K47887K57133
$$ y = [99633934, 99619865, 99645592, 99649384, 99668907, 99741318, 99806190, 99794243, 99769234, 99777725, 99801704, 99849770, 99888680, 99891235, 99847672, 99700356, 99565720, 99565674, 99626114, 99725868, 99827888, 99884102, 99906372, 99873856, 99836418, 99845482, 99875427, 99940132, 99972343, 99876259, 99751213, 99664070, 99616287, 99650002, 99709702, 99750473, 99782372, 99796463, 99804474, 99813461, 99828194, 99869919, 99895905, 99850372, 99793434, 99791908, 99769783, 99626945, 99502419, 99553154, 99625183, 99570702, 99527931, 99619675, 99744247, 99854492, 99909592, 99814369, 99684669, 99595047, 99574211, 99725082, 99899315, 99970772, 99975494, 99869446, 99766418, 99801826, 99866745, 99886200, 99893661, 99909546, 99897766, 99809502, 99703430, 99620148, 99564743, 99569443, 99593117, 99594902, 99606133, 99675278, 99710037, 99581024, 99447777, 99456856, 99517418, 99602676, 99666687, 99633667, 99566177, 99465034, 99439598, 99687485, 99944618]
2320I9944618j0185m2648J09069J35903J17348M4082j82792j58432J40503K15698J90422
2331A00503586O9931k92442l15621j6830R1690J60507R9327j86043k28637j10276K9183
2342I9804375L69812L30970j06994k84866m09630l12805Q1329L01071N21088N14175
2352A00808525K64595O2225j74926m08905q10242p35123j65672J82648O16317O24939
2362A00264381J59645p3791k85477l41087k41234j17752J57021K04254J6258K243J32065
2373I9876526J16798k0935q2680j35826j09535L1952P4814N7556L9795j0849k4605
2384I9813011p17j2115n9266o7474n5412k3026O7330O4895l9413n8556k7466O531Q2016
2397I9690338R1820L3302K4132N5435M4701J762l0159q2825p2502J3756M0077K8756
$$ y = [99944618, 99934433, 99891785, 100000854, 100136757, 100254105, 100298187, 100115395, 99956963, 100097466, 100313164, 100503586, 100573517, 100281075, 99965454, 99948624, 100040314, 100200821, 100300148, 100114105, 99885468, 99775192, 99804375, 100174187, 100505157, 100398163, 100113297, 99703667, 99390862, 99472191, 99773262, 100294350, 100808525, 101073120, 101135345, 100960419, 100551514, 99741272, 99006149, 98840477, 99023125, 99639442, 100264381, 100424026, 100350235, 100064758, 99723671, 99482437, 99364685, 99521706, 99725960, 99742218, 99744461, 99876526, 99993324, 99972389, 99889709, 99753883, 99644348, 99676300, 99751114, 99808670, 99848465, 99837616, 99813011, 99812294, 99800179, 99740913, 99673439, 99618027, 99595001, 99662331, 99727226, 99687813, 99629257, 99601791, 99608322, 99690338, 99782158, 99815460, 99839592, 99895027, 99939728, 99941490, 99911331, 99828506, 99756004, 99769760, 99809837, 99838593]
2409I9838593K6435L2212L151q3138r4200l5736j7380j4404j6190l7002l0442J0102
2421I9582001J1520k9854k6413J1589L7354P7850P1976J6403j4351n7365l8956O5445
2433I9707199Q3664L3493J5595J9241j3497j16775r6252P1502R8465K2461j9882r3895
2445I9711319p4883P0687Q3618k0195m5349l1708j5190K3270M3014O0867M9996J884
2457I9857330k2674l7148m8607o9046m3632M7447O9946M7402J9981m1801o0150m5945
2469I9673103l3737k2339J7693J21284J19088J8051m0245j09200j17035p4463j0749
2480I9541451J27098J56211J06263M1130j01044j36902q2367n7152l5980m96O6826
2491I9625038P7370J9546K8275J05598J08055O1821N600j08810j27487n8098k4155
$$ y = [99838593, 99865028, 99897240, 99900391, 99817253, 99723053, 99687317, 99669937, 99655533, 99639343, 99602341, 99571899, 99582001, 99593521, 99563667, 99537254, 99548843, 99586197, 99664047, 99736023, 99752426, 99738075, 99680710, 99641754, 99707199, 99790863, 99824356, 99839951, 99859192, 99845695, 99728920, 99632668, 99704170, 99802635, 99825096, 99805214, 99711319, 99636436, 99707123, 99790741, 99770546, 99725197, 99693489, 99678299, 99701569, 99744583, 99805450, 99855446, 99857330, 99834656, 99797508, 99748901, 99679855, 99636223, 99683670, 99753616, 99801018, 99820999, 99779198, 99719048, 99673103, 99639366, 99617027, 99634720, 99756004, 99875092, 99893143, 99852898, 99743698, 99626663, 99552200, 99541451, 99668549, 99824760, 99931023, 99972153, 99871109, 99734207, 99651840, 99594688, 99558708, 99558212, 99625038, 99702408, 99721954, 99750229, 99855827, 99963882, 100025703, 100031303, 99922493, 99795006, 99736908, 99712753]
2502I9712753N745K9305O5109M0840p5386q4045M631L1990L1448K7847P538K60k838
2515I9795197L723L1181K8877j457j6380k5940l3524m4296l4355n173K4963P5814Q6334
2528I9884964O8809L4874m8492o0890K502J862n9632n4954K2202J9233p8560n9936
2540I9671982R4269R5802m0672q5831j03836o7612O9519R3697L0998r232q4655p4059
2552I9590370M6280O0295j8783k8115J1711K0050R774J0040J9287J4443j3871n272
2564I9716209M6563N6007M1100J5090n4832n0903L2638N4909M8874K3346m5517p1381
2576I9812103p1335o3469l6453j7547M860J1398K334m074l1303m074J04950J10817
2588I9818207K2148j0681k2698k4391j999j68j9554j2848L2380J8806o4179p7110k8320
$$ y = [99712753, 99718498, 99747803, 99812912, 99853752, 99778366, 99694321, 99698952, 99730942, 99762390, 99790237, 99797775, 99798035, 99795197, 99798920, 99830101, 99858978, 99857521, 99841141, 99815201, 99781677, 99737381, 99703026, 99697853, 99722816, 99798630, 99884964, 99953773, 99988647, 99940155, 99879265, 99881767, 99883629, 99823997, 99769043, 99791245, 99810478, 99731918, 99671982, 99766251, 99862053, 99821381, 99735550, 99631714, 99564102, 99633621, 99727318, 99758316, 99749084, 99664429, 99590370, 99636650, 99696945, 99678162, 99650047, 99661758, 99681808, 99691582, 99701622, 99720909, 99735352, 99721481, 99716209, 99762772, 99818779, 99859879, 99874969, 99820137, 99769234, 99801872, 99856781, 99905655, 99929001, 99883484, 99812103, 99740768, 99677299, 99640846, 99623299, 99628159, 99639557, 99641891, 99637817, 99606514, 99602440, 99707390, 99818207, 99840355, 99829674, 99806976, 99782585, 99780586, 99780418, 99760864, 99748016, 99780396, 99799202, 99735023, 99657913, 99629593]
2601I9629593k3987o2897m3892L0213O9519J20071Q7357n9487j02691r2217m6158Q4786
2613I9590210J21399R9777N4741p3051q1231K5010O3995R4414O3034p0114r2011k4437
2625I9771736O462N0904L4042p5981p6821K7588N0690J5518J6380M3847M1244K7802
2637I9933411j6762j49536j22025J05744J25427k7062q7303j45965j04905R5231J18515
2648I9724770k0119m4396O41J8959L8712M3060M0245J3756p2067n8296P1693R2316
2660I9849274L4668l82n8418n8098Q507K7923J8639J9867L7476Q392r4841r9518o699
2673I9686790J4969m409j6686n9822l0304R7893J17019N0805J1802m4037n3375j5045
2685I9755600K838K0813K4506J9386k342o1959o6642k3484L174L5095M9492N3261M1580
$$ y = [99629593, 99605606, 99542709, 99498817, 99529030, 99598549, 99718620, 99805977, 99746490, 99643799, 99551582, 99505424, 99590210, 99711609, 99811386, 99866127, 99793076, 99711845, 99736855, 99800850, 99895264, 99958298, 99888184, 99796173, 99771736, 99778198, 99829102, 99863144, 99787163, 99710342, 99737930, 99788620, 99804138, 99820518, 99864365, 99905609, 99933411, 99916649, 99767113, 99645088, 99750832, 99876259, 99849197, 99761894, 99615929, 99511024, 99606255, 99724770, 99704651, 99660255, 99660896, 99679855, 99718567, 99761627, 99801872, 99815628, 99743561, 99685265, 99756958, 99849274, 99883942, 99883560, 99825142, 99767044, 99775551, 99803474, 99822113, 99841980, 99879456, 99887848, 99793007, 99693489, 99686790, 99701759, 99697350, 99680664, 99620842, 99590538, 99688431, 99805450, 99856255, 99868057, 99824020, 99770645, 99755600, 99758438, 99779251, 99803757, 99823143, 99820801, 99758842, 99692200, 99668716, 99671890, 99706985, 99756477, 99809738, 99851318]
2698I9851318N341j4206k4345l7362o4682m8561K0409M6516L9269N6190J12297R0073
2710A00032257k1553o0745n9654n1857k2652K411M8492M0314m0123m5731J5717K7939
2722I9864815J5808l838o2584n1216M4991N7625J693j4518j0369j6716m3083k0813
2734I9761795P9346P1434n2284p4967k5909m746K8130J3878p0404p4318r728K0218
2746I9662445N0598M4052j2108k9800l0594j6380K3895M7562P4486O7657J1925M883
2758I9898621M7805L7980j3306m8538j00754r5368k9731J0635O1508O5140J8257q415
2770I9843834l6453n0354n3856m7852k8442j0376J5404K7107L2951K1645j8906k8961
2782I9665741k4727j480O0104P7843O4255N1117K5604O920q537k5917m9782n7007n4146
$$ y = [99851318, 99856659, 99842453, 99818108, 99780746, 99716064, 99667503, 99687912, 99734428, 99773697, 99829887, 99942184, 100032257, 100010704, 99949959, 99890305, 99838448, 99815796, 99818207, 99866699, 99907013, 99866890, 99821159, 99836876, 99864815, 99880623, 99876785, 99814201, 99762985, 99807976, 99865601, 99867294, 99852776, 99842407, 99825691, 99782608, 99761795, 99841141, 99912575, 99860291, 99785324, 99759415, 99754669, 99782799, 99796677, 99726273, 99651955, 99642227, 99662445, 99713043, 99757095, 99744987, 99715187, 99684593, 99668213, 99692108, 99739670, 99814156, 99881813, 99893738, 99898621, 99946426, 99984406, 99971100, 99922562, 99821808, 99726440, 99696709, 99707344, 99768852, 99833992, 99852249, 99843834, 99807381, 99757027, 99703171, 99655319, 99626877, 99616501, 99631905, 99659012, 99691963, 99713608, 99694702, 99665741, 99641014, 99639534, 99699638, 99777481, 99841736, 99892853, 99918457, 99925377, 99916840, 99890923, 99841141, 99784134, 99729988]
2795I9729988l8429m318K2964O6277N9196m959l3089m8187n1445m1298k2957J6922
2807I9650665K9831K3224J5450k289j3214k4842k3964l456n073k9450l2661k9801m676
2820I9549744O7764P0854m242n554P4745N3330p9628j01426m3273l289P0763O7833
2832I9717621j5885n4191q6617q1421j3275j5403r0126r5124n3055j5991N4764N6313
2844I9307610k2744l4164J1444Q194l6423m6707n0354j2283J04431J16943M5944q796
2856I9383095j01830j14967o0722p538J03836J04904n394n4451j01547q2398M0345
2867I9103333N2925j9883o3606j37741j18896J3900N3048L1974K4315R827m105k2125
2879I8922966l3257o0318k3101J14463J27549K4467l387l556K2484J06240J22932R8297
$$ y = [99729988, 99691559, 99687241, 99710205, 99776482, 99835678, 99830719, 99797630, 99749443, 99697998, 99656700, 99633743, 99650665, 99680496, 99703720, 99719170, 99716881, 99703667, 99678825, 99654861, 99651405, 99646332, 99616882, 99584221, 99554420, 99549744, 99617508, 99688362, 99684120, 99678566, 99753311, 99806641, 99727013, 99625587, 99582314, 99579025, 99649788, 99717621, 99701736, 99647545, 99560928, 99479507, 99466232, 99450829, 99360703, 99265579, 99212524, 99196533, 99251297, 99307610, 99284866, 99250702, 99262146, 99270340, 99233917, 99187210, 99136856, 99124573, 99229004, 99345947, 99391891, 99383095, 99281265, 99166298, 99105576, 99098038, 99201874, 99306778, 99301384, 99246933, 99145386, 99062988, 99103333, 99156258, 99136375, 99072769, 98935028, 98816132, 98830032, 98883080, 98915054, 98939369, 98949196, 98945091, 98922966, 98889709, 98829391, 98806290, 98920753, 99048302, 99072769, 99069382, 99065826, 99088310, 99194550, 99317482, 99415779]
2891I9415779N3787m8729p8537n7319k9206M5945N1353j4854k8389r735j473N127J7593
2904I9321342L0182N8197J43006J03782o4704j60668k91496k29622R0507J78841J22833
2915I9302200O2584r3796j18927m4631K9014J93337J82937j4160q4663j08216p9727
2926I9225952M0741Q8173J08643Q2588j3207o6444j28700j05980L5690O6330J984Q125
2938I9343895P3433P7652L6644O943l0808n5977r2178o5964M0695Q2161R5940P7606
2950I9590042N49k4635q675j9172o3729m4418N3269P3310M3251Q675p2212p7919j6853
2963I9441483K3170Q8051Q1940N371m8043j27815j29799m6821j1658L738J9860L1997
2975I9331474L8216L6049L7269M6204L3569o149k1957l5385j1490Q3709P9132j9317
$$ y = [99415779, 99469566, 99420837, 99342300, 99284981, 99255775, 99301720, 99353073, 99338219, 99309830, 99300095, 99298622, 99303749, 99321342, 99351524, 99409721, 99552727, 99656509, 99591805, 99431137, 99139641, 98910019, 99000526, 99179367, 99302200, 99364784, 99270988, 99152061, 99107430, 99136444, 99329781, 99512718, 99498558, 99413895, 99305679, 99225952, 99266693, 99354866, 99463509, 99546097, 99532890, 99466446, 99337746, 99231766, 99267456, 99333786, 99335770, 99343895, 99417328, 99494980, 99531624, 99538567, 99507759, 99451782, 99359604, 99293640, 99334335, 99416496, 99512436, 99590042, 99590591, 99565956, 99557281, 99538109, 99474380, 99429962, 99483231, 99556541, 99599792, 99608467, 99536255, 99458336, 99441483, 99464653, 99552704, 99634644, 99640015, 99591972, 99464157, 99334358, 99287537, 99275879, 99279617, 99299477, 99331474, 99369690, 99405739, 99443008, 99489212, 99522781, 99516632, 99494675, 99459290, 99447800, 99531509, 99610641, 99591324]
2987I9591324o4202j07078q9233K3002L6095k7130o4728j26457j15563k4650J9859
2998I9051239N6793N7266J885k838M4128L1899o0532l8437J17874J34827N4100j7548
3010I9430656j62002j58669M265N8792P7248L8078j07933j42410q8570p1907o8184
3021I8809364m8881l1609K5604J85776J54610j04378j51153n6580K2606J82388J95358
3032I9183105O1989P630k9305k8107L0159M8852N4527L7460k1965l5736n150j3443
3044I9290016n3863p0404r1813n9463M9400Q4854Q6739M5609q2665j12411p5173l0754
3056I8980072P1854Q8264K4605N95k1744j0437N7144N8243j3511j0209O7925P3982
3068I9366783K2362K342l891j4541j0804m9972j88637j43265J16852J85204J29463
$$ y = [99591324, 99527122, 99420044, 99330811, 99353813, 99389908, 99362778, 99298050, 99171593, 99056030, 99031380, 99051239, 99108032, 99165298, 99167183, 99164345, 99208473, 99240372, 99179840, 99141403, 99259277, 99394104, 99448204, 99430656, 99268654, 99109985, 99114250, 99173042, 99250290, 99288368, 99180435, 99038025, 98949455, 98877548, 98809364, 98760483, 98728874, 98754478, 98940254, 99094864, 98990486, 98839333, 98782753, 98805359, 98987747, 99183105, 99245094, 99252724, 99223419, 99195312, 99225471, 99274323, 99328850, 99366310, 99344345, 99308609, 99303459, 99290016, 99236153, 99165749, 99073936, 99014473, 99063873, 99148727, 99235466, 99281075, 99198410, 99085999, 99010826, 98980072, 99051926, 99140190, 99164795, 99165390, 99143646, 99133209, 99190353, 99248596, 99235085, 99224876, 99292801, 99366783, 99389145, 99391487, 99387596, 99373055, 99362251, 99312279, 99123642, 98980377, 99097229, 99282433, 99411896]
3079I9411896Q5350p866m3015n2185j4190J18377J34491L9223K3216Q5976L8841j57715
3091I9662399j56975M4533Q6052K5101p774p5242n7197O6498R5031N9990L5859r896
3103I9768379k1698K693j358l5453k8611J4473M1413Q8646O2484n9959r3414p7607
3115I9659988l9215O2371R1240O8214M5799k601k3217l2669j8333M4273M4205j2398
3127I9887657l9459o9023n9197L929K2728K572J9332Q9699P1022n1590p5912k9206
3139I9772552m844M3587K3788r9754r2598N2978P1358j9218k6200L3592L4859j4549
3151I9775551k0882M715J2757Q850J9714O1920M2511n8960o8046R437K2057j3016j3329
3164I9783279P317K1431M3945M2435J4976J458j7479m433O2965N7694k9610l4546K9900
$$ y = [99411896, 99497246, 99489380, 99446365, 99394180, 99379990, 99498367, 99632858, 99672081, 99695297, 99781273, 99820114, 99662399, 99505424, 99549957, 99636009, 99661110, 99653336, 99578094, 99520897, 99587395, 99682426, 99742416, 99778275, 99768379, 99746681, 99749374, 99748016, 99712563, 99683952, 99698425, 99739838, 99828484, 99890968, 99831009, 99737595, 99659988, 99620773, 99683144, 99774384, 99842598, 99888397, 99885796, 99862579, 99829910, 99811577, 99855850, 99900055, 99887657, 99848198, 99779175, 99719978, 99723907, 99746635, 99749207, 99768539, 99858238, 99929260, 99877670, 99801758, 99772552, 99767708, 99811295, 99835083, 99735329, 99642731, 99695709, 99767067, 99747849, 99721649, 99755241, 99790100, 99775551, 99754669, 99759384, 99772141, 99780991, 99800705, 99862625, 99905136, 99846176, 99778130, 99787567, 99809624, 99796608, 99783279, 99790596, 99812027, 99855972, 99898407, 99913383, 99914841, 99897362, 99892929, 99955894, 100013588, 99983978, 99949432, 99979332]
3177I9979332N1254O5903M0649n1597o9519j1872k5062j13747j12846m3366J3710J11817
3189I9834656J18042J4450N531Q9813O8642p3364p6317P3738O0753j27915j25785O7657
3201I9929901Q3740n0048p5104l9459r675N3833N9197N180j1589n3k1027j07383o6971
3214I9750542J39663J62392K5314j7952j7570k6703j7426m8324j56601j35155J5282
3225I9673462R0218J68060J39549m1557q1299p942k381l6934m1793l1830j7502J5144
3237I9825195K0714n913Q85N5123L4828p2884r4459n6267k6634K2056M7516N4192O6307
3250I9870659R8106O8329m6081p1671k5032j3351j3497j1085r514r583k1461l716O0150
3263I9872253O2584r460L502J24862J01281o3156j31585j85279j36132Q2703J15394
$$ y = [99979332, 100030586, 100096489, 100137138, 100085541, 100016022, 100004150, 99979088, 99865341, 99752495, 99709129, 99722839, 99834656, 99952698, 99967148, 99972679, 100062492, 100131134, 100057770, 99981453, 100055191, 100115944, 99988029, 99862244, 99929901, 100013641, 99963593, 99888489, 99849030, 99839355, 99893188, 99952385, 99957565, 99945976, 99945923, 99924896, 99817513, 99750542, 99890205, 100052597, 100077911, 100059959, 100042389, 100015686, 99998260, 99949936, 99793335, 99658180, 99673462, 99763680, 99931740, 100071289, 100029732, 99948433, 99940491, 99938110, 99901176, 99859383, 99827553, 99810051, 99825195, 99845909, 99839996, 99840881, 99896004, 99930832, 99857948, 99763489, 99707222, 99680588, 99702644, 99750160, 99804352, 99870659, 99968765, 100037094, 99991013, 99919342, 99894310, 99880959, 99867462, 99856377, 99846863, 99837280, 99815819, 99812103, 99872253, 99934837, 99925377, 99928879, 100053741, 100155022, 100091866, 99960281, 99775002, 99638870, 99721573, 99836967]
3274I9836967j8402m1793j2162K2980J19782J01043m9324q9844n2612n0789p5073m9400
3286I9641373L7452O4423M1771M9377Q6708P5890K7779k3293j19591j26670o1753R491
3298I9702957J56494J66848O0440l0159k13196j88492Q4709J43120M6921J8432O554
3309I9954628o981j7479k5848m8683j8929R9297R5398l3669o5567l2707k7847m1298
3321I9830315j9165N9196N7106l1662m5662j3084J7402Q3252Q3374J2139p057J4923
3333A00041077j831n7198p1884o5827l8650K9259N8815Q0208N1612o0867q0086j0299
3345I9874329j1635p8156p3761j7692L0540J22353J11534k2125n1758j5305J2062Q6617
3357I9967003N8365j03379j26098m7997J0849J21453J19781J0132o0989j83342j44509
$$ y = [99836967, 99818565, 99776772, 99764610, 99787590, 99907372, 100008415, 99959091, 99869247, 99816635, 99765846, 99690773, 99641373, 99678825, 99743248, 99785019, 99834396, 99921104, 99996994, 100024773, 100001480, 99881889, 99755219, 99693466, 99702957, 99859451, 100026299, 100086739, 100056580, 99843384, 99654892, 99739601, 99882721, 99929642, 99948074, 99954628, 99947647, 99930168, 99904320, 99855637, 99836708, 99936005, 100031403, 99997734, 99932167, 99899460, 99871613, 99830315, 99811150, 99870346, 99927452, 99895790, 99850128, 99837044, 99854446, 99937698, 100021072, 100033211, 100026154, 100041077, 100039246, 99982048, 99910164, 99844337, 99805687, 99834946, 99893761, 99973969, 100025581, 99964714, 99884628, 99874329, 99862694, 99784538, 99710777, 99693085, 99723625, 99845978, 99957512, 99935387, 99883629, 99868324, 99880386, 99967003, 100025368, 99921989, 99795891, 99747894, 99758743, 99880196, 99999977, 100010109, 99949120, 99765778, 99621269]
3368I9621269J13754J45768l2593l9223Q7006J19255J17157O8977o6261j13197j02044
3379I9919868q7379n5244p203Q4450J10153Q8784N4168k8061n4359m5181k2248L7964
3391I9995712O3034O8375O4590O1921Q651j37664j55449o6086n867J00586Q8028o9641
3403A00016190j02951o0196j7769R5390P1388j30104j40098J6571P0259Q6593P2411
3414I9977684m410k2362K1912o821j34185j22620L8483O8763m196j0353L1662K6108
3426I9859665m4228j5091J49918J40884m2793q8791m1176l6026n8342l2371N5527P4958
3438I9922134M0268K4414L579K2K9160P057q0589r2743l7384k3842l5980k9251j0491
3451I9716354K953J6693K5513K6245L6743O7093N8960P912j0056n035j2780k0172m4082
$$ y = [99621269, 99735023, 99880791, 99848198, 99808975, 99895981, 100015236, 100132393, 100201370, 100135109, 100021912, 99919868, 99832489, 99777245, 99770042, 99854492, 99964645, 100053429, 100107597, 100079536, 100025177, 99979996, 99957748, 99995712, 100058746, 100127121, 100191711, 100253632, 100262283, 100124619, 99969170, 99903084, 99897217, 99997803, 100085831, 100016190, 99913239, 99853043, 99835274, 99930664, 100002052, 99871948, 99731850, 99748421, 99818680, 99905273, 99977684, 99973274, 99950912, 99972824, 99966003, 99831818, 99709198, 99747681, 99816444, 99812248, 99801895, 99833557, 99859665, 99815437, 99800346, 99950264, 100091148, 100048355, 99959564, 99918388, 99882362, 99824020, 99791649, 99847176, 99922134, 99962402, 99986816, 99990395, 99990417, 100019577, 100026634, 99946045, 99853302, 99815918, 99792076, 99756096, 99726845, 99716354, 99719307, 99736000, 99761513, 99787758, 99824501, 99891594, 99950554, 99958466, 99948410, 99943375, 99930595, 99910423, 99866341]
3464I9866341j23284q6189J22955J09337j53778j64894J7883J25458K83211K58713
3474A00255753K2888p5959j33590j15563M5235M5532j16272j30562l4858J1307O5849
3485I9839760N6503n2284m6349Q1131Q8501k098l7788o9329m6752N0422R0073J18111
3497A00069901Q2923l3874j07460k01508j86134m4182K5772P5203R6672P4990P8224
3508I9930527J13388Q4114k3316n7724m3914l3806P721q080r4269j09939q8043l7674
3520I9638985P7560J21071J36444Q5785r4490j12480K6771N1140l715q393J3993K6512
3532I9959183N5740L2311n9349q7952q2947n7861r560O2630K35916K00676q0849j48010
3544A00019928q3778j7144J61553J42555r2628j60309j38573r8846J121O3706J42433
$$ y = [99866341, 99743057, 99656868, 99779823, 99889160, 99735382, 99570488, 99588371, 99713829, 99997040, 100255753, 100278641, 100202682, 100069092, 99953529, 99998764, 100044296, 99928024, 99797462, 99762604, 99773911, 99839760, 99896263, 99843979, 99797630, 99878761, 99967262, 99965164, 99927376, 99858047, 99811295, 99861717, 99951790, 100069901, 100152824, 100118950, 100011490, 99809982, 99623848, 99579666, 99605438, 99680641, 99777313, 99852303, 99930527, 100043915, 100128029, 100104713, 100046989, 100003075, 99969269, 99976990, 99968910, 99874641, 99764702, 99676659, 99638985, 99716545, 99837616, 99974060, 100059845, 99965355, 99852875, 99879646, 99930786, 99927071, 99918678, 99932671, 99959183, 100014923, 100047234, 99987885, 99899933, 99816986, 99759125, 99749565, 99812195, 100048111, 100248787, 100167938, 100019928, 99936150, 99919006, 100080559, 100223114, 100130486, 99970177, 99831604, 99732758, 99733879, 99797585, 99940018]
3555I9940018J20727l2280p6767n3482l9619j2497J4259M9782P0953R4292P6653l602
3567A00148437j7044L7598K5604n2116o4705l3188m463O6566M6257q8645j11695l4912
3579I9917694l6804j25771q9813R0721J25099M5586J3542p034l3592q3161p0335K1721
3591I9767853M0199O004j1825n2307k8466Q9379R5176R591m4304j19423j27266q1108
3603I9543503j6503J13633J56448J45462R9487k2979p4891q0322r0050j02233p3693
3614I9597862N432N2384J05285R4101r391k2583L7033N6694Q3801M1557j25862j18728
3626I9797585Q8829R3437r9800j08025N1689O4514o5658l9818J67038J55853p2197
3637A00033447j22856m9187l3516m2465k7611J8357J7502n1018k5940J08002J28486
$$ y = [99940018, 100060745, 100028465, 99951698, 99898216, 99858597, 99846100, 99860359, 99910141, 99981094, 100075386, 100152039, 100148437, 100131393, 100168991, 100194595, 100142479, 100077774, 100044586, 100040123, 100106689, 100152946, 100064301, 99952606, 99917694, 99880890, 99755119, 99665306, 99756027, 99881126, 99926712, 99940254, 99933220, 99899628, 99816467, 99746132, 99767853, 99808052, 99814056, 99802231, 99749924, 99721458, 99810837, 99906013, 99915604, 99871300, 99751877, 99624611, 99543503, 99527000, 99640633, 99797081, 99942543, 100042030, 100019051, 99944160, 99863838, 99773788, 99671555, 99597862, 99603294, 99655678, 99760963, 99855064, 99845673, 99823090, 99860123, 99916817, 100000618, 100042175, 99916313, 99797585, 99886414, 99979851, 99880051, 99772026, 99823715, 99888229, 99822571, 99782753, 99949791, 100105644, 100033447, 99910591, 99861404, 99827888, 99785423, 99757812, 99776169, 99793671, 99742653, 99716713, 99824715, 99953201]
3648I9953201Q1223N417j66848k03178j43913o0387J27007J71058R1652N6389J0391
3659I9922012N577N5794N3475J5190j7861p0495q4877o6788n1140l4546M250J01112
3671I9831703R1309m5296o3538J4397L2120L1708J144j06117r2224P8750O5064j54831
3683I9684189j53229L6049J20422K24709J42219k46429k57324J08452J70997J9715
3693I9849770k3171k8633l5286l6171k0576L3310K7275o5468l9505J18439J49703R6756
3705A00026443M8279o1798n7846Q7120Q9264l2089p0717p3380n9440k457J1254r850
3717I9894783j3374O653k6085j50460j34689Q583R8206K23541K08115K0530l7384j4404
3729A00084015j7380k0859k0095j6526r178J907J5641O4399J9738j68511j71310J4046
$$ y = [99953201, 100034424, 100039841, 99872993, 99669815, 99525902, 99465515, 99592522, 99763580, 99855232, 99911621, 99922012, 99927589, 99983383, 100036858, 100052048, 100034187, 99963692, 99878815, 99812027, 99760887, 99726341, 99730591, 99831703, 99923012, 99877716, 99814178, 99828575, 99860695, 99892403, 99893547, 99787430, 99695206, 99773956, 99839020, 99684189, 99530960, 99567009, 99687431, 99912140, 100054359, 99807930, 99550606, 99659058, 99830055, 99849770, 99826599, 99797966, 99762680, 99726509, 99705933, 99739243, 99766518, 99701050, 99661545, 99779984, 99929687, 100026443, 100074722, 100012924, 99955078, 100042198, 100131462, 100099373, 100028656, 99955276, 99895836, 99893379, 99904633, 99894783, 99881409, 99888062, 99861977, 99711517, 99576828, 99585411, 99683617, 99907158, 100115273, 100135803, 100098419, 100084015, 100066635, 100045776, 100025681, 100009155, 99999977, 100001884, 100017525, 100081924, 100101662, 99933151, 99761841, 99775887]
3741I9775887M7637l3477l7712j1612L9123J95931J38405k01066k31903o652R4078
3752I9768639K13287J59409j55686j88042L7384P6149o126k7801l5737k4322L1021
3763I9848175K6199m0023n8747p4630j8166J79031J73706j3542j22017k91137k24205
3774I9384644J58142K41562J08291M3724n1735o5399J1612L1067K1385J6907M692J984
3786I9906876Q483Q057j4969J7861J39068J39809L1067k2537n7625r2407j42357j27724
3798I9793602k7679n364p0404k1271J71921J87927M8134j2138o8833n3787O9527Q6494
3810A00098129K5727j2848o5163q7784p3387r4986j80221j45554R155R9709K05467
3821I9778244J92886K3651j5617M6082L7819j2261m6158j01417q5930K9419L5858o9565
$$ y = [99775887, 99823524, 99790047, 99752335, 99740723, 99779846, 99975777, 100114182, 99913116, 99681213, 99674561, 99768639, 99981926, 100141335, 99985649, 99797607, 99834991, 99911140, 99905014, 99877213, 99841476, 99817154, 99848175, 99874374, 99834351, 99775604, 99700974, 99682808, 99861839, 100035545, 100022003, 99899986, 99608849, 99384644, 99542786, 99784348, 99892639, 99936363, 99884628, 99819229, 99830841, 99861908, 99883293, 99900200, 99904892, 99906876, 99915359, 99923416, 99908447, 99926308, 100065376, 100205185, 100236252, 100213715, 100156090, 100063683, 99921326, 99793602, 99765923, 99760559, 99690155, 99668884, 99840805, 100028732, 100076866, 100064728, 99995895, 99942108, 100011635, 100098129, 100123856, 100111008, 100045845, 99958061, 99884674, 99789688, 99609467, 99463913, 99473068, 99572777, 99778244, 99971130, 99994781, 99979164, 100025246, 100063065, 100050804, 100004646, 99903229, 99817299, 99846718, 99882576, 99813011]
3833I9813011o6475M2488M7394k1217p5813k09481j37497K16461K62360M6944k6871
3844I9891304n6908n5008L0999M150j75812j51161R5322J36970J7403j1490N04N49
3856I9726822Q079j838m6723l1570O4995O2324m4472n5549r346M7638J85730J70059
3868A00076149j3756p3456n8075o3758q8311m4487J09650J18919j6136m2442l548K1385
3880I9922134P1000O9854J8288r941n1972l3355O2484R4628J32973L8551k89993l08228
3892I9716423l8887O4301J32064R5108j07956j62292j47964n9845J95953K38541J04286
3903A00029732K8206o9092j05263r8160n9059M7852R0271J16676O5231j38328j35468
3914I9772598R9106J05576r2987j29174n7243k7824j099J4259K3773J3657l4187l3638
$$ y = [99813011, 99746536, 99789024, 99836418, 99815201, 99739388, 99529907, 99392410, 99608871, 99871231, 99918175, 99891304, 99834396, 99779388, 99810387, 99814537, 99638725, 99487564, 99582886, 99719856, 99737259, 99725769, 99726273, 99726822, 99734901, 99733063, 99686340, 99654770, 99719765, 99782089, 99737617, 99682068, 99672722, 99720360, 99906090, 100076149, 100062393, 99988937, 99930862, 99867104, 99778793, 99734306, 99843956, 99962875, 99946739, 99904297, 99900749, 99922134, 99993134, 100062988, 100081276, 100071335, 100019363, 99986008, 100048492, 100143120, 100276093, 100314644, 100024651, 99716423, 99677536, 99741837, 99873901, 99969009, 99861053, 99698761, 99550797, 99490952, 99686905, 99925446, 100029732, 100057938, 99988846, 99883583, 99785423, 99726364, 99774216, 99864487, 99981163, 100046394, 99908066, 99772598, 99871704, 99977280, 99884293, 99755119, 99697876, 99670052, 99668953, 99683212, 99706985, 99720642, 99686455, 99652817]
3926I9652817Q888L2738M8279P4363J26984J23024Q0681R987j50490j65344m4869J6716
3938I9813774Q3679R3010L6743R606j0781k9846n0064n6297l8124n2498j39595q2108
3950I9577499J60340K08900J06453O0318J457j548P5553O7017q865n9868j20567j45081
3962I9921608j46248j18828n6312R796J22597J41098P2815K8610n6679l3279J29486
3973A00014664J58882J02257M2656q4977j03492j7334J3702L7201K2430n4527o7467
3984A00063995l4912r125N2811L1227j08284j08459L4309M8371n2399n1857K5772O1058
3996I9952507R5322Q2489J1329k7443
4000A00114204
$$ y = [99652817, 99661705, 99694443, 99742722, 99817085, 99944069, 100067093, 100147774, 100157761, 100007271, 99841927, 99797058, 99813774, 99897453, 99990463, 100027206, 100036812, 100026031, 99996185, 99946121, 99889824, 99851700, 99799202, 99659607, 99577499, 99737839, 99946739, 100053192, 100113510, 100114967, 100113419, 100188972, 100255989, 100247124, 100187256, 100066689, 99921608, 99775360, 99656532, 99600220, 99610016, 99732613, 99873711, 99946526, 99975136, 99918457, 99885178, 100014664, 100173546, 100275803, 100318459, 100233482, 100129990, 100112656, 100126358, 100163559, 100185989, 100131462, 100063995, 100029083, 100019958, 100072769, 100103996, 99995712, 99887253, 99921562, 99969933, 99917534, 99865677, 99891449, 99952507, 100047829, 100130318, 100141647, 100114204]
##END=$$ End of the data block
