##TITLE=$$ Begin of the data block
##JCAMP-DX=5.00 $$ ACD/SpecManager v 10.08
##SPECTROMETER/DATA SYSTEM=16PC
##DATE=Mon Sep 30 11:12:32 2013
##DATA TYPE=INFRARED SPECTRUM
##DATA CLASS=XYDATA
##ORIGIN=
##OWNER=
##NPOINTS=3601
##FIRSTX=400.00000000
##LASTX=4000.00000000
##MAXX=4000.00000000
##MINX=400.00000000
##MAXY=37.22817993
##MINY=5.05437851
##XFACTOR=1.0000000000
##YFACTOR=0.000000100000000
##FIRSTY=36.50746155
##DELTAX=1.00000000
##XUNITS=1/CM
##YUNITS=TRANSMITTANCE
##XYDATA=(X++(Y..Y))
400C65074615m925003K968331O021004L142852j2559662j2424697M076690O165772
408C57539902l351708m921417k719421M03633Q622894Q088379k21024o371269j8189430
417C38880539j4303665R247741J5245705J0557633M931945r624748j0888786J928329
425C45974693L448487n591622k761154J4834175J3185730r379387j2161255J215935
433C48765602M545937K805938K292633J587410O6758k477188m591942p221909q044281
442C37728958q246155n402107L544808L939895n457649n030861N255203N640488j261940
451C30710640o144753j4437675j3731957k704849R43413K74658P41005J114369Q53538
460B97618389p96318k75612K266884L865948N876789N840549K718678L122082P590293
$$ plain form
400 365074615 360149612 363117943 369138947 372281799 359722137 347297440 351374130 357539902
408 357539902 354188194 349266777 346547356 346950989 355573883 363662262 363441238 357069969 338880539
417 338880539 324576874 333824615 349070320 359627953 364559898 354935150 344046364 345974693
425 345974693 349423180 343831558 341070404 355904579 369090309 359710922 347549667 348765602
433 348765602 353311539 356117477 358410110 359997520 360064278 357587090 352995148 345773239 337728958
442 337728958 329482803 324080696 327625504 331565399 326107750 321076889 326332092 331972580 330710640
451 330710640 324565887 310128212 296396255 293691406 294634819 294909477 295650482 296764851 297618389
460 297618389 296822071 296546459 298813343 302679291 308556080 314396629 317115307 320237389 327827682
469C27827682P351151K880363J045952L44963p8926k1896N54771K232552K645264J930236
479C46712112J902352K438545K213936J771202K64435l047943m356385m533538l899575
488C39465141j152763j179924l518105n134353q950939o314526M060516Q375893R967308
497C35618248R287834N305557J691323m459152n200387l47137J414070K728691J701355
506C47740402k784233m369507m067192m187584m173011l944893k728234l702869p212887
515C10569992q702736j0180473q170624k283096K443809Q492928J0969887J1094093
523C14233780Q878708K226600m89006r20295q32329J637001Q03947k495536n922318
532C17120552r479752j5493888k5562992l0970097l6477089l1756878j6587257k186537
$$ plain form
469 327827682 335178833 338059196 339105148 339450111 339371185 339349289 339904060 342136612 344781876 346712112
479 346712112 348614464 351053009 353266945 355038147 355302582 352254639 347898254 343364716 339465141
488 339465141 338312378 337132454 333614349 328479996 319529057 313214531 317275047 325650940 335618248
497 335618248 344906082 350211639 351902962 347443810 342243423 341896286 343310356 346039047 347740402
506 347740402 344956169 340586662 336519470 332331886 328158875 324213982 321485748 317782879 310569992
515 310569992 301867256 291686783 283516159 281233063 283676872 292169800 303139687 314233780
523 314233780 323112488 325339088 324850082 323929787 323097458 324734459 325538406 323042870 317120552
532 317120552 307640800 292146912 266583920 235613823 199136734 167379856 150792599 148606062
540A48606062J7982950K8986931L4636993L4618378K5920372K0898113J7036190J2039910
548C40725899N804558J041412m539986m492035K456169M772912N815277L683815m272004
557C50996017n551834j337280N96314K508850L135910K939949J332779l144760m070740
566C47405205k319336q16841K190590K610435N56488l36647q11348j535873l121376
575C43821297k455712R71070K007255J749993R59396j432648j914062j010399j31836
584C42564354J670570K009659R19571O47545J168480L34740k550126k553939J39236
593C44350090J331329K804070J628609l379326m556427l160019j825562P93000J946182
602C39931946K381096J857757l10173j140594j478195r27430J267166J687317Q90236
$$ plain form
540 148606062 166589012 195575943 230212936 264831314 290751686 311649799 328685989 340725899
548 340725899 346530457 347571869 343031883 338539848 340996017 345768929 351584206 355268021 350996017
557 350996017 345444183 344106903 344703217 347212067 350347977 353287926 354620705 351475945 347405205
566 347405205 345085869 344269028 346459618 349070053 349626541 349289894 348478546 346942673 343821297
575 343821297 341365585 342336655 344343910 346093903 347053299 345620651 343706589 342696190 342564354
584 342564354 344234924 346244583 347164154 347811699 348980179 349314919 346764793 344210854 344350090
593 344350090 345681419 348485489 350114098 346734772 342178345 339018326 337192764 337985764 339931946
602 339931946 342313042 344170799 343860626 342720032 341241837 340314407 341581573 343268890 344159126
611C44159126O3439j647492k012977r53675j016349k422600j742592J127472K339859
620C37894211K913475K617111M42734O52580L527374L679047K020607K87514l018380
629C51016273l640861j909981p64618Q94776J605758J681786J329193N56488q78105
638C49890709m539719l925819J240272L347397M485817L904839Q76884r37423l254204
647C51088753k869835R53903K057343J720428R80377p02171k208214m888763m459153
656C41672668j79519P02820r31015j357537j589546j299858k115479K140999J7292710
665C54336243J3868103j0368119j7005195j3820877q117447P616997J0634918K303352
673C39447975j01814J24931j116981l550301m184456l371734k696762p86057j549492
$$ plain form
611 344159126 344222565 342575073 340562096 339608421 338592072 336169472 334426880 335554352 337894211
620 337894211 340807686 343424797 343867531 344520111 348047485 351726532 353747139 354034653 351016273
629 351016273 347375412 345465431 344700813 345595589 347201347 348883133 350212326 350768814 349890709
638 349890709 345350990 341425171 342665443 346012840 350498657 354403496 355280380 354342957 351088753
647 351088753 348218918 349172821 351230164 352950592 353930969 353228798 351020584 346131821 341672668
656 341672668 341493149 342195969 341264954 339907417 338317871 337018013 334902534 337043533 354336243
665 354336243 368204346 357836227 340831032 327010155 318892708 326509705 337144623 339447975
673 339447975 339346161 339471092 338354111 334803810 330619354 327247620 324550858 323764801 322215309
682C22215309m609337p567882j0906925j5100251k0686874k5039425k9468784l1360379
690A77475452l3642292k7220487j0348320Q91208J1110068J7942428K0721913K4478912
698A81408882K9674301K9432526K4503479J8761864R681701L488770m01955n876083
706B90673485j2980919j7642975k3421059k0154724q083095L586769K1478653K8301239
714B61757374K6851406K3229847J3635387P171402L26386j959534O80199J838913L967781
723C37499161L668518P58438o35872j655350j863479j207123l38326J752167J677513
732C39655647l96995j746140l560562l804207k440452j654129j13755r63440m216423
741C20759544o678829q611202j2165299j7672538k1657715k6598206k6060352j9448032
$$ plain form
682 322215309 317605972 310038090 299131165 284030914 263344040 238304615 208835831 177475452
690 177475452 143833160 116612673 106264353 107155561 118265629 136208057 156929970 181408882
698 181408882 211083183 240515709 265019188 283781052 293462753 296951523 296549568 290673485
706 290673485 277692566 260049591 236628532 216473808 208390713 211977482 233456135 261757374
714 261757374 288608780 311838627 325474014 332645416 332971802 331012268 331692467 333531380 337499161
723 337499161 341167679 341926117 341290245 339634895 337771416 336564293 336225967 337978134 339655647
732 339655647 339258652 337512512 333951950 330147743 327707291 326053162 325939407 324975967 320759544
741 320759544 314080715 305469513 293304214 275631676 253973961 227375755 201315403 181867371
749A81867371j5580426j3164997q553505k403497M264354J3701926J7920246J8263817
757A96315289J7341613J3092995J1150608J0745049R318809P180939N653152N077591
765B75876045K761612r84917m709243r798775j2157898j3201961j1368275o572247
773B19844341p17640Q399964J3865700J7881164J8553734J5369415J2275467P208328
781C12680473M473458L535270K229195R55582K77557M0054K97051J762619J525879
790C27777138m73252j084785p42950q62351j165390j348724j219025j856575l224602
799C15799484m390011n961170o437549n304814o124019p828007j1126518j6788235
807B51839161k1029472k5693894k7191639k6160002k3639679j9142627j3580084o609917
$$ plain form
749 181867371 166286945 153121948 144568443 142164946 146429300 160131226 178051472 196315289
757 196315289 213656902 226749897 237900505 248645554 257964363 265145302 270798454 275876045
765 275876045 278637657 277652740 272943497 263144722 250986824 237784863 226416588 219844341
773 219844341 219126701 227526665 241392365 259273529 277827263 293196678 305472145 312680473
781 312680473 317153931 320689201 322918396 323873978 324151535 324191589 324488640 326251259 327777138
790 327777138 327303886 326219101 325476151 324613800 323448410 322099686 320880661 319024086 315799484
799 315799484 311409473 305448303 299010754 293705940 287581921 279753914 268627396 251839161
807 251839161 230809689 205115795 177924156 151764154 128124475 108981848 95401764 88791847
815H8791847J307726J1883259J8734932K3798942K5711775K4075508K1844616J7794152
823B33942757J3868084Q794078N716782M287968K752781J801490M27475j873245k079735
832B67638435m37240J013260L237495M411697M934311N033722M543076L899345K778759
841B97052860K038956J256943J265049K206325K675057L314495K956619J380463O38008
850C14784775R4642K36512J475105J678219J498222M55608k229442k959499k302876
859C12731266j583347J94549L72887p90348j672497k788315l702163m581681n194912
868B92985439n135784o262054q229485j0559807j4605999j5437603j4813194j0630836
876B07310677k096901N511531J5839100J9582978J7765293J5599251J0417232P673016
$$ plain form
815 88791847 90099573 101982832 120717764 144516706 170228481 194303989 216148605 233942757
823 233942757 247810841 256604919 262321701 266609669 269362450 271163940 271591415 269718170 267638435
832 267638435 267201195 268214455 271451950 275863647 280797958 285831680 290374756 294274101 297052860
841 297052860 299091816 300348759 301613808 303820133 306495190 309809685 312766304 314146767 314784775
850 314784775 314879417 315115929 316591034 318269253 319767475 320223083 317993641 315034142 312731266
859 312731266 311147919 311342468 311715355 310925007 309252510 306464195 302762032 298180351 292985439
868 292985439 287849655 281587601 273358116 262798309 248192310 232754707 217941513 207310677
876 207310677 205213776 210725307 226564407 246147385 263912678 279511929 289929161 297602177
884B97602177O428013M982223L838310K684593J519433O60419o9618k79904K72980
893C17638626K24838l0040p06673k000809k917290l711223m359245m538060n565643
902B94034481p392178q902053j0988961j1194229j0275364p661819l153553J878967
910B36345291R534111J2786865J2789498J1956939Q660317O998768O214390N238533
918C10524712M388809L460159K401848J620979R10759O90460J141320J118660Q01544
927C27059250O18477O47087J48277j223106j347771l96233J93825J063118J084786
936C27847710L90548m19883j974106k363434j930237j215439M89235Q88825K57492
945C21970711k09809j204032j159173o7253M71363R35078J010399Q50944J55449j493950
$$ plain form
884 297602177 304030190 309012413 312850723 315535316 317054749 317715168 317645550 317365646 317638626
893 317638626 317863464 317833424 317126751 315125942 312208652 308497429 304138184 299600124 294034481
902 294034481 286642303 277740250 266751289 255557060 245281696 237619877 234466324 236345291
910 236345291 245879402 258666267 271455765 283412704 292073021 299071789 305286179 310524712
918 310524712 314913521 318373680 320775528 322396507 323307266 323997726 325139046 326257706 327059250
927 327059250 327677727 328324814 328473091 327249985 325902214 325505981 325699806 326762924 327847710
936 327847710 328238258 327818375 325844269 323480835 321550598 320335159 320824394 321713219 321970711
945 321970711 321760902 320556870 319397697 319330444 319801807 320736885 321747284 322598228 322753677 321259727
955C21259727k127399k230396j834164l78609p2727m12216j208534l048897l774185
964C06172600l803005l623486k743492k646198k927781l722190n374909o371021p164955
973B67795563p454872p425080o642799m995117l368855k241134J182556P725963J1296273
982B55872498J3990154J3511905Q995762O200543L446350J692543O98090M67529J488209
991C06363583J805782K246132J459617q76197k123356l524304k749214R41525K259254
1000C05802822K315273J951943M95910k04811p53154n85080P57218Q77609K09103n86510
1010C10280323j986752k745132k455482l990899q003463r014359q379478o156426l10440
1019B67237892J074791j289596k167702m002571k260933M045486O427765O874581N917778
$$ plain form
955 321259727 319132328 316901932 315067768 314689159 314616432 314204216 312995682 309946785 306172600
964 306172600 302369595 298746109 296002617 293356419 290428638 286706448 281331539 274960518 267795563
973 267795563 260340691 252915611 246272812 241277695 237908840 235667706 236850262 244576225 255872498
982 255872498 269862652 283374557 292370319 298570862 302017212 303709755 304407845 304875374 306363583
991 306363583 308169365 310415497 311875114 310998917 308875561 305351257 302602043 303543568 305802822
1000 305802822 308118095 310070038 310565948 310361137 309607983 309022903 309780121 310657730 310866833 310280323
1010 310280323 308293571 305548439 303092957 299102058 291098595 282084236 273704758 267548332 267237892
1019 267237892 268312683 267023087 264855385 260852814 258591881 262637367 269065132 275939713 281857491
1028B81857491K203941O15349K61306j79996k63691m47502n43366q48999j681575j477719
1038B79495239m41074O76861K648849L135185K254258J869678J416206J288167J469383
1047B93812752J628151K072582J901874J141778N87234r2506l72429l65963j45436
1056C00168037N79834P17392L88394J97887O8665k96116j034985j298904r90143j348972
1066B97151089j863003l344307o337395p855415r430657p921218l072739R53445O510964
1075B64790764Q343239O705513N830536M341354L511200L307342K586117J382122P00455
1084C01498642M41551k365q36372o35872R68208J071701o5079n80558r12667j173496
1094B99773693j400947j334439p72228p83672r29127j898289l745079n563965q309860
$$ plain form
1028 281857491 284061432 284676781 284938087 284758091 284494400 284046898 283503532 282654533 280972958 279495239
1038 279495239 279054165 279731026 282379875 285515060 287769318 289638996 291055202 292343369 293812752
1047 293812752 295440903 297513485 299415359 300557137 301144371 301051865 300679436 300313473 300168037
1056 300168037 300747871 301465263 301853657 302051544 302120209 301824093 300789108 299490204 298500061 297151089
1066 297151089 295288086 291943779 285606384 277750969 268320312 260399094 257326355 258279800 264790764
1075 264790764 273134003 279839516 285670052 290011406 293522606 296829948 299416065 300798187 301498642
1084 301498642 301940193 301937828 301101456 300465584 301433792 302505493 302440414 301859856 300947189 299773693
1094 299773693 298372746 297038307 296266079 295482407 294553280 292654991 288909912 283345947 275036087
1103B75036087r069900q796235o596069j781712K001057O600609Q267632P238636O316661
1112B79216766M291535L200302K912979J911163J76678p01427j219750r83467M05312
1121B89210091R59625J103172J126747R19113O33717L6717r0828K09083L21159L69530
1131B94798126M71611Q83332M62532j214753j313209P7743M77791M91142J78795p70073
1141B94543037j176128j217842j362801j489639j617908j464615k145520l647327m908085
1150B75513172o840954o857376n321045l367176N71728J359940l41416k044201n019188
1159B47653484o674766p011166q621940j1268139j3315449j5933495j6077995j3893375
1167A54857159j1846543q896827o743431o868124j644612R163857J6983747K6216736
$$ plain form
1103 275036087 265966187 257169952 250573883 248792171 250793228 257393837 265661469 272900105 279216766
1112 279216766 283508301 286708603 289621582 291532745 291709423 291007996 289788246 288804779 289210091
1121 289210091 290169716 291272888 292399635 293318748 293952465 293989182 293898354 294107437 294428596 294798126
1131 294798126 295269737 296153069 296615601 295400848 294087639 294165382 294643173 295134315 295313110 294543037
1141 294543037 293366909 292149067 290786266 289296627 287678719 286214104 284068584 280421257 275513172
1150 275513172 268672218 261814842 256493797 253126621 253698349 255058289 254716873 252672672 247653484
1159 247653484 240978718 233967552 225345612 214077473 200762024 184828529 168750534 154857159
1167 154857159 143010616 134113789 127370358 120502234 118857622 128021479 145005226 171221962
1175A71221962K7826557K1920910J7105103R983310N533467L113498L13282j960277
1183B55057812m925022q258572j2032509j7506599j9573689j9851684j6978026j0993004
1191A44938707l099203R523154J6794443K1613369K2461643J8173923J4926453J0595322
1199B55927811P498016N045414L274918K233982J692295K177715J808167Q25882J42326
1208B80626526p04765p79152q0109M52766J358757J418572O52084J98136l76702m77333
1218B82288780r6550J40667N81036M60377k52724o68526j195907j090298j91689J13030
1228B80088196J83811l2425p53879j054993j106033j151810j153698j021862p04537
1237B73292770n00183k72293k72026n02357p03812j160622r95636j2626J24454l25203
$$ plain form
1175 171221962 199048519 220969429 238074532 248057842 253591309 256704807 257018089 255057812
1183 255057812 250132790 241874218 229841709 212335110 192761421 172909737 155931711 144938707
1191 144938707 141839504 151362658 168157101 189770470 212232113 230406036 245332489 255927811
1199 255927811 263425827 268471241 271746159 273980141 275672436 277850151 279658318 280484200 280626526
1208 280626526 279921761 279142609 279062500 279515266 280874023 282292595 282944679 283142815 282766113 282288780
1218 282288780 282192230 282332897 282913933 283374310 283121586 282453060 281257153 280166855 279975166 280088196
1228 280088196 280272007 280239582 279485703 278430710 277324677 276172867 275019169 273997307 273292770
1237 273292770 272792587 272520294 272248268 271745911 271042099 269881477 268885841 268873215 268997669 268672466
1247B68672466p36236j619816j559487n76972l815N56698Q47110R09558Q31852M98047
1257B67819405K80609j38283J40190J343269J660099J481534J054992j19209k90871
1266B73231735N47180O12736K22912j11809n51948r66778j396179j814843k429008
1275B67343998k442360j887073j434327q07056m42753l39966o9160N54333L60240o81877
1285B60153999j280288j896859j976738j531372j071434l39279J41869N23567P22160
1294B53445625O99768O91872Q59756L20187r35078j992950k890339m395485o556263
1303B39247093q414039j1662484j0488510n029678n49088N684624Q007279O499786
1311B23294983O501198P001152O701698N944977M660129K139569J283645J950035J805764
$$ plain form
1247 268672466 267936230 266316414 264756927 264179955 264176140 264732838 265579948 266489506 267321358 267819405
1257 267819405 268100014 267961731 268101921 269445190 271105289 272586823 273641815 273522606 273231735
1266 273231735 273778915 274391651 274614563 274502754 273950806 272984028 271587849 269773006 267343998
1275 267343998 264901638 263014565 261580238 260773182 260330429 259990463 259921303 260475636 260835876 260153999
1285 260153999 258873711 256976852 255000114 253468742 252397308 252058029 252199898 252723465 253445625
1294 253445625 254145393 254837265 255697021 256017208 255082130 253089180 250198841 245803356 239247093
1303 239247093 230833054 219170570 208682060 203652382 203103294 208787918 216795197 223294983
1311 223294983 229796181 236797333 243499031 249444008 254104137 256243706 257527351 259477386 261283150
1320B61283150J369247Q96931J20869j46618J0967J12533K76795N07355R67979R97543
1330B66396751O15120M05312j2150K97546J880398J617203k23160j599083l974189
1339B65403748l538609L60737J300087K00996j99318n80330r61055j375199j671791
1348B58939266k001762j913319j207352j133193j538277j786461k282391k046337j072426
1357B43957748l66439J199245J19457m508018n569954m424324k754936J390457J884956
1366B30928192j699695j526127J714248K949715L856163K800941j730670k047787J490841
1375B36735821K628574K674561K645492K110482J773605J044998J579285M340400L817788
1384B59351006J05857j663913l449192k552281J798878L818016O072769M079342m691830
$$ plain form
1320 261283150 262652397 263549328 263670197 263523579 263534546 263647079 263923874 264431229 265399208 266396751
1330 266396751 267011871 267417183 267405033 267702579 269582977 271200180 270977020 269377937 265403748
1339 265403748 261865139 262225876 263525963 263726959 263527641 262947311 261986256 260611057 258939266
1348 258939266 256937504 255024185 253816833 252683640 251145363 249358902 247076511 245030174 243957748
1357 243957748 243591309 244790554 244910011 240401993 234832039 230407715 227652779 229043236 230928192
1366 230928192 229228497 227702370 229416618 232366333 236222496 239023437 237292767 235244980 236735821
1375 236735821 239364395 242038956 244684448 246794930 248568535 249613533 251192818 255533218 259351006
1384 259351006 259456863 257792950 254343758 251791477 253590355 257408371 263481140 267560482 262868652
1393B62868652n639572J087189J480350l148079m039058l350964j212120N345097M578361
1402B57969856m089126o610623n512943m738350k401352k103557m087449l781566j900177
1411B22744713j60465J998195M047394Q005848O324291k260685n147934n712986l056049
1420B26782322O802807P040481l050804l817310L360042M350663J614322n60512n054722
1429B37467289m633904R52015L466835P108212L318787j1868954j4030934n288372
1437B16490974j582851J869679J873493k950669l891697j617679k167950m464607o783257
1446A96775436j2402305r933472J680374O820450P740746J1042347J9844303J5068512
1454B36636391o950608j2473106o731758k537727N349655Q776893J0824204P321358
$$ plain form
1393 262868652 257229080 258316269 259796619 256648540 252609482 249258518 248046398 253391495 257969856
1402 257969856 253880730 247270107 241757164 237018814 234617462 232513905 228426456 224644890 222744713
1411 222744713 222584248 224582443 228629837 236635685 242959976 240699291 235551357 229838371 226782322
1420 226782322 233585129 240625610 237574806 233757496 237117538 241468201 243082523 242522011 237467289
1429 237467289 232833385 233785400 237252235 244360447 247679234 235810280 221779346 216490974
1437 216490974 214908123 216777802 218651295 215700626 211808929 210191250 208023300 203558693 196775436
1446 196775436 184373131 174439659 176120033 182940483 190681229 201723576 221567879 236636391
1454 236636391 229685783 217212677 210480919 207943192 213292847 222069740 232893944 240215302
1462B40215302n833149q065930j519928J800308N552521P109413Q838406L895512j2280694
1471B39711761j4602184l819218k018928n698452o783733o415825q106957j0793686
1479A81472778j5220165k4976492k4958610j7813683q058310R206296J8899440K6556969
1487A45108223K5116444J0264873O313801J0000935J0063419J0361194O716729l085862
1495B20859756o007652l565330k733231k373695o4125M691848P482987J3545284O344547
1504B38180389j9966583k5466461j4773369r336700k416382M76837k266636J301766
1512A65732861J3109684J3495445J163959R54876J2425423J2505760L816128j057148
1520B22146988q345833n712051J1618614J2210140l653049n674839K292881N360832
$$ plain form
1462 240215302 234382153 226316223 224796295 226596603 232149124 239258537 248096943 251992455 239711761
1471 239711761 225109577 221290359 219271431 213572979 206789246 200373421 192266464 181472778
1479 181472778 166252613 141276121 116317511 98503828 90445518 99651814 118551254 145108223
1487 145108223 170224667 180489540 186803341 196804276 206867695 217228889 223945618 220859756
1495 220859756 214852104 211286774 208553543 206179848 206115723 210807571 218290558 231835842 238180389
1504 238180389 218213806 192747345 177973976 168637276 166220894 166697731 164431095 165732861
1512 165732861 178842545 192337990 193501949 194456825 206882248 219388008 223204136 222146988
1520 222146988 213801155 208089104 219707718 231917858 228264809 222589970 224882851 230243683
1528B30243683Q235931O979218P17163l119698j0187874n294799J7251510J9487381
1536B64312515O248932l847580k2407532k1626243J990795O660213l185024l496170
1544B24649906K383938L777752K922306J544456k592544k270947L536702L499508m160634
1553B33290443j003265J9552689J2739906k6138077l3529739j8228073q613816Q077393
1561A86147461R165516p221222j0915508n652199o662598j1685619j4535666j9939422
1569A18700743j5179396K718210R138108R257793O981611k848148l505230M561663
1577A29825354O420135N657673K853394l471852p980346j2279988j5278101j8206119
1585H7540150j7231942j2631893p132530J048327P506370J4440775J7456770J7035961
$$ plain form
1528 230243683 238479614 245458832 246175995 243056297 232868423 227573624 244825134 264312515
1536 264312515 270561447 266713867 244306335 222680092 224670887 231331100 228146076 224649906
1544 224649906 227033844 230811596 233733902 235278358 232685814 230414867 233951569 237451077 233290443
1553 233290443 232287178 251839867 264579773 238441696 204911957 186683884 178070068 186147461
1561 186147461 195312977 188091755 177176247 171524048 164861450 153175831 138640165 118700743
1569 118700743 103521347 106239557 115377665 124635458 131617069 128768921 125263691 129825354
1577 129825354 136245489 141903162 144756556 141284704 133304358 121024370 105746269 87540150
1585 87540150 70308208 57676315 50543785 51592112 59098482 73539257 90996027 108031988
1593A08031988J5643597J1765957Q990049O465435M004717J620293n51224k712965
1601A53257847m189968m878044n870104p048607p793188r204865p503032l027201J800299
1610A05543137R152412J2758493J6297341J1321783o583691j1312484n234719m978895
1618A26963377o684542r165525j5073538j4987946j0253191m914045M846811P804633
1626G8536034M294157M200935N472422O432056P849693Q320094Q335590P331371L460169
1635A34232521M674673J2150526J3231030Q948822P827987Q347035Q065700R698391
1643B07176685M824887j0804177j1774063n82237P345924K3336182J7507782j5943527
1651B21087456k3920288j5499840p473469J0241032J4102459N032787K883415M913101
$$ plain form
1593 108031988 123675585 135441542 144431591 150897026 154901743 156522036 155970812 153257847
1601 153257847 149067879 144189835 138319731 131271124 123477936 114273071 106770039 103742838 105543137
1610 105543137 114695549 127454042 143751383 155073166 148489475 137176991 131942272 126963377
1618 126963377 120278835 111113310 96039772 81051826 70798635 65884590 70731401 78536034
1626 78536034 82830191 87031126 92503548 98935604 106785297 115105391 123440981 130772352 134232521
1635 134232521 138907194 151057720 164288750 173237572 181065559 189412594 197478294 207176685
1643 207176685 212001572 201197395 189423332 188841095 196187019 219523201 237030983 221087456
1651 221087456 197167168 181667328 174193859 184434891 198537350 203570137 206453552 211366653
1659B11366653K233506o793022o729355J819610N834580J0217170Q378277j414051
1667B24913368n642891r559402n676747J1905919J2097816n132675q569470l598918
1675B10737000J04656P449150Q476963K054939K671471J4631519O225834l1402359
1683B20949173l1117439P407417J5727043L506432N29060j232147N45959R024620R235382
1692B34575500K584706j585255q826961o275654J2783050Q625031k4244309k4125824
1700A93510284P884274J4469147M222870Q4877n512715n239010K256394M240036K466450
1709B18382607K650012L929844M034043M477749J471519o298771r789238j3023147
1717B05834618q953095O716271R752731K363701m9362j619568j216660K400398L136158
$$ plain form
1659 211366653 213600159 206807137 200077782 201897392 207731972 217949142 226327419 224913368
1667 224913368 219270477 209711075 204034328 215940247 228038063 222905388 214335918 210737000
1675 210737000 210841656 218290806 226767769 228822708 231494179 246125698 252351532 220949173
1683 220949173 189831734 197239151 212966194 216472626 217001686 215769539 216315498 225340118 234575500
1692 234575500 237160206 235574951 226747990 220472336 233255386 241880417 217636108 193510284
1700 193510284 201394558 215863705 220086575 220171452 214658737 209419727 211676121 215916157 218382607
1709 218382607 221032619 224962463 228996506 233474255 234945774 228647003 218857765 205834618
1717 205834618 196881523 203597794 213350525 215714226 215664864 214045296 212828636 215229034 218365192
1726B18365192J441956J607895L080120L783722P639885J036644k4318943k1646023
1734A90990448J2167206J7890472K360344k540359m988900m160881K642384L800869
1742B18161583m7913J62831M374256L753910j151333l699055o433487n820274j612663
1751B07687855J666069P519016O456833l794422m652729K977829M131088J590958q13237
1760B22769260o851444n273094N969048P433414N83172r94454J82152N98450K805214
1769B27221718J12781j0593662j0167122J527081M802704K857914K584228K974033
1777B21319675J165867m623184m400482K904415L016720l903637m222164O03447K769470
1786B14630127M883289M318486J130561k277126r538898q524399K088547M878044K438774
$$ plain form
1726 218365192 219807148 221415043 224495163 228278885 235918770 236955414 212636471 190990448
1734 190990448 203157654 221048126 223408470 220868111 215879211 211718330 214360714 218161583
1742 218161583 218113670 218276501 222650757 226404667 225253334 221554279 215120792 209300518 207687855
1751 207687855 209353924 216872940 223329773 219535351 214882622 217860451 221991539 223582497 222769260
1760 222769260 215917816 210644722 216613770 224047184 224630356 223635902 223818054 224416504 227221718
1769 227221718 227334499 216740837 206573715 208100796 212903500 215761414 218345642 221319675
1777 221319675 222485542 217862358 213461876 216366291 219383011 215479374 211257210 211860657 214630127
1786 214630127 219513416 223831902 224962463 222685337 213146439 204622040 206710587 211588631 214027405
1795B14027405J811981J695404K53906l428688l854751j408577n3654J547337K008667
1804B12599030J359710Q68798K37941o10599k232304k330780j117229m6502K007485
1813B10735550J991768l82672r09805l96480J78337J295089K009144L554592J939774
1822B20015297m891892m724502K965469L867607l0746k369652o562939n318164L002166
1831B05952644M552842P48634k24342j9322k12421j118660R5825M779110M702816P58629
1841B20015755k394429q389720p355195K385369M254341o1264p33376N99137O60171
1850B08980789r2506k17190J44711J16119j62850l75976p15027p31926m85668j90983
1860B06269493J55945P53860K105713J997948J008987r62963n791664n880604j330127
$$ plain form
1795 214027405 215839386 217534790 217788696 214360008 210505257 209096680 209043026 210590363 212599030
1804 212599030 213958740 214827538 215065479 214454880 212222576 209891796 208774567 208728065 210735550
1813 210735550 212727318 212344646 211434841 211038361 211216698 212511787 214520931 218075523 220015297
1822 220015297 215123405 210398903 213364372 217231979 217201233 214831581 208268642 202950478 205952644
1831 205952644 210505486 211254120 211029778 211010456 210798035 209679375 209775200 214554310 219257126 220015755
1841 220015755 217621326 209231606 201876411 204261780 208516121 208454857 207721481 208320618 208980789
1850 208980789 208888283 208671093 208815804 208931923 208769073 208393097 207678070 206946144 206460476 206269493
1860 206269493 206425438 207179298 209285011 211282959 212291946 211328983 205537319 199656715 198326588
1869A98326588O62555K095223K171764K41280k97547j8119k5750Q583j28994n72662
1879B02462921n72204r2278k5024o11077M77K618313K154121j707573k619247j839638
1889A99768791o81648K464065K470723r52969j515617P7476L52860j00136j67847j07517
1899B01608181o428L28522K11487n22614n29518L73840J10131j382580j778851j610984
1909A96801186j076928J83812R27219J827469J430740n50976j514186k666016j781693
1918A93580627K437821K569198j425495j973629l3855O53515J194706R02424o46134
1927A97259178j075020o98318o38504p30972n13573J43547K56042k06699j39713M77066
1937A94133034M57535J72615o77338l155479k710820J165390J883984O6986j84288
$$ plain form
1869 198326588 198989143 201084366 203256130 203497410 203199863 203181744 203155994 203164577 203035583 202462921
1879 202462921 201890717 201798439 201773415 201162338 201162815 203781128 205935249 204227676 201608429 199768791
1889 199768791 199087143 201551208 204021931 203068962 201553345 201630821 201983681 201883545 201715698 201608181
1899 201608181 201601753 201930275 202141762 201619148 201089630 201463470 201573601 200191021 198412170 196801186
1909 196801186 195724258 195908070 196835289 198662758 200093498 199542522 198028336 195362320 193580627
1918 193580627 196018448 198587646 197162151 195188522 195154667 195808182 197002888 197905312 197259178
1927 197259178 196184158 195485840 194847336 194116364 193602791 193746338 194002380 193795681 193655968 194133034
1937 194133034 194590569 194763184 194085846 190930367 188219547 189384937 191268921 191335907 191151619
1946A91151619M89712N47161J51176J90487P55310N93186m76361m79221O31084O93570
1956A94247723j60694k95640J09902J35193k43912j0948J161327R44386q40187j150380
1966A93896770m38690N9605R77039J018772J36376j81923k34127l16372m13189k92301
1976A94211960J90735K25544j40896k88735m36554l29971J63574K59400j5507J3828
1986A93853378L88623K68459k56310p06424j633168j313438O48251R45091k00024l75290
1996A91619148O9161J20392j05133o3439K91824K31514k94914l56674J9531R785m13647
2007A91127548l19729L54290M23661j14193o6052P15981M45842j096973j247158j62601
2017A90060616J20639L2425j10626o15826n72204o924K76566N97706M80422k22206
$$ plain form
1946 191151619 191641331 192188492 192339668 192530155 193285465 193878651 193402290 192923069 193554153 194247723
1956 194247723 194087029 193791389 193901291 194036484 193792572 193781624 194942951 195887337 195047150 193896770
1966 193896770 193458080 193517685 194494724 195513496 195649872 195467949 195233822 194917450 194504261 194211960
1976 194211960 194402695 194628239 194487343 194198608 193762054 193432083 193595657 193855057 193839550 193853378
1986 193853378 194242001 194510460 194254150 193547726 191914558 190601120 191249371 192194462 191994438 191619148
1996 191619148 191688309 191808701 191703568 191640129 191931953 192163467 191868553 191511879 191531410 191541195 191127548
2007 191127548 190807819 191162109 191585770 191471577 191405525 192121506 192567348 191470375 190223217 190060616
2017 190060616 190181255 190213680 190103054 189487228 188915024 188908100 189184666 189782372 190262794 190040588
2027A90040588m48951m12941l22571J3828L6945k37922l14007l17821k42463M6959
2037A87841644L815l74794n31197o24160n77221l51200j79291l1700K02903P17392
2047A86096191O27995j56879l89328k37713k79675m63238m21047j39713m1714n3902
2057A84540977m7912n1270q2721q1311k75116q85505q01316N3883K59647l3874p630
2068A82587852K67277K54879j8844j24207j80492j40438J25427M9343m82311m49429
2078A81889057J40896K95639K05994R6817k10762k26517P9155R5367j63784j45912
2088A82055950J28269J88599J35174L5763j95275k83241l08037k27432M9591J16806
2098A81696167N7945n7220l77884l77197o6510P1774J85966J62125l9597j48277k40822
$$ plain form
2027 190040588 189591637 189178696 188856125 188869953 188906898 188668976 188354969 188037148 187794685 187841644
2037 187841644 187845459 187470665 186939468 186315308 185738087 185386887 185207596 185175896 185378799 186096191
2047 186096191 186724186 186567307 186177979 185940266 185660591 185197353 184776306 184636593 184594879 184540977
2057 184540977 184493065 184441795 184359074 184277763 184002647 183117142 182315826 182369709 182629356 182595482 182587852
2068 182587852 182855129 183110008 183091164 182966957 182786465 182646027 182771454 182820797 182338486 181889057
2078 181889057 182029953 182325592 182531586 182628403 182417641 182191124 182270279 182365646 182201862 182055950
2088 182055950 182184219 182372818 182507992 182543755 182348480 182065239 181757202 181529770 181579361 181696167
2098 181696167 181754112 181696892 181319008 180941811 180875301 180947075 181133041 181295166 181255569 181107292 180866470
2109A80866470k83470k91824k38190j18008K2183L24249K66304j87645l74794m86374
2119A79498901m21981r4662M7436J19705J08223j4763j25427l00408l58333l40214
2129A78118477k66800j26839N4589M65164L78608l40690m24156N6991J17302o3190
2139A77969456k21501n57174n35965r6550k0027k57493k25067O6262P6542j86673k14119
2150A75797691r9182J9322K79674K65579m5051j47591j18961j58558k44370k65121
2160A75283432k34604k09331j88828j18961L3836P9651R4872l6698m67071m74701n1956
2171A73709641M6005o6033r3002j14193j08719j16596J450L93619L24249k60830m09603
2182A73305988k87532j84784K6702J22319J58786J32561M4098j08223m21295n07832
$$ plain form
2109 180866470 180583000 180291176 180052986 179934978 179957161 180281410 180547714 180360069 179985275 179498901
2119 179498901 179076920 178982258 179029694 179149399 179257622 179242859 179117432 178817024 178458691 178118477
2129 178118477 177851677 177724838 177779427 178244591 178623199 178282509 177858353 177915344 178032646 177969456
2139 177969456 177747955 177190781 176654816 176558266 176538239 176280746 176055679 176121941 176198483 176011810 175797691
2150 175797691 175698509 175717831 175997505 176263084 176218033 176070442 175951481 175792923 175548553 175283432
2160 175283432 175048828 174839497 174650669 174531708 174565544 174645195 174740067 174703369 174236298 173761597 173709641
2171 173709641 173755646 173689613 173596611 173482418 173373699 173257103 173258553 173652172 173976421 173715591 173305988
2182 173305988 173018456 172833672 172860374 172982693 173141479 173274040 173318138 173209915 172788620 172280788
2192A72280788m37030l22342o7940N5084J22299J01815m6025j32808k51046k19574
2202A71083221l0765J01089L40939K42958l11146m04835p5817r3212m72069l85284
2212A69995079K27203K96593j08948j94549j9570j44958p08580n98183K75612M42028
2222A69461727Q8940o7253k01683l32127n86987m35104K70596M08649J37100n7468
2232A68686390m15325m64669k04086j10874n8174p7248k45571k22931k7408P1773J54724
2243A67086601J67122J03722L7422o2447j46865k87781k49634M9591M6024k57244l09486
2254A66177025j81427j42822j62583r7999J13010P9155k62737k70844M8409P8907j20411
2265A65257683j72367j24932j66645k92549l37372l28292l24250l44276k53449P4635
$$ plain form
2192 172280788 171843758 171521416 171453476 171508560 171630859 171732674 171686649 171553841 171302795 171083221
2202 171083221 171052456 171153545 171494484 171737442 171426296 171021461 170945644 170852432 170380363 169995079
2212 169995079 170222282 170518875 170409927 170215378 170195808 170050850 169342270 168744087 169019699 169461727
2222 169461727 169550667 169483414 169281731 168949604 168362617 167927513 168198109 168606758 168743858 168686390
2232 168686390 168271065 167806396 167602310 167491436 167433262 167356014 167110443 166887512 166860104 166931877 167086601
2243 167086601 167253723 167357445 167394867 167332420 167185555 166897774 166648140 166697731 166743755 166486511 166177025
2254 166177025 165995598 165852776 165690193 165592194 165705204 165784359 165521622 165250778 165299187 165378094 165257683
2265 165257683 165085316 164960384 164793739 164501190 164163818 163835526 163511276 163167000 162913551 162988186
2275A62988186l815o14166o12965q4877J64032L59993M03900K49863J76659Q1062R5596
2286A63203468K89688K51046l7194r4871P858O9847K14348J49250j60217k82536l98388
2297A63212299k17914L86715O12259O45637N40257J12533M1962M04587K14824n69820
2307A65383339p96547p55558m40846L54062P95116J209755J122475M11262L7670l35216
2317A66985512l23296L85285J56402j147041j342774q53042j71662J688233J273384
2326A66651001j692524k654552k552033k184868j214266j97649J792431J603127j295328
2335A58255339j631260M52757K53200j634359k891064m425287m925728n633116k898454
2344A34922028M207134Q317232J2445450J1902818N928040K252808j806984l249874
$$ plain form
2275 162988186 162984371 162370205 161757240 161672363 161836395 162196388 162600288 162850151 163026810 163107872 163203468
2286 163203468 163493156 163744202 163707008 163612137 163619995 163689842 163904190 164053440 163893223 163610687 163212299
2297 163212299 162994385 163381100 163993359 164638996 165179253 165291786 165333748 165738335 165953159 165383339
2307 165383339 164586792 163831234 163390388 163744450 164539566 165749321 166871796 167283058 167320728 166985512
2317 166985512 166662216 167047501 167203903 166056862 164714088 163861046 163689384 165377617 166651001
2326 166651001 164958477 162303925 159751892 157567024 156352758 156155109 157947540 159550667 158255339
2335 158255339 156624079 157076836 157330036 155695677 152804613 148379326 143453598 137820482 134922028
2344 134922028 139129162 147446394 159891844 171794662 177722702 179975510 178168526 174918652
2352A74918652j388302j976261m611721n150090m435062l238440l53336J63078j307010
2361A52621508k234936l876448l740787j699686p57456j79768R9659j44720p8201K26736
2371A40235901K25544j50681q2016M31061N67436L43323N11885J044988J300335J452208
2381A45879984J444340J206398J073360J009226Q21114M92095K81096R8944M1246J39475
2391A52487278J71661K18630J78814O3896p1287k95639l91722m88281k90394M00067
2401A51983023M95672Q2731r8467k51531l03030k25306k03133k26736j52587N2213
2411A51152849J09911M0054L9101J17779L6240k47002l26872k84433k01941N9128K4080
2422A50518894l65495m02689j67609m9591P2003J02520O1035l6478k70367l36409k88009
$$ plain form
2352 174918652 173530350 171554089 166942368 161792278 157357216 154118776 153765440 153928518 152621508
2361 152621508 150386572 146510124 142769337 141069651 140312195 140132427 140232086 140087366 140009165 140235901
2371 140235901 140461445 140310764 140228748 140659809 141227245 141570568 142082453 143127441 144427776 145879984
2381 145879984 147324324 148530722 149604082 150613308 151434422 151926517 152207613 152306557 152347803 152487278
2391 152487278 152658939 152877569 153056383 153120279 153048992 152753353 152361631 151873350 151582956 151983023
2401 151983023 152478695 152561426 152462959 152211428 151908398 151683092 151479959 151253223 151100636 151152849
2411 151152849 151262760 151302814 151341915 151459694 151495934 151248932 150922060 150637627 150435686 150494814 150518894
2422 150518894 150153399 149750710 149583101 149533510 149605513 149708033 149769068 149732590 149462223 149125814 148837805
2433A48837805k18153p6056K7895J82867J40906j74284k12908M1008k7180m45843m88042
2444A47588015k37704q7261Q5116J82151K24352K24590K00034O9141k29120l70026
2454A47649288m61101l97921r2745k861n4836q5354j53065j88350k08855k14577k66075
2465A45523548j21832L30448L97444J32322J3352n3883j72138l46184m56333o31809
2475A44614935m78745J76907K44617k42710l28540j58787j09196r2506q2970j43766
2485A43399239m8638K91825K93970k4796j54018k95878j53303M82082M76599j64509
2495A44102573l29256j95503j64032j25885j17063j48058j43767j39713p1287J40667
2505A42808676J13725k20298k08855J57118J85489n0783j51872k38896k27689o7711
$$ plain form
2433 148837805 148619652 148543596 148571491 148754358 148895264 148720980 148508072 148549080 148521900 148076057 147588015
2444 147588015 147350311 147263050 147348166 147530317 147754669 147979259 148179293 148248434 148019314 147649288
2454 147649288 147188187 146790266 146697521 146694660 146639824 146554470 146401405 146213055 146004200 145789623 145523548
2465 145523548 145401716 145732164 146129608 146261930 146275282 146221399 146049261 145703077 145246744 144614935
2475 144614935 144136190 144313097 144557714 144315004 143986464 143827677 143718481 143625975 143543005 143399239
2485 143399239 143350601 143642426 143936396 143911600 143757582 143461704 143308401 143790483 144267082 144102573
2495 144102573 143773317 143577814 143413782 143287897 143170834 143022776 142879009 142739296 142668009 142808676
2505 142808676 142922401 142702103 142493248 142650366 142835855 142785072 142633200 142394304 142166615 142098904
2515A42098904m8638j50203j65225j34706j03474n8651o914J11580O1751j73092k94209
2526A41137123m22001l74794n3406l8862m02689k78949M11748M84944M0054j38044
2536A40365124k55585k74897j41859j13248j67370j37568k5987N960n1498%K05755
2547A39408827J83344n6267j76430k67505l06607l07798k41041j0491l2186l67403
2557A37826443l57867m6968P8917J78337J02043k50340l30209j95504j64270j85251
2567A36655331j48774p1048J669R1791J53541K36035J85966m8160j09673k1458n2213
2578A36873007j57356k46287m06027l80754j10150r2744l09706l37839l03030j25647
2588A34403467L35455M32730K19822J28746J08957p1049n65290n27382O5327K72989
$$ plain form
2515 142098904 142050266 141900063 141734838 141600132 141496658 141438007 141431093 141542673 141604424 141431332 141137123
2526 141137123 140715122 140340328 140286922 140248060 139845371 139566422 139978170 140463114 140503168 140365124
2536 140365124 140109539 139834642 139692783 139579535 139412165 139274597 139248610 139254570 139203072 139203072 139408827
2547 139408827 139592171 139535904 139359474 139091969 138785362 138477564 138236523 138226032 138193846 137826443
2557 137826443 137468576 137421608 137500525 137678862 137780905 137530565 137200356 137004852 136840582 136655331
2567 136655331 136506557 136435509 136437178 136528969 136682510 136918545 137104511 137056351 136946678 136925220 136873007
2578 136873007 136715651 136469364 136063337 135682583 135572433 135479689 135169983 134832144 134529114 134403467
2588 134403467 134738922 135171652 135391474 135520220 135629177 135558128 134992838 134465456 134530783 134803772
2598A34803772L55720K10047l92437m38213M6492J51395M292J907J44005L4809m37736
2609A34484053m32730P4148J42336j12772k12669l02077k83241j29461m7684J2159
2619A33192062N5790N9843J10627K87056J83582k56777m02212m01497k94685K8610
2629A32562399J66416K09808J95027Q9168j5974k31504k06947R2506J75476J82629
2639A33219004M2677m11988m41074p0095O2704J39236O9142k38419l29494l36886j86443
2650A31518364L04937L27826r2507k47955l42369k69175R2984J49011p8201q7261J03950
2661A31379604O2704k48909k49862N9843R8467r4891r6321P7248O6518r3698j84059
2672A30776644k89679k90155k04087q0823K04324J98841j29699k01226q9168q2255
$$ plain form
2598 134803772 135159492 135369539 134977102 134538889 134585381 134736776 134741068 134742975 134886980 134921789 134484053
2609 134484053 134051323 134125471 134267807 134155035 133942366 133640289 133357048 133227587 133179903 133192062
2619 133192062 133247852 133307695 133418322 133705378 133888960 133632183 133229971 132828474 132533789 132562399
2629 132562399 132728815 132938623 133133650 133222818 133206844 132975340 132768393 132860899 133036375 133219004
2639 133219004 133261681 132849693 132408619 132338524 132401228 132540464 132609606 132371187 132041693 131704807 131518364
2650 131518364 131823301 132151127 132058620 131810665 131468296 131199121 131292105 131441116 131362915 131275654 131379604
2661 131379604 131442308 131193399 130943537 131003380 131101847 131006956 130910635 130987883 131054401 130960703 130776644
2672 130776644 130486965 130196810 129992723 129911900 130116224 130315065 130185366 129984140 129894972 129812717
2682A29812717j34944j43052j63555p4148K43425J92881k65598l78847l00646j70946
2692A28617287J94072J97888j76907k64883j98841j14918P5102J53065J37806J72377
2702A28792048L18527J83582l23057m47273k23399k71320o24657n32388J08242J33037
2712A27113342m66346m95196q1777R1791K54631J71900k26736m25101o38008n24044
2722A24774456R0361J69515j91211l40462n16653m18902M9353K00272J43289J27554
2732A24087572M5776P5102K55823K49386O9619r54n245n6982j36376k10523l35455
2743A24037743l23296j80483p1049J07050J06335j35899j21355J58310J68801p3910
2753A23672247j00374N4598N8412l2186j14203l11613k34842K17914K47479j05858
$$ plain form
2682 129812717 129677773 129534721 129371166 129297018 129540443 129733324 129467726 129088879 128788233 128617287
2692 128617287 128811359 129009247 128832340 128567457 128368616 128253698 128328800 128481865 128619671 128792048
2702 128792048 129110575 129294157 128971100 128523827 128300428 128029108 127404451 126872063 126980305 127113342
2712 127113342 126646996 126151800 126070023 126161814 126416445 126588345 126361609 125936508 125298500 124774456
2722 124774456 124864817 125034332 124843121 124502659 123986006 123567104 123616457 123816729 123960018 124087572
2732 124087572 124133348 124208450 124464273 124713659 124783278 124782324 124777079 124720097 124583721 124373198 124037743
2743 124037743 123714447 123533964 123462915 123569965 123676300 123540401 123419046 123577356 123746157 123672247
2753 123672247 123571873 123626471 123684883 123652697 123538494 123226881 122992039 123209953 123457432 123351574
2763A23351574k06947k16723j26600K11954J95742j56403l20196m93765m09842M6015
2773A21874809J45436k8611q1062j48296q1778J81437K39610J54972Q0347n8889j19686
2784A22158289j13726j37329k06709j62363N7221M3869k07901k70605k13147j87873
2794A20759726j41144j35184j71423j82628k04325j62125k5749P630n007r7036l46900
2805A19295835m09126l55005k45094N9843O1989k83003l00408Q345k5749m65870l91483
2816A16950274K63929L12805j75953k92063j81675j73568j73092k33174m48703l88146
2826A15460634L8862L6240l44753n15938o59943o34193l27110l28064n79596p24077
2836A11422062q76188r35316r06945q70704p47443p75098j017571r83000o90460n55515
$$ plain form
2763 123351574 123144627 122927904 122801304 123013258 123209000 123052597 122732401 122238636 121828794 121874809
2773 121874809 122020245 121991634 121910572 121762276 121680498 121861935 122101545 122256517 122336864 122277975 122158289
2784 122158289 122044563 121907234 121700525 121538162 121595383 121639252 121431351 121160746 120947599 120759726
2794 120759726 120618582 120483398 120311975 120129347 119925022 119762897 119737148 119744778 119739771 119642735 119295835
2805 119295835 118886709 118531704 118286610 118346453 118408442 118125439 117825031 117833376 117807627 117341757 116950274
2816 116950274 117214203 117527008 117351055 117058992 116877317 116703749 116530657 116297483 115848780 115460634
2826 115460634 115499496 115535736 115190983 114675045 114015102 113380909 113053799 112725735 112146139 111422062
2836 111422062 110545874 109610558 108703613 107832909 107085466 106310368 105292797 104309797 103619337 103063822
2846A03063822m66347m57048n33581o41346q85010r03129p49827n73397l36170m3630
2856I7474337M98056N17130j3828k13623k92302k94208j26839j16110k52723k50101
2866I6929789j59741o2466J93120Q2016m56810o57559o88076o46353m26769l57151
2876I3750000l68595m10080o66142m52280L29495O01530M83274N71251P45535Q87871
2886I5471859J060009J130819J118422J080274J008273Q77380O78301M71115J91450
2895A03087902L6717q584p9870j81198j61648P9155j3828m71830o16551n85556n09977
2906A00574732k54631k29836m39167m58717k95878l46183n91040p09534q48531p45058
2916I5656157m04597p1525M66585O02960K88248L23296O00100P48396Q96930Q99554
$$ plain form
2846 103063822 102597475 102140427 101606846 100965500 100080490 99177361 98427534 97854137 97517967 97474337
2856 97474337 97972393 98489523 98475695 98262072 97969770 97675562 97548723 97432613 97179890 96929789
2866 96929789 96770048 96707582 96900702 96982718 96525908 95868349 95180273 94533920 94107151 93750000
2876 93750000 93381405 92971325 92305183 91852903 92182398 92783928 93267202 93838453 94583988 95471859
2886 95471859 96531868 97662687 98781109 99861383 100869656 101747036 102425337 102896452 103087902
2895 103087902 103124619 103116035 103036165 102854967 102693319 102772474 102758646 102286816 101670265 101084709 100574732
2906 100574732 100320101 100090265 99651098 99192381 98896503 98550320 97959280 97249746 96401215 95656157
2916 95656157 95251560 95180035 95646620 96249580 96537828 96861124 97461224 98209620 99106550 100006104
2926A00006104Q27550N40018j55925l47853j26600m4108j1444J65224O81162N58377
2936A02092505l13044n16415k85148j03474K67267L55482K27213Q7738k35796k57492
2946A01318836j4782J53780M20094M32968J52349Q9884J96696J53541m053j02282j91688
2957A02605343k44141k83718k42710m7207o1512k99215l44515k73705j98364p6294
2967A00533962L4094K25306J83344j65463k12908M1724j4306m27246m01973Q1062J47819
2978A00025415j42097j54734L4571R2030J83105k3842p77483p53879J49726J98365
2988I8831177m52757o89983p89166p62463n62667l68357P629o675m73977n72443m80175
2999I3680143l07798J08242K23875R3699M1008k9803o0797o6518m8399P6771k2889
$$ plain form
2926 100006104 100833654 101373672 101217747 100869894 100743294 100699186 100687742 100852966 101534128 102092505
2936 102092505 101779461 101263046 100977898 100874424 101141691 101497173 101724386 101812124 101576328 101318836
2946 101318836 101304054 101457834 101877928 102310896 102463245 102553129 102749825 102903366 102899313 102797031 102605343
2957 102605343 102361202 102077484 101834774 101787567 101726055 101426840 101082325 100808620 100610256 100533962
2967 100533962 100568056 100793362 100976706 100811243 100598335 100640059 100625753 100198507 99796534 99877596 100025415
2978 100025415 99883318 99728584 99763155 99855185 100038290 100014448 99236965 98483086 98632812 98831177
2988 98831177 98378420 97688437 96899271 96136808 95574141 95205784 95213413 95206738 94732761 94160318 93680143
2999 93680143 93372345 93480587 93704462 93798161 93839169 93809366 93748569 93682051 93633652 93710423 93687534
3010I3687534k79188o33716j344443j440525r42230p39574o13451n53132o36816n62191
3020H5942268l24010k49148k86341l15666m52995l57628l6716J95026M23431O19650
3030H5157871P63178R62734J319409J317978J009702P03812J78814Q345J88350J58549
3040I1768742P9870j32084o19173p30038m90665m49896n37872m87328l45469j91926
3050H7864161J02996R7275k51770l31640k66552j73807O0558R7513j24216k3365L61204
3061H7412357O01054Q54015R16958P20024P45058R99451R72032P84397M57764k29359
3071I4233751m12464j06096j16825l57867l70979k92778l5524N92470P35760L74555
3081I4244003M42505R17435R53674N88417N18561O18934O93083R08613P89166K99930
$$ plain form
3010 93687534 93408346 92774630 91430187 89989662 89047432 88307858 87694407 87141275 86504459 85942268
3020 85942268 85618258 85369110 85082769 84767103 84314108 83956480 83919764 84114790 84538221 85157871
3030 85157871 85921049 86883783 88203192 89521170 90530872 91234684 91413498 91421843 91610193 91768742
3040 91768742 91848612 91716528 91097355 90367317 89876652 89426756 88888884 88401556 88056087 87864161
3050 87864161 87967157 88064432 87812662 87481022 87214470 87040663 87101221 87198734 87074518 87051153 87412357
3061 87412357 88013411 88867426 89784384 90504408 91249466 92248917 93220949 94005346 94463110 94233751
3071 94233751 93821287 93715191 93598366 93240499 92869520 92576742 92541218 93133688 93869448 94244003
3081 94244003 94686508 95603943 96557617 97146034 97664595 98283529 98976612 99885225 100674391 100974321
3091A00974321N3883j92404q1539N56231O82115L94344L37840M36306L48568Q8453
3101A03598118o1035k03133k08139m2200K9563P2957Q9168O0082N6982O5565O9856
3112A03527784P2003P7247J52827K2411l80754n15461n33343l70025J26838K82765
3122A02462292J99556J42336k7895k0981K14577J79291j13488k18868k41041k08139
3132A02367640j10388L8862L29971M11988L79562K03848k96116l68357n5551N9366
3142A02960825J19925J34229J34468j9312n39541m37975M06742N17845M5300j34230
3152A03188276k37465k74896k21014j69754p7725k7895l9339M4346K89679K73943n961
3163A02742195j18017j53065j82867k40087j24455L24249K63215l54529m99010l13997
$$ plain form
3091 100974321 101028204 100835800 100754261 101310492 101992607 102386951 102724791 103161097 103509665 103598118
3101 103598118 103537083 103333950 103125811 103083611 103113174 103186131 103275299 103335381 103392363 103457928 103527784
3112 103527784 103599787 103677034 103829861 103852272 103471518 102956057 102422714 102052689 102179527 102462292
3122 102462292 102661848 102804184 102776289 102755308 102969885 103149176 103035688 102816820 102575779 102367640
3132 102367640 102257252 102296114 102626085 103038073 103417635 103621483 103325367 102957010 102901459 102960825
3142 102960825 103080750 103214979 103349447 103330135 102790594 102352619 102759361 103277206 103322506 103188276
3152 103188276 102950811 102675915 102454901 102285147 102207422 102179527 102140188 102184534 102474213 102748156 102742195
3163 102742195 102624178 102471113 102288246 102048159 101923704 102247953 102511168 102156639 101657629 101343632
3173A01343632k56062k41279j51873L7432J05858J30414K2173l25918l99112k66552
3183I9998713j69516N3167l814m95434l98636L49998M73738J33038l9101j94311l58820
3194I9349022o91414n32389K39849M75884L99589K64407j30415k35081p7963r6083
3204I8965406k68936k41756j5021N7698Q4400j3828l13759m30346m64201l99112k05756
3215I6754789k0265K27451L93152O25372M72784k03132l99113k65837k06947n6267
3225I7321987p4625k83718l36409l70264j83582M99725L73602o71148q92162n85556
3235I4797850l11613L12566L15428l62635n14984l75509k17199J27554K60353K85864
3245I4317675J81436k11000k37704J32084J20402k25067l18528k79426k15769j34468
$$ plain form
3173 101343632 101087570 100846291 100694418 100731850 100837708 100968122 100990295 100664377 100265265 99998713
3183 99998713 99829197 99882364 99878550 99383116 98984480 99334478 99808216 99941254 99902153 99707842 99349022
3194 99349022 98657608 98125219 98365068 98840952 99240541 99504948 99374533 99139452 99061489 98965406
3204 98965406 98696470 98454714 98439693 98497391 98581791 98567963 98254204 97823858 97359657 96960545 96754789
3215 96754789 96734524 96961975 97355127 97980499 98453283 98250151 97851038 97585201 97378254 97321987
3225 97321987 97247362 96963644 96627235 96256971 96073389 96573114 96946716 96275568 95383406 94797850
3235 94797850 94486237 94798803 95114231 94751596 94236612 93861103 93643904 93771458 94031811 94317675
3245 94317675 94499111 94288111 94050407 94182491 94302893 94077826 93759298 93479872 93264103 93129635
3255I3129635J00136O44683P36475M78507K20298k35796m51326n54323m74215j08242
3265I3485832N9128J37568J71661J51396P0095j26362k16007k50817k47717k25305
3275I3009472r2745K46286L15190J88589M4823k11955l80277o26803m87089K11716
3285I2217207L12090o5088k47002m68969m64678j99557q0585l0756M7207J34468K07663
3296I1362000L87907K12907n10215n48602R8467J93835q3924k11715l22819m09365
3306I0168476m81367n07832n75780l70503K50340M00781J63317R2030M2676L5286J38760
3317H9356184N7220k51531l24726k16246j74522j30654j13964j22547j35183j57118
3327H7786913j91927k88487k47716o0082L7432J44005R9420j44481k35558k47240k41280
$$ plain form
3255 93129635 93229771 93874454 94610929 95089436 95309734 95073938 94622612 94068289 93594074 93485832
3265 93485832 93544960 93682528 93854189 94005585 94075680 93949318 93733311 93482494 93234777 93009472
3275 93009472 92916727 93163013 93478203 93666792 93711615 93499660 93119383 92492580 92005491 92217207
3285 92217207 92529297 92464209 92217207 91748238 91283560 91084003 91003418 90972662 91019869 91154337 91362000
3296 91362000 91749907 91962814 91452599 90903997 91002464 91196299 91112375 90900660 90577841 90168476
3306 90168476 89687109 89179277 88603497 88232994 88483334 88884115 89047432 89139462 89182138 89217424 89356184
3317 89356184 89413404 89161873 88837147 88620901 88446379 88315725 88201761 88079214 87944031 87786913
3327 87786913 87594986 87306499 87058783 86998701 87036133 87180138 87279558 87135077 86899519 86652279 86410999
3338H6410999j36614j98364m86135m99249l21865j21117K83719L34978Q5354j21594
3348H5230112m54903n82933n89132m71831j59263N7459L54290L15189j27316k87532
3358H3284140l63589k50101K09332K83718N8651q0586k80618l40462k84433k16961
3368H2019091m8399l6478j72139k34127l10182k72036r1076j3113M1724p16j86681
3379H0695868k59161k69413k70129k60591j91689m4346N5790K55585R1314n77688p27415
3390G8498125n20706l32594O3896J35660k01463q1301N56230O04153K04086j04904
3400G8821182o95228o18220K99216M12702q5831l20911o56605n15222L34263L89814
3410G7365160l62873l66449L31401L60489j80959l16859k58684j39236J66416K88009
$$ plain form
3338 86410999 86274385 86076021 85589886 85090637 84768772 84647655 84931374 85266352 85351706 85230112
3348 85230112 84775209 84192276 83603144 83131313 82972050 83029509 83383799 83698988 83571672 83284140
3358 83284140 82920551 82670450 82879782 83163500 83222151 83141565 82860947 82520485 82236052 82019091
3368 82019091 81970692 81934214 81762075 81527948 81217766 80945730 80854654 80841541 80883265 80882549 80695868
3379 80695868 80436707 80167294 79897165 79636574 79444885 79400539 79456329 79711914 79803228 79225540 78498125
3390 78498125 77977419 77644825 77708721 77844381 77642918 77561617 78117847 78722000 78926086 78821182
3400 78821182 78125954 77507734 77806950 78219652 78133821 77812910 77156305 76641083 76975346 77365160
3410 77365160 77002287 76635838 76967239 77327728 77146769 76829910 76571226 76431990 76598406 76886415
3420G6886415L76225J98603m54188n13315k5988J26601J04665J44959K57492J64986
3430G7266455j36614l55244p36952n89370K83718M01735j55926k26497K9087R2029
3440G5872421J19686%l80039m57048k99216j97410q3923N7697L22580L11375j01566
3451G5164557j4067O87122O44922j68800k87056J72615K11954J8835j60217n49078
3461G5720787n00917m7207K88963Q60214P78914r8229l13759j8119o9619m37021l90529
3472G5773478P8439K02894J08481N9605j5259r4414k60591k07901J21116J87397O4373
3483G6017618k622j05143j23501j28746M0531N51462N70775J21355n6267k26259p4625
3494G6584578O03675O73294L17336o2466q45671r19103l83377M8399Q28742Q60453
$$ plain form
3420 76886415 77262640 77461243 77007055 76493740 76467752 76594353 76699018 76843977 77101469 77266455
3430 77266455 77129841 76774597 76037645 75448275 75731993 76133728 75977802 75751305 75780392 75872421
3440 75872421 75992107 75992107 75612068 75155020 74855804 74658394 74574471 74632168 74954748 75266123 75164557
3451 75164557 75150490 75837612 76482534 76313734 76026678 76199293 76411247 76430082 76269865 75720787
3461 75720787 75219870 75172663 75461626 76321840 77100754 77002525 76688766 76670647 76601028 76164007 75773478
3472 75773478 75851917 76054811 76163292 76222897 76207638 76113224 75852633 75644732 75765848 75953245 76017618
3483 76017618 76014996 75909853 75786352 75657606 75698137 76249599 76820374 76941729 76885462 76659203 76584578
3494 76584578 77188253 77861547 78178883 78116417 77270746 76351643 75968266 76016665 76845407 77705860
3504G7705860J66416k49624q10623q29220k41995R537J44005K28405J60932K79904
3514G6563597O75440O45875K13147r060j54495l05415m71830n34534n14031m47750
3524G5660944l09229j69516n7935K12192Q25167Q56400L14474Q7738k5034j08242k19107
3535G7067852m5061M99964P57455J016379P77244m5061o10590j438379j292944k7180
3545G6659679N32389J021147P22885p69854j112938p28130k72751P61509R98020N06163
3555G8318119L82423K57731N12123J433611J487732J142740N9128k489328l259898
3564G7844381l062486j903296J251698K272367J840830J358748J2397l46899J38521
3573G9406261J85729j4067N6267L21388N63621R15289J062393J388550O72341j421452
$$ plain form
3504 77705860 77872276 77622652 76812029 75982809 75740814 75750351 75894356 76122761 76283693 76563597
3514 76563597 77239037 77884912 78098059 78088999 77934504 77629089 77157259 76622725 76108694 75660944
3524 75660944 75351715 75182199 75124264 75336456 76161623 77018023 77332497 77420235 77395201 77286959 77067852
3535 77067852 77022791 77522755 78280210 79296589 80073833 80028772 79418182 77979803 76686859 76659679
3545 76659679 77192068 78213215 78936100 78166246 77053308 76325178 76052427 76813936 77811956 78318119
3555 78318119 78700542 78958273 79470396 80904007 82391739 83534479 83593607 81104279 77844381
3564 77844381 74781895 72878599 74130297 76402664 78243494 79602242 79614639 79267740 79406261
3573 79406261 79591990 79577923 79634190 79955578 80519199 81434488 82496881 83885431 84557772 83136320
3583H3136320k330780l019333k196073R22918J907825J621962J041889p47204j063346
3592G9274178j37091K71797Q76427N81979j055002j167297j26362O84738K111674K152681
3602H3467722Q95739j1445j315832j679897j207590q22306k23160L07560R74894J238584
3612H1624269J570225O21557k403020k974511j764059o16073J259327K544880M157543
3621H4020138L744364J357317q59738m511833n323648l915072k084970J950264K854347
3630G7231169Q43048L88622O02484N63621N20230L99112r5129K88964J686096K303839
3640H4732056K784490K350569J316309p97749n494833o283521l928900j864195J744270
3649G4558496K994061K642632J560688j699448k218485m21762M69923J576662J635551
$$ plain form
3583 83136320 80805540 77786207 75590134 76513052 78420877 80042839 81084728 80337524 79274178
3592 79274178 79137087 79408884 80285311 80867290 79812288 78644991 78518629 79203367 81315041 83467722
3602 83467722 84363461 84352016 83036184 81356287 80148697 79326391 79103231 79410791 80385685 81624269
3612 81624269 83194494 83816051 81413031 78438520 76674461 76058388 77317715 79862595 84020138
3621 84020138 87764502 89121819 88262081 83750248 78426600 74511528 72426558 74376822 77231169
3630 77231169 78074217 78462839 79065323 79628944 80149174 80548286 80453157 80742121 82428217 84732056
3640 84732056 87516546 89867115 91183424 90385675 84890842 78607321 74678421 72814226 74558496
3649 74558496 77552557 80195189 81755877 80056429 77837944 77416182 77886105 79462767 81098318
3658H1098318K63691K52962J254320J868487L078460K349377o54697k056837l184319
3667H4269762k606392O85930J225949J07050j578331o123782n450487J054287K858401
3676G4442387J448869J407385J627684J951933K794981K652406J957179M81605k475500
3685H6288929l883123m950285l871680L83377J884222J561165J623392J510621J253366
3694H1799984P98464L24964k56776p69377j693964j284600O02007J646519K837420
3703H4004641K538442P49827q95501l558158m228592l454924k054453R94921K419233
3712G6515436L086806K795696R79900J04427m08411p14540o48975p17402r30309p41482
3722G9321146k73466M15087J589536K247095L174067K226591r77278k767086m378557
$$ plain form
3658 81098318 81362009 81614971 82869291 84737778 87816238 90165615 89510918 87454081 84269762
3667 84269762 81663370 82349300 83575249 83682299 82103968 75980186 70529699 71583986 74442387
3676 74442387 75891256 77298641 78926325 80878258 83673239 86325645 88282824 88764429 86288929
3685 86288929 82405806 77455521 73583841 73967218 75851440 77412605 79035997 80546618 81799984
3694 81799984 82598448 82923412 82666636 81897259 80203295 78918695 79520702 81167221 84004641
3703 84004641 86543083 87292910 86397409 82839251 78610659 75155735 73101282 74096203 76515436
3712 76515436 79602242 82397938 83377838 83482265 83073854 82359314 81710339 80992937 80062628 79321146
3722 79321146 79047680 79462767 81052303 83299398 86473465 88700056 87722778 84955692 80577135
3731H0577135m539490l441095j592159K054214L818512M998207M081488J76191j640558
3740H4492445k747774k708197j325130J75237L911496K634048n054712o315947k830744
3749G0230722p16447K274036L267050K721071J675129j092434j734495p33853q344
3758G5882435J317739J657009J246930P21693l91960q38519o94513r10997j626253
3767G6363564j339436j12057P99656K146244K178431Q95262M7922j031161j425266
3776G8523159j365900q45671P74145R30787k85387o75917q60453n61237N29528R03129
3786G7066183P29561Q36372J212359J074791L01838J62840O95228M77314k57254j024007
3796H1275225k339840k623797k259731j293898J239062J520633k95400j008034j947164
$$ plain form
3731 80577135 76037645 72596550 71004391 73058605 76877117 81875324 85956812 86133003 84492445
3740 84492445 81744671 79036474 77711344 77886581 81798077 84432125 79377413 73061466 70230722
3749 70230722 69514275 71788311 75055361 77776432 79451561 78359127 76624632 75890779 75882435
3758 75882435 77200174 78857183 80104113 80825806 80433846 79595327 78900814 77989817 76363564
3767 76363564 75024128 74912071 75711727 77857971 80036402 80931664 80979586 79948425 78523159
3776 78523159 77157259 76311588 77085733 78016520 77731133 77055216 76194763 75633526 76163054 77066183
3786 77066183 77795744 78632116 79844475 80919266 81221104 81383944 82079172 82556486 82299232 81275225
3796 81275225 78935385 76311588 74051857 72757959 73997021 75517654 75222254 74214220 72267056
3805G2267056r95398K655983L654003K963543K076864J10150q93355j492262j495361
3814G8851223l30210m78029j852989k317906k844810j686096K117872K980709J493454
3823G5933218Q76427Q7499P4387J127005J136302J10150J22785J394988R69409j024007
3833H0808163k149344l463983l176928r64641Q6307P64132J002073L54051O69718J743555
3843G5673103K545596L942012L496170J525641q04424m820347o384850o915331m882097
3852F3375473J302958L756761M008532L824234K409935J174926o19888j430035j640558
3861G6162338j258135L09229O99282L96967j77145j740217j844645o44922K8372P15494
3871G2646618J085043J136541J201153J478434Q37326j181364j612187p41720l91483
$$ plain form
3805 72267056 71271658 73927641 77581644 80545187 82622051 82732201 81838846 80346584 78851223
3814 78851223 78521013 78042984 76189995 73872089 71027279 69341183 71459055 74439764 75933218
3823 75933218 76809645 76897144 76971531 78098536 79234838 79344988 79467773 80862761 81832170 80808163
3833 80808163 78658819 75194836 72017908 71053267 71139574 71903706 72905779 73259830 73929548 75673103
3843 75673103 78218699 82160711 85656881 87182522 86378098 81557751 75172901 68257570 63375473
3852 63375473 64678431 68435192 72443724 76267958 78677893 79852819 79232931 77802896 76162338
3861 76162338 74904203 75213432 75912714 76309681 76132536 74392319 72547674 71902752 71931124 72646618
3871 72646618 73731661 74868202 76069355 77547789 78385115 77203751 75591564 74849844 74458361
3880G4458361P8201o9857j378774r39131J715660J806736l97444j192331j798153j038551
3890G1244717J743793K741337K886057K256155L38793q93355k108574k609729k412796
3899G3186398k151013j635313r89914p7247O76870J599073J805544J233578J015663
3908G4663639R59873O98567K98500j43051q42095j035452q54969n38349K83957L70025
3918G3860645k74896m30107l86477k03133K28644N32865J052618P90835l79324r55343
3928G3836327j500845j266003m0054N84364J143217J084566K47955j73807n20706o27279
3938G2767735m33445l45469l02076j43290K07424K81573M8875R7514M80890L93867
3948G3053598k45809l06606J53780K31981P7009m292j10626j55687j25647j63316k74897
$$ plain form
3880 74458361 74536562 74466705 73087931 72148800 73864460 75671196 75273752 74081421 72283268 71244717
3890 71244717 72988510 75729847 78615904 80872059 81210852 80317497 78208923 75599194 73186398
3899 73186398 71035385 69400072 68410158 68332911 69009781 70608854 72414398 73647976 74663639
3908 74663639 75623512 76322079 76620579 76477528 75635433 74599981 73745012 73206663 73490620 73860645
3918 73860645 73585749 73155642 72769165 72566032 72794676 73327541 74380159 75170994 74791670 73836327
3928 73836327 72335482 71069479 71029425 71613789 72757006 73841572 74089527 73915720 73395014 72767735
3938 72767735 72334290 71988821 71686745 71543455 71750879 72032452 72081327 72178841 72659731 73053598
3948 73053598 72807789 72501183 72654963 72886944 72963953 72959661 72849035 72693348 72567701 72404385 72129488
3959G2129488k95162l01838j49489K84195L60966J19925M2200k7895N0068L94582L88384
3970G2995424P8917j08004l90053l25918K23160K58684j35660k97546m58002l56436
3980G1484566J33514K45094K7180M7445K35081L05653L65972K70367j6689k08140m46319
3991G2443724m49658j49250j02281k52247k71082k65837j38283J55211L39269
4000G1309566
$$ plain form
3959 72129488 71834326 71532488 71382999 71667194 72028160 72148085 72190285 72162390 72212458 72607040 72995424
3970 72995424 73074341 72966337 72576284 72250366 72473526 72732210 72596550 72299004 71841002 71484566
3980 71484566 71618080 71863174 71890354 71937799 72172880 72478533 72844505 73114872 73098183 72890043 72443724
3991 72443724 71994066 71844816 71742535 71490288 71219206 70953369 70815086 70970297 71309566
4000 71309566
##END=$$ End of the data block
