##TITLE=$$ Begin of the data block
##JCAMP-DX=5.00 $$ ACD/SpecManager v 10.08
##SPECTROMETER/DATA SYSTEM=16PC
##DATE=Wed Sep 25 14:07:19 2013
##DATA TYPE=INFRARED SPECTRUM
##DATA CLASS=XYDATA
##ORIGIN=
##OWNER=
##NPOINTS=3601
##FIRSTX=400.00000000
##LASTX=4000.00000000
##MAXX=4000.00000000
##MINX=400.00000000
##MAXY=48.64766693
##MINY=23.93791580
##XFACTOR=1.0000000000
##YFACTOR=0.000000100000000
##FIRSTY=35.39221191
##DELTAX=1.00000000
##XUNITS=1/CM
##YUNITS=TRANSMITTANCE
##XYDATA=(X++(Y..Y))
400 353922119 355015030 364112625 378509293 392775764 397141953 401923676 419228554 433910370
408 433910370 431670418 422072639 407122116 395195007 399360428 407540817 410859604 412783127
416 412783127 414105644 413967133 411520233 407519836 402707100 396274567 384753723 376867294 384551773
425 384551773 394696236 396325836 394966583 390931129 388883820 396774063 405057907 405105591 402122498
434 402122498 397797813 394048233 394552002 395711670 394599915 392882576 390589943 389700890 393301735
443 393301735 398098946 401512375 404488564 407516251 409386139 408735733 406510582 401889801 398807983
452 398807983 402866364 408243179 411614914 411086578 399830322 389320831 392317276 398136368 399388313
461 399388313 398949852 395904770 394241104 399694443 406104088 408463478 409045944 407913666 406692505
470 406692505 407487411 408919830 410068970 411665916 414777756 417471886 418542862 416872978 407959938
479 407959938 400749435 405483246 413769722 420679321 426065903 427802086 426899910 423014870 418088455
488 418088455 414008141 410588989 407282829 407064438 415183792 424263458 428405304 428419342 420819511
497 420819511 412596474 411341438 411764603 409303436 409365158 418791542 428715210 431869736 430293312
506 430293312 421200027 411793213 409374962 410862427 416744690 423608780 428549042 430530548 426405182
515 426405182 419605980 411445847 405134926 405327797 409003754 415985565 422394753 423739662 421680450
524 421680450 415119400 407835732 403457642 401339035 402752876 405568352 408200493 410284500 411556244
533 411556244 410125504 401888123 393220901 389848480 389621277 393089066 397875290 402427902 404820938
542 404820938 401065102 395797272 392676582 390645523 390249710 390336761 389207840 389044533 392128220
551 392128220 396460037 401595116 405150185 402872543 399923782 400853386 403244743 406461945 409712067
560 409712067 411934357 413294296 414109001 412860870 406859627 399937401 394745598 392134666 395202637
569 395202637 399857292 403091660 404744644 402796249 399812241 397941589 396412354 394742737 394208679
578 394208679 396776657 399891357 401782265 402058830 399179001 394826431 389379272 385210762 385483971
587 385483971 388207436 392762184 398192406 403876801 408189774 408912201 407203674 402462006 397751083
596 397751083 396189461 397009125 401417007 406604309 410226364 412096977 410655975 407677650 404162178
605 404162178 400869827 398659706 398234138 401584396 405702820 408293724 409210930 406887779 403288345
614 403288345 399463654 396583786 396340141 398219109 403054466 408495407 412701111 414973488 413144112
623 413144112 409780045 406243553 403978348 405277252 408953438 415838966 422167053 423753281 422681351
632 422681351 419475555 414627304 407557983 402000656 402309875 406042557 413460503 420802841 424229393
641 424229393 424239655 418694267 411666145 406112213 403238754 406377335 412107239 418811569 424407959
650 424407959 426042786 424411049 418222656 410575867 402807007 398911476 406338196 416061630 420708427
659 420708427 422769089 422064056 419230232 412068138 408905983 424050560 437364349 427403679 412393341
668 412393341 403783569 400452614 408887863 417709579 414162140 408858070 409645081 412059326 414001465
677 414001465 416223068 419596443 421656837 419639359 415313721 408992767 402278900 397018661 392792473
686 392792473 389607201 388027916 389803658 391387711 388463974 385088692 384103775 384834518 387729187
695 387729187 392258644 398793449 405081978 408698578 410533180 410249481 409101257 408049355 407636414
704 407636414 409073830 411315689 413563957 416285515 420580368 423749695 422772408 419711342 415024986
713 415024986 410505066 408127060 407795410 411157608 414960136 415827255 415771484 415953140 415551414 413528214
723 413528214 411692123 411386032 412967911 418416252 424212952 427321434 428273430 425916214 422265282
732 422265282 418705215 415973434 415393105 416587830 420276871 424494019 428029060 429329643 425003281
741 425003281 419359436 415888290 413654556 413097610 413583031 414946060 416214447 416617622 415383339
750 415383339 411137352 404914131 396069527 388262520 385644913 386092186 389612923 393958092 396680832
759 396680832 398383636 398416748 398086777 398136139 399605255 404464722 410663376 417191010 422893982
768 422893982 426159630 427351456 425812721 422991982 419417877 417192917 419500809 423624039 428420296
777 428420296 432346115 433078995 431813240 428500671 424543610 420843582 418851624 421144028 425243607
786 425243607 430203934 434007645 433791656 431144714 425800552 420459290 417976151 417618523 420338135
795 420338135 423933983 426703453 428099403 426372757 423423996 420672646 417811165 414151192 412251701
804 412251701 415763130 420720825 424593925 426728020 424772034 421282997 417921524 415023079 413380127
813 413380127 413281937 415995102 419376831 421810875 422981262 421815872 418964157 414305916 409076233
822 409076233 404424210 400486221 398185730 396307220 393901367 391091843 387942543 383680344 376810074
831 376810074 369558792 362682571 359099388 363151779 371321678 382558594 393799057 401353607
839 401353607 406048279 406569481 405644417 405564079 406321030 408908844 412612915 417801628 422217140
848 422217140 423343658 422320137 418509254 414723625 413928261 415026169 418499947 422574997 425638657
857 425638657 427685966 428169708 427102814 423473587 419808159 418555489 418934593 421385040 424692612
866 424692612 428309441 430675964 429338455 426430473 422906647 419848938 418792496 419329872 422175179
875 422175179 425495872 427905312 428779602 426458817 422661552 417961121 414130707 413349152 414970627
884 414970627 419805756 425661087 431089401 434660416 433598518 430490494 426350098 423120956 423726807
893 423726807 426238785 430138817 434115181 436781883 437840958 435945053 432854424 429396133 427019844
902 427019844 428080330 430687408 434075584 437223892 438821564 438969612 436868439 433908234 430991669
911 430991669 428779144 428199310 429349670 433602562 438060532 439885139 440268288 439318886 437446594
920 437446594 434758911 432270279 430846214 431038361 434700966 438790321 440653076 440969925 439100494
929 439100494 436353683 433533897 431511383 431720505 433270226 436153870 439151993 441226959 441826324
938 441826324 439440231 435901871 432175636 429357071 429096680 430690765 434683075 438980103 441772919
947 441772919 442750702 440349121 436516991 432233582 428840637 428390961 429730415 433030853 436367035
956 436367035 437694550 437541733 435333252 432335358 429343719 427193642 427242279 428717613 431993713
965 431993713 434988251 435416718 434257736 431300888 427826157 424851913 422952881 423224220 425123215
974 425123215 429156532 433269958 435542107 436079025 433681030 430342903 427498322 425630341 425845871
983 425845871 427704811 432060699 436138878 436955681 435989380 433354378 430156479 427412758 425503502
992 425503502 425279617 426344643 429275742 432000160 432358246 431186905 427966843 424605598 423015366
1001 423015366 422660828 423854828 425965080 428993454 431349754 431131134 429273834 425485382 421546707
1010 421546707 419306984 418267975 418855667 420143852 421683807 422465324 421104889 418270836 413717995
1019 413717995 408802757 404742241 401707153 400737991 400441170 399894943 398721695 395811539 392436256
1028 392436256 389515381 386992455 384872208 383887062 385093231 387521515 390679588 394193420 397598267
1037 397598267 400671959 402988892 404692650 405266037 406264076 409556160 413680573 418111343 421910057
1046 421910057 423826942 424269905 422809830 420706978 418891182 417921295 418996811 421124954 424110641
1055 424110641 426756859 427561264 427242050 425773849 423881302 422065506 420970459 421677361 423372726
1064 423372726 426097412 428369522 428613892 427148094 422930222 418460388 416030159 415220985 416656494
1073 416656494 419498901 423601875 427511940 429751892 430246582 427708397 424298058 421445122 420053711
1082 420053711 422217598 425796509 429721603 432872047 433501472 432414780 429342041 425757904 422846565
1091 422846565 421208611 422302017 424736977 428243408 430918694 430276871 427794685 423504333 419251938
1100 419251938 417155266 416430244 417452087 418858757 419414749 419112701 417280922 414674034 411386032
1109 411386032 408726196 408056984 409313202 413656006 418766479 422784348 425495148 425685425 424489250
1118 424489250 422263870 420125504 419424286 419815292 421745529 424186249 426536560 427957535 426842918
1127 426842918 424891243 423315506 421964874 420816193 420695801 422998428 425994873 428559074 430275688
1136 430275688 430124512 428792496 426140556 423622589 422940254 423209915 424193382 425655823 427582245
1145 427582245 429071426 429099808 428017616 425294647 422545929 421445389 421283951 422254333 423321953
1154 423321953 423318405 422837486 422316322 421054115 417985687 414638290 412052155 410621414 411589851
1163 411589851 413447151 415257683 416538963 416213531 415127525 413517227 412131310 411936989 412513962
1172 412513962 413955460 415686378 417484512 418383827 416773071 414362183 412172089 410656700 410895119
1181 410895119 412032623 413775444 415516624 416837692 416877289 414339523 410109024 403784027 397924423
1190 397924423 394940147 394877663 399455070 406066437 413101921 419291267 422440758 423708191 423250656
1199 423250656 421874542 419956207 418942223 421084900 424342155 427781601 430323105 430245171 428540001
1208 428540001 425109634 421503296 419086456 418309441 420901794 424391518 427080879 428373795 426547279
1217 426547279 423283348 419325104 415766220 414209137 413869133 414881935 416088104 416433792 415736198
1226 415736198 413261871 409605255 404649963 399791946 396630516 394436607 393535385 392362823 389395218
1235 389395218 384834518 377944946 370014420 361969452 354156494 347240448 341189880 336026192 332254181
1244 332254181 330567360 330417633 331442833 333777428 337260971 342413177 349898338 359120369 370437851
1253 370437851 381648293 390541801 397497406 401942253 404520988 405187378 405441055 407056580 409161797
1262 409161797 411623001 413996696 415713081 417015076 417968025 418533096 418520699 418446045 418770561 419463882
1272 419463882 420897484 422325859 423181305 423301468 422211151 420279999 417553673 414526939 411701660
1281 411701660 409101486 407088051 405145416 402772903 400284271 397382736 395397415 396154861 397863846
1290 397863846 399211655 400585899 402033310 403260727 403977394 404220123 403614769 403101692 403631935
1299 403631935 404797554 406440506 408759842 412178993 415865173 419399033 421963921 422301521 421315193
1308 421315193 419294586 416821251 414128304 412547340 413923492 416947861 421691437 425857773 426470528
1317 426470528 425638924 424220810 422991753 423234940 424285431 426083565 428094864 429936638 431091537
1326 431091537 430743942 429403305 426833649 424453011 423615685 424274902 427333107 431296844 435709724
1335 435709724 438362350 436121445 431300659 423711548 417725563 419393311 423486481 426556816 429313660
1344 429313660 431585541 432564735 430858383 428047180 424782982 422458649 423379898 425458183 427435150
1353 427435150 429126282 429763794 429837952 429527512 428998489 429241180 427960396 421338806 414932709
1362 414932709 413700829 415616760 422252197 427771568 424156914 419523964 420623055 423529129 427614441
1371 427614441 429736137 424029579 418032150 419230957 421911697 422345657 422061920 420958519 420200119
1380 420200119 420797806 423109779 429767838 434958458 432095757 426125298 418382187 413110962 416830063
1389 416830063 424050102 433468819 439042091 429516068 419215698 423012733 428012848 423785210
1397 423785210 417808533 413393745 412613144 422376862 431480865 427429657 421006699 419874916 420897713
1406 420897713 424637299 427658310 425023308 421797752 422054062 423833618 426237335 430157166 439245949
1415 439245949 444321632 433667908 418538589 404383430 396895638 410049896 424448738 419422379
1423 419422379 412762146 419221649 427242508 429586411 428044548 419164658 411438446 414114456 421467781
1432 421467781 435187836 442279091 422501335 399276733 392473679 392512550 398052444 404242287
1440 404242287 403415680 402674179 408755074 415084839 417559624 415507545 403212318 391700287 393165131
1449 393165131 398387909 398899078 404642563 432749977 453187943 430226097 398086548 381017456
1457 381017456 373207092 379263649 392175446 410122871 422134628 409580002 393617630 391911736
1465 391911736 396312943 405411949 416649094 430434456 436447144 416314850 394598465 395490417
1473 395490417 401724091 402252655 402609825 405397873 408361206 410151978 410647163 407464523 406031837
1482 406031837 413959961 422317047 423665276 421131363 415726166 406357994 387468567 373467941
1490 373467941 382127037 397803535 413023949 421049576 407407303 387826195 374535065 363559952
1498 363559952 354568253 348863144 348502388 350887299 359138718 358155746 321437836 286303997 288616905
1507 288616905 306244850 331587296 356910248 367204666 376693001 401587715 420909424 409373283
1515 409373283 396105766 410206070 426468353 426824570 418959389 398348312 383549690 402203331
1523 402203331 422537079 413336258 400565376 403049240 410992126 423016319 432693024 431600113
1531 431600113 424338570 405815849 396689186 428716888 463501205 469847908 457902184 416573524
1539 416573524 378374100 383395920 397809029 395507584 393408546 403076897 414461861 420979500
1547 420979500 423793564 419227600 415217896 421673050 428996086 425345421 427361984 463962784
1555 463962784 486476669 434207916 372144241 351577034 352899094 382577667 413679123 411970139
1563 411970139 405814171 418713074 431015244 428714294 418372879 395519028 379249802 396393776
1571 396393776 419283371 429583321 426122437 390120010 356068382 361533890 378513336 390686035
1579 390686035 400570641 403613586 404709587 408250084 411188583 411458244 410510788 409170609 407249680
1588 407249680 404336472 401924591 402122498 402674904 401575317 400182953 399332047 398588181 397942772
1597 397942772 396952400 394882431 392597656 390341759 389240990 391265144 394126892 396558037 397469025
1606 397469025 394412994 390191307 386107941 384206047 387822647 394378891 407807121 411909332
1614 411909332 380675087 347472191 342905769 349253883 362620125 372130165 359449615 343061676
1622 343061676 336460114 336276283 347475777 358549118 354395370 350753555 361436844 377120247
1630 377120247 395542603 409323692 409497490 398557205 367392311 341845016 354912529 376017570
1638 376017570 380527039 383603325 394289246 406310081 420350304 424573441 396971207 368740807
1646 368740807 366946945 381976128 427850494 460727692 422339439 369984627 344552994 337002029
1654 337002029 360110779 389304390 399634590 405001144 414289474 417592049 401394844 385400772
1662 385400772 388535004 399615517 417412529 430992355 425246468 411466599 390895844 378569374
1670 378569374 401613960 424994698 413062820 394785881 388902435 390448341 404362450 419673920
1678 419673920 423021088 426513214 449263344 456897278 398374786 342803726 362234116 396797409
1686 396797409 403925896 403766861 399787178 399459381 417501450 435641060 438182831 432111282 412879944
1695 412879944 399383774 424052734 441733131 397096176 353094826 370770950 400529137 408632507
1703 408632507 408546219 399024506 390462151 396604309 406153450 410912285 415323982 421786537 428236237
1712 428236237 435524445 437300186 424771080 406110764 381937256 366124382 380988121 401819687
1720 401819687 408039818 409574509 408359985 407786140 414142609 420663376 420609970 420186272 424461594
1729 424461594 430100212 441477051 440528145 392824631 351835709 378478279 415980568 420240860
1737 420240860 414163132 403819809 395603409 402028580 410800476 410965691 411011200 418895264 425247650
1746 425247650 421464691 413202515 401524315 391604919 389494667 393626938 409219513 421967278
1754 421967278 412532806 401227493 406688461 414600372 416355362 413468132 399716606 389702072
1762 389702072 402560730 418465843 420471420 419068565 419686089 420563698 424550552 423244934 402045479
1771 402045479 382398376 386769524 397498131 402932892 407510300 413252602 415750504 407398682
1779 407398682 399805069 406750183 414110184 408250084 401481400 403063774 408516159 418319702 426844826
1788 426844826 428767929 423649292 403408775 385643730 390943985 402251740 408253670 412305374
1796 412305374 414311409 413310547 406362534 399307022 398020515 399450073 403008957 407172203 410136223
1805 410136223 412148476 413231850 412255058 406550179 400747070 399121284 400065651 404666901 409118652
1814 409118652 408842316 407239189 406097870 405675888 406936646 409549942 415573120 418803711 409239998
1823 409239998 400333862 406826973 414847870 414027214 408600311 395854492 386263618 394209137 405252914
1832 405252914 407747726 407699127 407402039 406339874 403290024 402665367 411535721 420705070 423333893
1841 423333893 419419060 401112785 385109177 391584854 402241211 402675171 401375275 402933350
1849 402933350 404633751 404920578 404903641 405334473 405731659 405938377 405732384 404564857 403256912 402381668
1859 402381668 402134171 402747154 404677887 409445992 414095879 417013893 415692825 403563271 391197433
1868 391197433 388812790 390903473 396488190 402209511 403384209 403005142 402499199 401880493 401781807
1877 401781807 401771545 401520004 401351471 401674271 401905518 400717506 400751343 406547775 411078949 406449318
1887 406449318 399799805 395497818 393966446 399500122 404850731 401815414 397552032 397475014 398611794
1896 398611794 399837494 401022682 401592026 401754837 401296158 400911560 401469002 402236214 402942886 403071404
1906 403071404 401599159 399767876 398317795 397727737 398922691 401301880 405581703 408735504 407173386
1915 407173386 403297882 396733284 392222633 397531738 403214951 399865875 395131607 394283066 395041962
1924 395041962 397462120 399814835 399760971 399183044 399455795 399762878 399592171 399405479 399571648 399854889
1934 399854889 399923096 400431633 402493248 404401779 405137291 403751831 396812897 390751839 393144379
1943 393144379 397123108 397203217 396812897 398192902 399417648 398723373 397863388 398545990 399139633 398002625
1953 398002625 396872749 397488365 398204346 397625427 396740417 395976067 395622253 396252861 397442093 399567604
1963 399567604 400793076 398411026 395412445 394142380 393828163 394849548 396091003 396324615 396264572
1972 396264572 396251221 396175385 396043777 395848274 395499458 395246277 395436287 395681381 395595551 395519981 395840874
1983 395840874 396036606 395351868 394872437 396032791 397027969 396256943 394541740 391472588 389143715
1992 389143715 390514603 392577896 392792931 392718544 393356323 393836250 393286476 392710915 393128624 393622627
2002 393622627 393410187 393107643 393234024 393296967 392724991 392272491 392760277 393414001 393556137 393713722
2012 393713722 394598732 394977798 393216133 391227493 390654793 390673866 391161919 391657333 391447296 391160011
2022 391160011 391275177 391523819 391808281 392092209 392360229 392450790 392116547 391599884 390964050 390498657
2032 390498657 390692482 391009102 391019096 390888672 390684853 390274773 389390945 388502579 388008575 387850037
2042 387850037 388217201 388758163 389195442 389492493 389477234 389277458 388941994 388535004 388074417 387745857
2052 387745857 387780914 388058167 388678551 389205475 389087906 388766518 388483505 388279686 388484955 388473053
2062 388473053 387318611 386246681 386499405 387099495 387439499 387650719 387575607 387471924 387605438 387793312
2072 387793312 387945175 388048401 388029556 387980690 387969742 387995224 388134232 388218651 388023834 387792816 387716064
2083 387716064 387724380 387852173 387976646 387993088 387879601 387507210 387091866 386831741 386649628 386541367
2093 386541367 386485596 386512527 386462212 386028290 385677109 385945816 386315117 386396637 386331787 385994682 385797501
2104 385797501 386328201 386932144 387074242 386981964 386657486 386238327 385847321 385528793 385436554 385363808
2114 385363808 385046005 384808311 384940872 385281563 385893326 386388550 386264801 385926247 385519028 385311584
2124 385311584 385882874 386447906 386218071 385780563 385483742 385253677 385166626 385118942 385047188 384903908
2134 384903908 384485245 384195557 384511719 385011444 385466805 385768890 385617981 385358582 385258675 385245552
2144 385245552 385401497 385529747 385413399 385192413 384867897 384637833 384818306 385053177 385031929 384932747
2154 384932747 384781342 384721298 385015030 385329018 385411034 385279160 384708862 384173622 384212036 384402275
2164 384402275 384509315 384511719 384247055 383900871 383574257 383355637 383469810 383608322 383407135 383255463
2174 383255463 383567085 383903503 383913765 383746147 383369446 382969856 382771988 382627029 382409096 382271767
2184 382271767 382362595 382570724 382812042 383150330 383762360 384225616 384033432 383614311 383235703 382873077
2194 382873077 382617226 382387619 382083664 381853561 381843338 381956558 382162552 382409096 382702599 382834206
2204 382834206 382500153 381990662 381430397 381008606 381050110 381273041 381551514 381739388 381539345 381278038
2214 381278038 381268730 381252060 381018410 380730133 380391350 380264740 380884895 381439209 381052246 380444031
2224 380444031 380049706 379848480 380073547 380394707 380527039 380564919 380498428 380354156 380147476 379900436
2234 379900436 379540672 379365921 379836311 380391617 380589256 380535355 380078545 379546890 379276505 379089584
2244 379089584 378856201 378766060 379057884 379453888 379786491 379960289 379737625 379374504 379002571 378755341
2254 378755341 378891716 379164467 379421692 379636536 379745712 379705429 379356155 378979187 378849487 378824692
2264 378824692 378866653 378937492 378994446 379012604 378987083 378811111 378293762 377681503 377118607 376721153 376787186
2275 376787186 376914024 376658440 376439095 376572609 376920700 377500992 378159027 378748398 379260063 379584541
2285 379584541 379875412 380296936 380707512 381036987 381232262 381189804 380990028 380558014 380255470 380519867
2295 380519867 381049156 381758690 382430077 382617493 382915268 383965263 385178337 386192780 386966476
2304 386966476 387233009 387301674 387566071 387506485 386465302 385248184 384162674 384042740 386277199 389506836
2314 389506836 393291016 396262665 396457901 395225525 393146744 390559921 387583961 385457535 386030655
2323 386030655 387586823 389432182 390346527 388254395 385025253 381403923 378686447 378984680 380594482
2332 380594482 383133659 384746094 382413139 379240265 378177643 376671562 373323898 367616196 357955475
2341 357955475 346164474 330125084 320065727 327627907 346452484 378721466 410452843 426531067
2349 426531067 432536354 426312447 415951958 410431366 404942741 396990280 388612289 381006241
2357 381006241 374198685 369070053 364253044 358036499 352331619 348806839 346476784 345162888 344110718
2366 344110718 342274666 340349197 338505020 337265472 337652435 338338623 337881317 337648621 338829994
2375 338829994 340515366 341947098 343857040 347033997 350549240 353643646 356597176 359475861 362160683
2384 362160683 364524384 366656075 368761520 370360146 370804291 370800743 370979538 370919952 370157700 369451752
2394 369451752 369614105 370018959 370252151 370487671 370811234 371072044 371162186 371035805 370447617 369885445
2404 369885445 369840393 370053787 370541573 370968590 370947838 370648613 369981308 369335175 369114151 369181862
2414 369181862 369660378 370175591 370322227 370313187 370260963 370058060 369577179 368987808 368334770 367864380
2424 367864380 367997398 368254662 368215332 368124008 368092041 368096123 368231277 368251801 367750397 367303391 367520103
2435 367520103 367891083 368100662 368173828 367976913 367667694 367304802 367049713 367210846 367403259 367268791
2445 367268791 367033958 366762619 366584549 366797218 366957893 366608391 366090317 365568886 365111847 364797821
2455 364797821 364758263 365325203 365974426 366277695 366275787 365738640 365047913 364485245 364118576 364159088 364457359
2466 364457359 365065346 365588913 365551949 365252266 364792328 364278793 363830795 363510590 363453636 363557091
2476 363557091 363816757 364072075 364139786 364083061 363878021 363602142 363290062 363044014 363006592 363091240 363336563
2487 363336563 363506317 363326302 362946510 362318993 361762047 361652145 361766090 362052193 362369537 362560272
2497 362560272 362623444 362454910 362203369 362006416 361793518 361474762 361244926 361330032 361542931 361794472
2507 361794472 362015953 362157364 362072716 361454468 360737305 360240211 360001335 360259285 360731354 361343384
2517 361343384 361706734 361177444 360446701 360066185 359809875 359586945 359540939 359868546 360318909 360738754
2527 360738754 361030350 361028671 360780258 360166321 359514236 359156609 358957748 358855743 358959198 359525452
2537 359525452 360045433 359994431 359676590 359196892 358627548 357923965 357539673 358179092 359044571 359545708
2547 359545708 359762421 359468231 358992081 358575821 358253479 358187447 358232727 358274460 358382721 358677139
2557 358677139 358893394 358720055 358415604 358148575 357875595 357559929 357350121 357396622 357656021 358270187
2567 358270187 358832588 358935585 358724594 358118286 357388268 356721420 356289139 356446762 356826553 357200394
2577 357200394 357502213 357578506 357461700 357023468 356589088 356508484 356576195 356693497 356889000 357272644
2587 357272644 357498169 357055664 356546173 356555939 356616020 356356850 356064072 355895042 355864525 356093407 356418381
2598 356418381 356809616 356985550 356499901 355813980 355202904 354777336 354757080 355086327 355989227 356844406
2608 356844406 357018242 356769791 356035461 355148773 354318390 353851776 354283829 355138321 356269112 357220154
2618 357220154 357424736 357068291 355906715 354661217 354027519 353837509 354270706 354979019 355781784 356353302
2628 356353302 356222878 355643501 354511719 353425026 353105545 353075485 352995377 353170624 354040604 354863396
2638 354863396 354919891 354580650 353790054 353107224 353238602 353683472 354225388 354716797 354840775 354888191
2648 354888191 355216026 355306168 354484100 353572845 353309631 353275070 353274117 353367805 353549728 353825073 354353409
2659 354353409 354664307 354110260 353379745 352978210 352806320 353008728 353358269 353700867 353960991 354017487
2669 354017487 353852272 353290558 352678757 352315903 352168312 352376709 352716904 352994194 353258591 353565674
2679 353565674 353702545 353361359 352880707 352499962 352206955 352048645 352085838 352505188 352975616 353263855
2689 353263855 353259811 352589836 351807594 351327438 351191750 351719360 352492828 353325119 353840599 353376160
2699 353376160 352604637 351965408 351495285 351477623 351608276 351585159 351685524 352264175 352786560 352753639
2709 352753639 352412949 351740112 351049881 350673218 350534439 350738754 351072540 351375351 351591835 351627808
2719 351627808 351439476 350840797 350162506 349668274 349373093 349405289 349687805 350275497 350900879 351366272
2729 351366272 351516953 350981712 350209007 349440079 348922005 349103203 349617233 350352783 350991020 351135025
2739 351135025 350904922 350074997 349282761 349262009 349495888 349706879 349907646 350027542 350038071 349883080
2749 349883080 349571686 349002609 348448524 348120689 348100662 348664284 349437256 350238800 350763321 350507507
2759 350507507 349881401 349020233 348242989 347960243 348032227 348563919 349230270 349849930 350096931 349299431
2769 349299431 348310928 347873688 347647667 347520103 347548485 347763290 348131638 348699570 349259148 349674950
2779 349674950 349773636 349141350 348363876 347913017 347716560 348011475 348340263 348201752 347963791 347896805
2789 347896805 347788811 347483864 347084274 346513748 346151123 346534004 347106476 347493172 347687492 347520103
2799 347520103 347100487 346416473 345662842 344925880 344517479 344923973 345705757 346780319 347560425 347237587
2809 347237587 346391220 345161438 344055901 343766937 343880424 344309311 344763985 344852219 344791412 344696274
2819 344696274 344480057 343994598 343537102 343450546 343446960 343358040 343167076 342805862 342258453 341462860 340489159
2830 340489159 339242706 338152161 337711563 337629089 337758293 338156471 338969727 339783440 340138435 340313416
2840 340313416 340368729 340498428 341025581 341622581 342011452 342363129 342833748 343186874 343253860 342983971
2850 342983971 342086067 341110687 340530853 340286713 340579529 341096153 341672173 342061768 341914902 341376305
2860 341376305 340267410 339205017 338877449 338888397 339031448 339423676 340376625 341097832 340607147 339776039
2870 339776039 339245071 338723907 338040848 337479820 337294083 337403526 337962379 338518372 338572998 338418236
2880 338418236 338105927 337856293 337980728 338254471 338550110 338883400 339321594 339582214 339300880 338788033
2890 338788033 338152390 337631454 337591896 337753296 337984085 338203659 338341713 338233490 337521782 336710205
2900 336710205 336225510 335940361 335926285 336013069 335999260 336049576 336315880 336632004 336941490 337066193 336641769
2911 336641769 336166840 336023102 336194267 336947670 337813873 338407059 338740845 338609238 338284988 338051567
2921 338051567 337667923 336850891 336009521 335474472 335197678 335361023 335603714 335612526 335425606 334884644
2931 334884644 334264984 333753128 333457489 333629379 334026108 334491501 335014572 335654755 336042862 335637589
2941 335637589 335014114 334598083 334296455 334171753 334181061 334278831 334533691 335162659 335675468 335491638
2951 335491638 335098038 334738731 334559669 334888916 335424194 335994949 336532822 336947212 337131500 336852798
2961 336852798 336396217 335872879 335570107 335923920 336598167 337534180 338335037 338475952 338279724 337811966
2971 337811966 337319374 337047348 337062836 337649574 338401566 339055557 339463959 339266548 338837395 338395348
2981 338395348 338044395 337982903 338143845 338615646 339128265 339443932 339553604 339462051 338887711 337192535
2991 337192535 335449677 334636688 334401131 334872017 335579147 336076508 336418610 336485138 336353531 335970154
3001 335970154 335606346 335527420 335696716 336240540 336934319 337720871 338222733 337918053 337182274 335999489
3011 335999489 335019608 335145950 335599174 335804710 336049576 336579819 336940308 336651802 336029778 335128784
3021 335128784 334250450 333685646 333519440 334181061 334928970 335136642 334886780 333828201 332633514 331876297
3031 331876297 331498642 331664810 332281342 333515625 334746132 335329781 335496902 335168114 334629784 334086647
3041 334086647 333701630 333866119 334099045 333950272 333716164 333526382 333430519 333617210 333796997 333767891
3051 333767891 333455086 332531929 331549644 330908051 330733299 331500053 332562447 333563805 334108124 333366623
3061 333366623 332278252 331485023 331045151 331340561 332039337 333072662 334032516 334423065 334436874 333990326
3071 333990326 333415756 332959671 332795143 333337555 334106674 334816933 335297585 335187912 334769745 334114799
3081 334114799 333492050 333190689 333218346 333762169 334569702 335634689 336405525 336080780 335402489 334940414
3091 334940414 334409485 333514442 332853546 333063126 333732147 334937592 335850945 335328598 334390869 333663712
3101 333663712 333183746 333316574 333700409 334063034 334498405 335109253 335596313 335690002 335401764 334466934
3111 334466934 333440781 332758408 332515945 333201180 334071159 334511261 334624062 334245911 333559990 332549095
3121 332549095 331648827 331335297 331469765 332168350 333141327 334341507 335156670 334734192 333747864 332428703
3131 332428703 331251602 330893745 330976715 331448555 332004547 332354317 332402725 331821442 331018219 330229988
3141 330229988 329640884 329515915 329848289 331032753 332127342 332086563 331613770 331091156 330434341 329577446
3151 329577446 328847160 328610191 328677177 329069862 329518318 329774399 329794159 329291344 328742981 328616638
3161 328616638 328652153 328758698 328892708 329014549 329018364 328706970 328313103 328029404 327777634 327538261
3171 327538261 327326546 327214241 327010880 326350441 325831184 326140175 326641541 326961517 326997757 326362381
3181 326362381 325537682 324855080 324379196 324325104 324569931 325153809 325800400 326355705 326491585 325474243
3191 325474243 324364891 324246902 324317207 324007492 323696136 323616753 323632011 323781242 323766479 323076248
3201 323076248 322387466 322321892 322531700 323002319 323354492 323060989 322548141 322138290 321613312 320773621
3211 320773621 319884300 319017410 318550587 319183121 320020447 320387115 320325127 319443474 318365574 317635536
3221 317635536 317099571 316755524 316691399 317111740 317663918 318115711 318307648 317871094 317197800 316576729
3231 316576729 315947533 315253258 314770927 314923763 315216541 315270424 315157166 314777851 314265251 313737392
3241 313737392 313138237 312214127 311673393 312515259 313610802 314113388 314175377 313505898 312587261 311763287
3251 311763287 311156044 311118851 311298370 311487923 311598778 311447144 311110268 310531616 309927940 309514046
3261 309514046 309238434 309040546 309161663 310111275 311020851 311021805 310621033 309985161 309266567 308701515
3271 308701515 308202019 307711830 307371140 307342300 307501316 307878971 308172455 308025589 307628155 306877365
3281 306877365 306291809 306587696 307066441 307243576 307189465 306751976 306112061 305296421 304612637 304545403
3291 304545403 304587841 304308662 303963184 303657532 303405991 303324471 303211441 302839050 302402725 301935673
3301 301935673 301693439 302162399 302682400 302731037 302378654 301311722 300156593 299614906 299144745 298250923
3311 298250923 297493458 297432671 297570705 297545910 297509918 297536621 297494888 297264824 296883106 296275368 295655251
3322 295655251 295252075 294943581 294678211 294471512 294373989 294228325 293907890 293368340 292421341 291369209
3332 291369209 290417442 289664993 289343109 289257526 289381256 289443741 289148331 288544884 287420502 286263695
3342 286263695 285619736 285102615 284415245 283834457 283622017 283523560 283442726 283166409 282300720 281288376
3352 281288376 280406723 279758453 279683838 279747009 279644489 279319038 278488159 277522316 276736984 276014099
3362 276014099 275269032 274713745 274706841 274723053 274261475 273607025 272854576 272072067 271319866 270712852
3372 270712852 270440102 270339012 270396461 270352840 269884834 269167175 268223763 267181396 266107559 265201569
3382 265201569 264698753 264556408 264914284 265458336 266113281 266302834 265040398 263479004 262472878
3391 262472878 261929741 262317181 262809029 262543907 262095222 261884212 261505356 260493755 259448776 258826027
3401 258826027 258591881 259069214 259641876 259706497 259545326 259199867 258787155 258446465 258151531 257950554
3411 257950554 257757664 257414093 257184982 257553577 257703304 256710052 255376587 254060745 253173351 253535042
3421 253535042 254271736 254716396 255066643 255343914 255407810 255051613 254494896 253782043 253229618 253358116
3431 253358116 253599167 253463745 253231525 252924919 252824059 253376236 254099846 254626999 255062828 255511761
3441 255511761 255604744 254920959 253718147 251662731 250104179 250833740 252189865 252996216 253586998
3450 253586998 253776550 253945351 254490376 255175362 255989075 256652832 256802559 256680965 256371021 255986443
3460 255986443 255631447 255414734 255580425 255823135 255727997 255867729 256959686 258152237 258823395 259000053
3470 259000053 258186111 257325172 257278919 257794151 259259701 260610104 260728836 260156631 258789062 257445107
3480 257445107 257015953 257180214 258186340 259214172 259227982 259121895 259564171 260194054 260946045 261600494
3490 261600494 261814117 261891842 261872768 262209663 263597965 265346527 267414093 268544922 266831627
3499 266831627 264185905 261514664 259922028 261708260 264188766 265318871 265477905 263760090 261976242
3508 261976242 261985550 262733688 263830414 265140533 266427994 267602196 268357277 269101868 270394325
3517 270394325 271479607 271744728 271319160 269728432 268168221 268186092 268249283 266910553 265458336
3526 265458336 264643898 264631500 266205311 268256187 270040283 271243572 270840416 270221710 270421753
3535 270421753 271484146 274255753 277361145 279928207 281290531 280212173 277528286 272711983 268610954
3544 268610954 268629551 270569077 274162064 277016411 275529137 273062229 271746407 271668911 274357796
3553 274357796 277621040 279417267 280822525 281912575 283645153 287755241 291985512 295712242 295769691
3562 295769691 286639938 274753094 263472557 256480217 261159420 269768944 277039051 282935619
3570 282935619 285002232 285234928 284567604 283727875 283895969 284645081 285573483 287782669 293006897
3579 293006897 298943748 304954300 307779789 302579403 293460121 280540466 270944118 274710655
3587 274710655 283207893 292134514 298536777 295784950 290603867 287821770 286495934 288167953 290212860
3596 290212860 289674282 289087524 289843788 292417526 299139500 305829048 309005966 308898697 302894592
3605 302894592 296034813 293136368 292258034 293570290 295552025 295834541 297130585 303804626 308530331
3614 308530331 303264847 294519424 284340382 278079510 283720245 295410881 311892281 327367554
3622 327367554 336664658 336649170 318123817 294103622 272333622 259424210 271163216 287762871
3630 287762871 291368713 291966438 293860207 296239128 300429115 304322968 304994812 306224098 311258087
3639 311258087 318766594 329941521 340461502 348621826 347764511 325184097 297317734 275391808
3647 275391808 262329330 268820763 282790413 297473431 307626247 301434994 291845798 288768768
3655 288768768 289497604 296395302 304164162 306572189 308783760 314432621 321876984 332746735 340858688
3664 340858688 339306831 331887474 316501617 303926945 309148312 317442665 320028076 314065456
3672 314065456 285183907 259193897 264611721 278946152 287325859 295404205 303837299 312743912
3680 312743912 323357086 332988968 341171989 342477570 327766190 307701588 288250198 274363518
3688 274363518 276145706 284102917 291943550 300162315 307252159 312924862 316290379 317646980 317436695
3697 317436695 314338207 304284821 295953522 298491955 306420326 319295406 331152916 335837860
3705 335837860 333475838 319572220 301831474 284827709 273456345 276659012 286870480 301085472
3713 301085472 314564228 320203781 322086334 321837425 319722652 316482544 312316895 307087898 302546978
3722 302546978 300031185 300642738 306503773 315888405 331003418 342169762 337502975 325825462
3730 325825462 311526070 296017876 279841652 270001640 276076088 290880432 313749313 334700089
3738 334700089 342795372 340230942 320388794 298771133 289479733 290095329 311390648 327891350
3746 327891350 307744980 280858517 268481731 264731178 273237000 286705971 300558567 310280800
3754 310280800 306679955 299212933 293939362 291855087 297968140 306300163 312879086 316691170 313796997
3763 313796997 308999290 307075272 304159393 295706978 288530579 289055347 293895950 303305626 312791595
3772 312791595 317545662 318767071 315307846 309401283 301501999 295795441 299132576 303968906 303916931
3781 303916931 302355289 299924622 298450241 300879250 304485092 307089577 309993267 314335098 318419685
3790 318419685 320769310 321869850 321233978 320301781 321401596 321378708 318037262 310828209 294145107
3799 294145107 280962467 288023224 298414001 298999557 295185089 284166107 277434826 290344009
3807 290344009 308506966 322881927 332784424 333286743 328076859 316816330 306655884 308273792
3815 308273792 310748329 305400124 296178093 280248413 269279480 279453278 294395676 301402817
3823 301402817 305644760 307318459 308638344 313142548 317054272 316220512 315307846 319775105 323089371
3832 323089371 319737663 312116623 298537254 285740852 281387806 281028976 283249626 286606789
3840 286606789 287761459 290987244 300048599 313133717 332117081 349703064 360963593 360669365
3848 360669365 337508202 304798851 266818771 239379158 247096539 267830620 287998428 306543579
3856 306543579 317248573 322010498 319281578 313176632 306377411 301635017 304578304 309252739
3864 309252739 312525749 311557045 298612823 285238495 282428741 284100056 288028717 293630371
3872 293630371 299480209 305872192 314538956 319738865 313071728 304244518 301438808 300829411 302538643
3881 302538643 302902451 294836998 288723469 296859512 306409111 307144165 303536186 293662548 286477318
3890 286477318 293315887 305110703 317655087 327701111 329658966 326345215 317559242 306759605
3898 306759605 297753334 289292564 280281544 274067650 274405956 278975010 288099766 297594795 302244415
3907 302244415 305460930 309419632 312612305 314434776 314349174 311041603 306233406 300293446 295963058
3916 295963058 297549248 300723305 302533627 303155670 300927162 298409233 297556877 298525333 303727627
3925 303727627 308345318 307347527 303784847 298130512 293083420 291976204 293380260 297787189 302768478
3934 302768478 305807838 307657471 308316002 307527065 304282417 300833225 299206734 299065113 301805019
3943 301805019 304249287 302620659 300115585 298795471 298285713 299228439 300633430 301733971 302498589
3952 302498589 302374840 302157631 302775154 303274155 302869320 301984787 300501595 299262524 299242496 299924374
3962 299924374 301344395 302816162 303516388 303889275 304210663 304160347 303324471 302259674 301357994 300699463
3972 300699463 300573578 300740967 301155090 301526299 301482201 301222324 300680389 300281754 300561428 301121483
3982 301121483 301832199 302421341 302456131 302287102 302137604 301952839 301755180 301532974 301289558 300999641
3992 300999641 300466309 300207615 300925255 301870117 302532921 302893162 302530289 302132835
4000 302132835
##END=$$ End of the data block
