##TITLE=$$ Begin of the data block
##JCAMP-DX=5.00 $$ ACD/SpecManager v 10.08
##SPECTROMETER/DATA SYSTEM=16PC
##DATE=Mon Sep 30 10:13:12 2013
##DATA TYPE=INFRARED SPECTRUM
##DATA CLASS=XYDATA
##ORIGIN=
##OWNER=
##NPOINTS=3601
##FIRSTX=400.00000000
##LASTX=4000.00000000
##MAXX=4000.00000000
##MINX=400.00000000
##MAXY=48.54919815
##MINY=23.72622490
##XFACTOR=1.0000000000
##YFACTOR=0.000000100000000
##FIRSTY=39.59841919
##DELTAX=1.00000000
##XUNITS=1/CM
##YUNITS=TRANSMITTANCE
##XYDATA=(X++(Y..Y))
400 395984192 390025635 396373978 426511765 451482773 435885201 410538445 397643814 387652397
408 387652397 377443314 369933357 367609482 368637810 371182213 377735596 391017189 408509254
416 408509254 432825089 451290131 449097633 435256233 409230728 384844780 378455162 381924400
424 381924400 395427704 410382042 417659531 419067383 410887947 400568237 394318810 392127991
432 392127991 399445038 406096954 401025543 392333031 384305496 377332230 372892838 372001648 378315430
441 378315430 385385513 386723022 386103859 385004768 383831749 383692741 383955727 384671211 384898415
450 384898415 382293701 381114502 386441002 393459320 399843216 403209915 398715248 391414185 384310722
459 384310722 378710518 377423782 378939857 383585701 388657341 391015778 392290115 392892838 393333435
468 393333435 394502411 395668259 396518250 396686325 394984016 393563995 394681931 396837463 399193039
477 399193039 402013054 405673027 408999214 410765152 411504288 411055794 410272598 409428101 410098572
486 410098572 415733337 420983315 420189857 417728653 416779518 415269623 410942535 407528877 409182549
495 409182549 412374268 415365944 416935196 414323578 410400391 406751175 404466629 406100998 408848038
504 408848038 410743713 411813507 411089401 409586678 407901039 406322021 405078659 404946556 407684555
513 407684555 410570869 411426544 410378952 405482063 400775185 400558929 402103195 404211044 406580925
522 406580925 409149170 410004387 405690689 400774231 399277687 399375458 400929222 402897835 404085388
531 404085388 404816132 405329208 404680710 401622543 397304993 391595383 387091866 387412071 389362564
540 389362564 391385803 392189026 388180733 384698639 388022652 391734352 390148888 387344360 385051498
549 385051498 384625664 389849434 395169983 394607315 393224487 394655457 397207260 400881767 404225845
558 404225845 405615082 405563812 403817673 401055832 397203903 394267807 395292740 397083511 397092094
567 397092094 396419525 395196915 393783112 392830353 391587753 388746490 386630058 388048401 390231857
576 390231857 391339302 391394386 389101257 386575699 385778885 385876656 386971474 388212929 388468971 388686905
586 388686905 389862785 390717010 389796982 388617744 388299484 388573875 389616470 391214828 393758316
595 393758316 395616074 394440880 392769585 392841568 393200378 392371178 392647018 397547226 401916046
604 401916046 400264282 397111168 395334702 394366760 394812584 396029701 397832642 399452438 399609070
613 399609070 399650574 400961647 402150154 401908417 401367912 401127319 401474953 403458099 405396233 405702362
623 405702362 405140877 403352013 402120361 403568726 406320801 410315742 413728714 414239159 413273315
632 413273315 411147842 408869514 407476425 407190781 409457932 411645432 410653114 409327011 410230865
641 410230865 411109467 409808884 408588181 409566650 411009064 411677589 412198296 413046112 413433304 412506561
651 412506561 410936127 408627014 407017937 408006897 410119781 413201103 415190926 412905197 409558792
660 409558792 407238464 406141281 405949821 410293121 429397125 443153381 427098274 404520035
668 404520035 390919685 385192146 396177292 409538727 411072960 409218788 407677155 406455040
676 406455040 407378197 408690453 409000854 409037819 408998947 409085045 410108337 410429955 408551941 404862900
686 404862900 398167114 391717186 389313698 388116837 385834694 384623756 386589508 389591675 391619453
695 391619453 394389153 399782639 405290604 408496857 411001205 413932343 416285515 417348862 417372475
704 417372475 415865173 414338608 414474487 415267715 416705856 417489281 415692329 413177948 411389351
713 411389351 409660339 407417755 405823212 406262398 407488823 408748398 409947891 410505066 411132088
722 411132088 412565231 414148331 415368805 416530838 417935600 419079056 419470787 419370193 418805351
731 418805351 417977333 416848412 416161041 417126884 418297997 418348541 418121567 418172836 418038597 417164078
741 417164078 416375389 416453133 416978607 418342133 418896904 416381111 413029900 410452347 408263702
750 408263702 406957169 405505409 402388573 399577637 399221649 399265289 397915840 396531105 395861397
759 395861397 395936241 396940002 399157028 403404007 408267517 412865410 416417351 417295227 417160492
768 417160492 417052040 417209167 418519974 420074692 421233902 422072639 422416916 422374954 421695938 421281586
778 421281586 422413597 423699379 424009094 423835983 423211594 422389526 421588898 420941353 420583496 420717468
788 420717468 421932945 423203468 423590660 423418274 422240486 421426048 423035126 424546013 423388252
797 423388252 421767006 421250572 421178589 421773186 421952477 420164566 418041229 416618118 416130066 417595863
807 417595863 419696579 421585808 422864456 422445755 421542664 421447754 420832138 417969704 415341873
816 415341873 415755768 416506767 415547867 413709869 410954247 407842636 404979935 402196426 399381409
825 399381409 396961441 395716171 394475479 392106056 389273872 386153450 383083344 380071869 378284225
834 378284225 379051208 381881485 387334595 393587112 399049988 403579483 406188736 407817841 409044495
843 409044495 409968147 410913010 411778946 412629356 413296471 413501282 413640251 414160233 414628525 414572220
853 414572220 414556046 415052414 415863991 417092323 418310890 419034729 419537544 419824142 420213928 421395302
863 421395302 422265549 421460381 420449257 420524597 420850525 421057472 421035995 420271645 419607620 419954529
873 419954529 420594215 421339760 421507607 419929962 417871704 416084061 414938927 415307274 416441917
882 416441917 417975655 419638634 421044846 422172546 422714462 423138390 423863640 424727936 425859222
891 425859222 426804543 427039642 426905861 426358223 426030884 426717529 427891731 429430008 430916557 432000656
901 432000656 432360878 431056252 429594765 429452896 429781189 430213699 430773010 431380272 431970596 432531815
911 432531815 432825546 432510147 431882858 430886765 430242538 430893402 432112198 433725128 435014954 434803467
921 434803467 434297791 434514542 434845924 434963684 435044289 435200462 435292015 435227890 434970627 434294472 433671951
932 433671951 433523407 433778763 434736023 435709000 436054001 435940971 435154686 434204102 433465233 433119278
942 433119278 433807602 434524994 434181938 433672180 433638802 433742294 433837433 433981400 434168816 434441071
952 434441071 435000420 435357819 434850922 434199562 434106369 433960419 433238258 432380905 431600342 431059837
962 431059837 431225777 431398392 430863876 430130730 429444313 428880463 428746223 428593140 427859802 427191238
972 427191238 427075615 427423019 428413162 429723282 431236267 432513008 432874680 432922363 433110008 433197975
982 433197975 433076630 432807465 432317009 431899796 431916733 432094116 432291031 432469597 432647247 432515869
992 432515869 431529541 430419693 429842224 429475060 429291496 429058304 428467026 427715073 426679840 426009903
1002 426009903 426643372 427587967 428196411 428370972 427471161 426474800 426407089 426485519 426366348 425758362
1012 425758362 423884888 421856880 420633774 419890633 420030136 419828644 417770386 415132523 412654419
1021 412654419 410433044 409053078 407791138 405866623 404033661 403089752 402122498 400135040 398177643
1030 398177643 396884689 396503220 397979279 399847488 400508423 401310692 403419495 405785789 407554169
1039 407554169 409307480 411422501 413660507 415966492 418163528 420082321 421642532 422687302 423275948
1048 423275948 423269997 423103333 423176994 423451424 424281120 424882660 424236755 423404465 423146744 423344116
1058 423344116 424246292 425505638 427158813 428300133 427572479 426366577 425713043 425333023 425480118
1067 425480118 425583839 425035477 424199829 423054924 422149658 422063103 422678947 424436111 426246414 426976433
1077 426976433 427199135 427138557 426706314 425565262 424683800 425243835 426266174 427176704 427940140 428195496
1087 428195496 428343544 428761482 429156532 429370651 429376602 429048309 428523560 427911530 427170753 426189651
1097 426189651 425284386 424860001 424536476 424101334 423453827 422353973 421004524 419409981 417923203
1106 417923203 416871300 416333923 416661034 417365074 418035049 418791542 419600487 420512428 421661835 422760239
1116 422760239 423507919 424070129 424567451 424832115 424620628 424277534 424077263 423985977 424085388 424301147
1126 424301147 424645195 424940567 424944382 424863091 424736252 424820175 425537834 426426163 427223663 427745361 427538643
1137 427538643 427144051 427173386 426960220 425567169 424416313 425072174 426169624 426842461 427156219 426686058
1147 426686058 426035881 425750961 425582428 425576706 425389786 424493561 423485527 422950287 422396660 421442757
1157 421442757 420342941 419069061 418084641 418032875 418346176 418771973 419005165 418482056 417725563 416940231
1167 416940231 416517487 417114983 418137054 419321785 420325775 420557747 420496712 420580864 420338135 419132004
1177 419132004 417891273 417363396 417453995 418683281 419952621 420269966 419832954 418390999 416296234
1186 416296234 413774261 410953522 407850494 405027161 402677994 401920547 404575119 408724289 413282394
1195 413282394 417575111 420337448 422255745 423580170 424351463 424506912 424605141 425384521 426239471
1204 426239471 426756134 427097549 427317390 427326431 426950684 426497955 426198502 426108589 426560402 426954498
1214 426954498 426628342 426103821 425717583 425361862 425058594 424752731 424448242 423986664 423198471 422117233
1224 422117233 420599709 419005394 417855988 416519623 414395332 411911469 409289131 406546822 403948784
1233 403948784 400978546 397106171 392634163 387624512 382267952 376813660 371144791 365017662 359062195
1242 359062195 353708496 349311371 346155167 344880829 346592178 350183029 354847908 360785484 368307343
1251 368307343 376269341 383537064 390391846 396829834 402570724 407380333 411114922 413336754 414693108
1260 414693108 415697823 416313171 416615715 416774292 416858902 417238960 418546906 420063477 421291809
1269 421291809 422196884 422432899 422435036 422618408 422696114 422445526 422089348 421915054 421503067 420527687
1279 420527687 418993721 416659851 413936615 411107063 408312073 405741692 403531570 401628952 400788803
1288 400788803 402334442 404505234 405800591 406763077 407532921 407815475 407027740 406174164 406236877 406698227
1298 406698227 407232742 408242455 410250435 412565002 414615402 416559677 418567886 420030365 420041084
1307 420041084 419656754 419914246 419966202 418916245 417947769 417951813 418908615 421786079 424508820 424712410
1317 424712410 424228897 424080620 424330940 425759811 427238922 427650452 427742729 427976151 428093910 427976151
1327 427976151 427671204 426947098 426525116 427222252 428515930 430215378 432138901 434540977 435919762
1336 435919762 434470901 431352844 425995598 421777954 423421631 426328201 426832199 426853180 427268753
1345 427268753 427539368 427295227 426902046 426506271 426394463 427235374 428028336 427829018 427137146 425633659
1355 425633659 424828529 426714897 429522743 433130493 434582710 429043541 422029037 417261124 415283432
1364 415283432 419991493 425050278 423274765 421106796 423841934 427734375 431663971 433047791 426337967
1373 426337967 419305573 419627686 422038078 423709869 425000191 425057411 424679756 423890839 424161453
1382 424161453 428582191 432315102 430483818 426293602 419920425 415575752 419090729 425779343 434930573
1391 434930573 440448990 431418190 421588440 424988022 429864883 427246552 422820816 418310890 416636963
1400 416636963 424644241 432277451 428863068 423100471 420606384 419951935 422675629 425491562 424592247
1409 424592247 423080215 422897568 423718224 425601959 429331284 438780785 444732895 435703049 422365646
1418 422365646 409920692 403306007 415087471 427580109 421638947 414208183 419435501 426562309
1426 426562309 429090500 428383827 421154976 414857140 417389641 424125214 437297821 444219589 425531845
1435 425531845 403479576 396585693 396656761 403784523 411634445 411577950 410588036 414301147 418098221
1444 418098221 419529915 417719841 408042908 399295349 401333313 406351547 406731834 411767235 437337418
1453 437337418 456063271 435781479 406722298 389565964 380796204 386354675 398546944 414973488
1461 414973488 425688515 413420448 397745857 394611359 397634735 406726837 418951988 435329895
1469 435329895 443902016 424953918 402770767 399693489 401836853 401560059 402467499 406502228 411004562
1478 411004562 414101830 415374031 411660919 409307938 416323891 424556732 427975159 428223610 425440292
1487 425440292 418111572 399916649 385412941 391774673 404830475 418280602 425681343 413764229
1495 413764229 396700630 385610123 376379738 367952347 362278938 361437073 363989601 374593277
1503 374593277 377041321 345002174 313506851 315327873 330905685 354416351 377423286 384555359
1511 384555359 390791893 412730446 430143356 419566154 407305222 419126282 433186760 434669037
1519 434669037 428264389 407262802 391049156 406733284 424427490 415341606 403290977 405369263
1527 405369263 412950745 425282478 435837746 437026978 431285629 410968552 398724556 426365623
1535 426365623 458753586 469634056 464164963 428315163 393395424 396000366 406247139 401151199
1543 401151199 396608810 403968086 413888931 420822144 424740067 421180954 417894821 424154282 430929909
1552 430929909 426805496 428211937 462864876 485491982 441223145 386565933 364026070 360735664
1560 360735664 387129059 415804863 414153595 408232193 418725243 429140320 428629875 420942764
1568 420942764 399937630 384437103 399516106 420274963 430969696 429207306 396748314 365386505
1576 365386505 369081955 383093834 393465271 401803513 403390656 403242340 405782471 408065071
1584 408065071 408175964 407441139 406673431 405495415 403372765 401586533 402009735 402331848 400079498
1593 400079498 397614479 396852264 396657715 396709900 396478653 395143051 393251877 390605202 388627052
1602 388627052 389216652 390748520 392660141 393658638 391544800 388471603 385210495 383704681 386695633
1611 386695633 392558098 405921478 410759926 382269135 351411819 345824471 350680122 364299545
1619 364299545 374873886 364628563 349780312 340758820 337150345 345890503 355359077 351606598
1627 351606598 348554611 358070831 372365494 389979362 403785934 405877609 397135735 367292404
1635 367292404 341887474 352410316 370743752 374817619 377979507 388006668 399540176 413473358
1643 413473358 418825607 395825882 371737480 369369278 382310867 425668259 457700005 424834747
1651 424834747 377667923 350212097 338642578 358712425 385699501 396014709 402009735 411111107
1659 411111107 414504547 399996758 385151138 386317253 394941101 411495438 425247192 422730446
1667 422730446 412614822 393812904 382129669 404133797 426445732 415710449 398419876 390845528
1675 390845528 390291214 403311234 418424149 422400970 427037239 451138992 460445633 404858093
1683 404858093 350697746 365724792 395521622 402763367 403929482 400389175 400148392 417201538
1691 417201538 434950104 439971466 436732063 418890457 405446548 427198181 442407837 400167465
1699 400167465 358785629 374954224 402615051 410658836 410929184 401515007 392568130 396845818
1707 396845818 404617081 409284592 414203873 421239853 428267250 435685387 437785378 426555862
1715 426555862 409302216 386301270 370626907 382874489 400753975 406022301 407130737 405176163
1723 405176163 403975258 409902344 416377792 416989822 417605896 423075180 430038452 442848434 443215599
1732 443215599 396879654 356105347 379474182 413774033 418523064 414110413 405539742 398482819
1740 398482819 403753281 410926094 410697708 410516968 417435646 423340302 421211700 414818535 403654556
1749 403654556 393522987 390384903 393260002 407800446 420069923 411796112 401639481 406358948
1757 406358948 413384209 415594559 413398514 400124321 389890442 400481720 414226990 416357994
1765 416357994 415949326 417733688 419967194 425340195 425282249 405313492 385852585 387435913 395228615
1774 395228615 400320511 405471077 411969681 415313263 407779694 400315514 405266533 410709381 405462036
1783 405462036 399646530 400747299 405492554 414986610 423584442 426232109 422257919 403872719
1791 403872719 387371788 391513367 401118774 406197548 409940948 412836075 413002968 406778564 399997482
1800 399997482 398049850 398602257 401789436 405594101 407740097 409136772 410425186 410132904 405744095
1809 405744095 401026726 399253845 399393806 402534027 405589104 404838333 403272858 402702560 402948151
1818 402948151 404364090 407156448 413836708 417842865 409207840 400657196 405557632 412015457 411587715
1827 411587715 407285919 396183739 387651215 394282341 403478851 405024033 404365311 403625946 402559509
1836 402559509 400373230 400825958 410480728 420132637 422559967 418374786 400603294 384780159
1844 384780159 389597893 398607712 399195671 398547173 400543213 402480850 402411232 401950836 402299156
1853 402299156 402757187 403038750 403101425 402725220 402154694 401393661 400943756 401075821 402485619 406865845
1863 406865845 411496162 415361633 415035706 403140564 390514145 387121658 388200531 393635750
1871 393635750 399448624 400523911 400152664 400070190 399827232 399541855 399244766 398897400 398824692 399711838
1881 399711838 400439491 399101982 398741722 403903008 408174286 404754181 399353981 395002594 392944336
1890 392944336 397675514 402465820 400083084 396528244 396112671 396673203 397533875 398542404 399345398
1899 399345398 399867783 399697304 399490128 399894257 400519867 401555557 401911736 399994125 397502899
1908 397502899 395401955 394304047 395410767 397916794 402388077 405911674 405044556 401940346 396181335
1917 396181335 392037888 396340866 400990257 397992630 393858910 393168945 393719444 395168762 396509628
1926 396509628 396150131 395501137 395676117 395972748 395958405 395935287 396176834 396333237 395717850 395611534
1936 395611534 397633553 400080910 402494888 402760010 396274109 390035172 391619453 394689102 394446869
1945 394446869 393846741 394695511 395637054 395624886 395534973 396290054 396702042 395307312 393854141 394046783
1955 394046783 394552689 394428978 394209137 394103279 394137878 394397278 394914398 396297455 396901855 394341240
1965 394341240 391447792 390578041 390770187 392253647 393811455 394022217 393728256 393217316 392729988
1974 392729988 392685890 392834663 393199463 393378029 392784843 391993027 391259689 390945892 391906967 392916183
1984 392916183 392577896 392250786 393357048 394309998 393880844 392416954 388915558 386196136 387917023
1993 387917023 390559196 391450424 391705284 391530533 390977402 389900665 389093857 389677773 390525093 390753975
2003 390753975 390746841 390664825 390288849 389171143 388156166 388133545 388519287 388977051 389652977 390975494
2013 390975494 391758423 390347710 388572922 387897949 387763519 388308296 388899803 388757477 388461838 388376465
2023 388376465 388369789 388499985 388558388 388241997 387889404 387777786 387788048 387959709 388092041 387935181 387672653
2034 387672653 387328148 387128105 387545586 387863617 387341003 386520386 385638008 384868851 384542694 384428749
2044 384428749 384343147 384473076 385161400 385753632 385439377 385028381 385312080 385532608 384964714 384301414
2054 384301414 384068260 384039650 384142876 384444008 385172615 385762939 385619659 385060539 383997192 383051872
2064 383051872 382951012 383291016 384082069 384808044 384796867 384526024 384256592 383965721 383663635 383509865
2074 383509865 383764267 384133835 384405594 384599228 384637833 384595413 384528656 384408722 384148102 383977165
2084 383977165 384197006 384504547 384769897 384773026 384033928 383200417 382814636 382712860 383062363 383411636
2094 383411636 383191338 382920990 383036842 383217812 383276711 383246651 383006325 382829208 383056412 383360367
2104 383360367 383547554 383556824 383097878 382662277 382755051 383042107 383456955 383700867 383266907 382712364
2114 382712364 382492523 382405281 382366180 382476807 382895470 383364449 383681068 383837204 383698959 383440742
2124 383440742 383239975 382951736 382327805 381852150 382127762 382548561 382650375 382607956 382426758 382150421
2134 382150421 381753922 381445656 381453285 381691933 382264366 382833481 383077621 383052826 382644653 382041702
2144 382041702 381330719 380701294 380415916 380342484 380468826 380695572 380952835 381139297 381023865 380925179
2154 380925179 381181488 381501198 381702194 381791115 381693840 381469498 381206970 380741577 379686127 378796349
2164 378796349 378916740 379391174 379900932 380275726 380150070 379790535 379287949 378801117 378449669 378440857
2174 378440857 379282455 380191345 380418777 380368004 380235443 379892349 379064789 378383408 378604431 379076462
2184 379076462 379377136 379574280 379549751 379439583 379320602 379251480 379321098 379514236 379901161 380312920
2194 380312920 380618591 380773773 380641479 380365601 380030861 379675636 379368553 379100571 378861427 378721466
2204 378721466 378789673 378938675 379148712 379205933 378705521 378198166 378242264 378409157 378478050 378381271 377866516
2215 377866516 377264977 376828918 376542587 376498451 376623383 376905899 377252121 377592812 377839088 377824059
2225 377824059 377710114 377600670 377503624 377515068 377472382 377154579 376832504 376729965 376766663 376973152 377237549
2236 377237549 377509842 377631912 377326012 376901169 376570702 376341324 376333466 376416702 376508255 376583328 376565208
2247 376565208 376527328 376531830 376532326 376532555 376442680 376090279 375724068 375558624 375521660 375649948 375829468 375953674
2259 375953674 376036644 376056442 376013527 375880470 375715485 375508537 375434875 375855217 376199722 375894547 375310669
2270 375310669 374557266 373845825 373467445 373292694 373339882 373455772 373440514 373451691 373537064 373825073 374575615
2281 374575615 375439873 376121063 376720200 377209167 377677193 378296852 378787041 378838539 378705254 378548851
2291 378548851 378336182 377972832 377802353 378332596 378973236 379259338 379319687 378900986 378684044 379410515
2301 379410515 380641708 382432480 384041557 384608269 384544373 383915176 382899055 381513596 380305786
2310 380305786 379602203 380078812 383193512 386926880 389801025 391646385 391459465 390261154 388934631
2319 388934631 386889229 382842293 379750748 381345024 384019394 385335693 385518570 383754959 380718956
2328 380718956 376009941 372036705 371889839 373119812 374635468 375449905 373359680 370921364 370845795
2337 370845795 370465050 368253937 363491783 354356041 342624664 325681686 314883232 323472252
2345 323472252 343169441 374360085 404289970 418140182 422487488 416864624 407583237 402360191
2353 402360191 396512260 386209030 376607170 373236656 371145706 366990089 361475220 353201370
2361 353201370 345138092 340263138 337150345 335536499 334906807 334965706 334790230 332727661 330669632
2370 330669632 330149879 330585937 332124252 334111710 335871201 337620506 339179268 341061821 343861351
2379 343861351 347157707 350808372 354572754 358304253 361578712 363789062 365334740 366383324 367020378
2388 367020378 367335548 367481232 367653618 367810745 367972870 368148079 368406067 368581314 368507843 368256569
2398 368256569 367763748 367265244 366921425 366892090 367603073 368413467 368801575 368834724 368284454 367513199
2408 367513199 366717567 366163254 366331825 366771698 367206345 367589951 367829094 367789497 367190361 366377602
2418 366377602 365470657 364865074 365257034 365860939 366049995 366042633 365779648 365464439 365315208 365226021
2428 365226021 365148087 365127792 365241280 365348358 365312347 365196457 364986191 364774704 364571075 364613037 365448723
2439 365448723 366153488 365665665 364944687 364720116 364616394 364510765 364372253 364078064 363779297 363617668
2449 363617668 363498459 363325348 363245010 363494415 363704224 363431931 363132706 363205681 363373260 363529663
2459 363529663 363557091 363208542 362762451 362401009 362164268 362236023 362366676 362326126 362238884 362171402 362065315
2470 362065315 361867905 361624947 361335526 361083984 360976448 360945930 360972176 361018410 361058006 361038437 360856781
2481 360856781 360635986 360464554 360341797 360307693 360324860 360433578 360440979 360013237 359611740 359684944 359934311
2492 359934311 360297203 360513687 360160828 359662781 359299660 359080086 359210510 359375229 359255295 359065056
2502 359065056 358923683 358797531 358712921 358606110 358403931 358160973 357859612 357641678 357682724 357862701
2512 357862701 358156204 358453293 358679771 358702660 358236542 357662659 357249985 357049217 357315063 357704620
2522 357704620 357944260 358077545 358039131 357881088 357591858 357293129 357104301 357017059 357158203 357240906
2532 357240906 356916199 356497040 356184006 355962296 355900536 355948944 356084366 356292953 356622238 356862068
2542 356862068 356725235 356489906 356414795 356268387 355754852 355323792 355451126 355760117 356071472 356268387
2552 356268387 356115341 355788231 355272522 354903221 355236282 355594177 355306854 354906082 354731789 354687195
2562 354687195 354842186 355034828 355070572 355113754 355340958 355517159 355404358 355186234 354964027 354744415
2572 354744415 354572525 354434013 354337692 354257126 354180107 354069481 353826523 353621483 353598595 353736877 354190826
2583 354190826 354575157 354418526 354131470 354045868 353924522 353559036 353194733 352995644 352994461 353409767
2593 353409767 353846779 353936424 353818169 353384476 353006134 353151779 353419075 353548279 353577614 353364487
2603 353364487 353191147 353454819 353666077 353286285 352856636 352850914 352931252 352846375 352808456 353038330 353256454
2614 353256454 353199463 353036880 352825890 352637291 352592010 352596741 352597008 352597733 352609406 352559090 352349281 352061043
2626 352061043 351677170 351393929 351475487 351700287 351998100 352179527 351928253 351555328 351240616 351058235
2636 351058235 351213226 351490250 351758728 351967583 351979256 351919899 351904869 351828575 351537476 351287842 351352234
2647 351352234 351526718 351714630 351865311 351860046 351805687 351813316 351747742 351424713 351099968 351014633 351028671
2658 351028671 351128082 351174355 350979805 350676765 350228081 349953880 350371132 350851784 350825081 350635300
2668 350635300 350393066 350224991 350360146 350600739 350844612 351031075 351047516 350946884 350724716 350437622
2678 350437622 350109825 349833717 349737892 349736214 349787216 349885216 350094795 350162964 349716187 349179993 348848114
2689 348848114 348741074 349118233 349553604 349636078 349577675 349439392 349261780 349059105 348968506 349303741
2699 349303741 349545975 349038620 348507156 348611832 348891258 349112740 349250336 349144440 348961105 348784943
2709 348784943 348698120 348941803 349121323 348756332 348344345 348327866 348390350 348262062 348242989 348679771 349159470
2720 349159470 349330673 349351883 349273224 349066010 348643532 348227272 348072052 347990761 347872238 347740898
2730 347740898 347570648 347399216 347244263 347138634 347100487 347188950 347556839 347937813 348064423 348092575
2740 348092575 348084221 348051796 348030319 348013649 348091125 348010788 347342987 346708298 346768379 346968422 346863976
2751 346863976 346783638 347020645 347235680 347074966 346873512 346901665 346997032 347095947 347170105 347161293 347093811
2762 347093811 346933136 346795082 346835365 346897354 346839676 346769562 346774826 346771240 346673737 346569519 346522331 346516838
2774 346516838 346632957 346648941 346226196 345792999 345745811 345838776 345992813 346101532 345978012 345781784
2784 345781784 345584641 345461349 345558395 345732193 345922699 346025925 345834961 345595360 345473785 345496407
2794 345496407 345890999 346217880 345973244 345574608 345324020 345062714 344711075 344331741 343890915 343596687
2804 343596687 343734016 344035645 344378242 344611168 344509850 344171066 343476295 342844238 342779617 342905998
2814 342905998 342959633 343106995 343552361 343917389 343763351 343474159 343292007 343202820 343430023 343502769
2824 343502769 342835197 341994057 341431847 340905418 340235214 339680672 339611053 339515915 338817368 338087082
2834 338087082 337708244 337666016 338222733 338929176 339354019 339703789 340055237 340365639 340701828 340808868
2844 340808868 340275536 339635849 339309921 339228401 339645157 340010643 339665184 339189529 338991165 338928452
2854 338928452 339026222 339191666 339330215 339472275 339718590 339763184 339106064 338427315 338393440 338541489
2864 338541489 338613968 338659515 338635941 338556747 338408470 338230133 338092346 337884178 337394257 336992989 337123413
2875 337123413 337353935 337359924 337263565 336987000 336804886 337092400 337466469 337614517 337699432 337813606 337855568
2886 337855568 337691803 337509384 337506294 337517014 337416649 337280273 337143669 336997032 336818695 336680183
2896 336680183 336654892 336714020 336860886 337070007 337411880 337601662 337275734 336740494 336162338 335596085
2906 335596085 335058937 334826965 335368156 336121788 336693039 337051392 336879730 336640358 336806297 337025146
2916 337025146 337075729 337034683 336842537 336683731 336861839 336957703 336551208 335948944 335283508 334656944
2926 334656944 334204903 333955994 334081421 334286919 334295731 334225883 334053993 333923798 334055672 334196320
2936 334196320 334027786 333962440 334455719 335060120 335516930 335714798 335304985 334738731 334295998 334141502
2946 334141502 334788322 335471382 335458298 335160980 334618073 334216843 334556351 335039368 335232010 335240860
2956 335240860 334912796 334592094 334644318 334849129 335203896 335420837 335069199 334573746 334144135 333994370
2966 333994370 334635239 335386276 335597267 335687180 335848312 336110115 336724510 337212563 336956482 336622696
2976 336622696 336854210 337100525 336829681 336627235 337102165 337651024 337847481 337769012 337183228 336591949
2986 336591949 336633911 336664200 336095352 335390816 334803352 334375153 334338684 334373245 334133606 333923798 333963852
2997 333963852 334158669 334572296 334943771 334955444 334841003 334697723 334615250 334768524 334996223 335228195
3007 335228195 335363617 335190277 334969521 334984283 334954033 334587097 334198227 334014168 334006538 334347725 334659576
3018 334659576 334515800 334230652 334024658 333751678 333209534 332785378 332962036 333250504 333339233 333176842
3028 333176842 332405090 331631432 331428757 331539383 331977119 332500000 332825661 333088875 333348503 333547363
3038 333547363 333676567 333648682 333220978 332849503 333141327 333401184 332961578 332345505 331794510 331484070
3048 331484070 331835022 332351456 332707901 332812538 332331886 331665497 331080208 330638428 330550919 330639343
3058 330639343 330830803 331016998 331065674 330976028 330591202 330245514 330246925 330514183 331183929 331909409 332376022
3069 332376022 332622299 332481613 332252045 332261810 332253456 331980705 331735382 331826706 331956406 331899872 331742287
3080 331742287 331437340 331154099 331030121 331111908 331586838 332169304 332681427 332983971 332765579 332363853
3090 332363853 332026978 331709633 331413727 331244469 331422081 331599960 331442833 331135025 330659409 330281982
3100 330281982 330341339 330600281 331025352 331342468 331098557 330795746 330920715 331065674 330881577 330679398
3110 330679398 330741158 330801010 330618629 330398788 330256691 330218315 330485115 330644150 330210190 329599380
3120 329599380 329040298 328608284 328482399 328578949 328878632 329367409 330247421 330847244 330316544 329392204
3130 329392204 328427086 327721100 327866325 328335991 328792114 329258194 329711189 329951057 329706192 329164963
3140 329164963 328255424 327485580 327524910 327816238 328033676 328151245 327985535 327679405 327305565 326889038
3150 326889038 326460342 326075325 325784912 325633545 325765152 325930367 325874557 325754166 325663567 325533142
3160 325533142 325263977 325036545 325045090 325146179 325348854 325387230 324815025 324181557 323918114 323932190 324483871
3171 324483871 324946175 324598312 323980103 323306084 322831383 323003769 323458176 324133148 324562531 324054947
3181 324054947 323223343 322384338 321733475 321758995 321898232 321658859 321316490 320956230 320657272 320604324
3191 320604324 320563812 320323944 320002060 319568157 319251060 319390068 319623470 319697609 319624176 319228401
3201 319228401 318814278 318774223 318665504 317980289 317305794 317177048 317242622 317343235 317433834 317382812 317288399
3212 317288399 317239990 317131767 316944122 316505203 315427055 314335098 313850174 313597450 313424587 313283443
3222 313283443 312960396 312797546 313284397 313764343 313599815 313219795 312789917 312460899 312625656 312719822
3232 312719822 312171936 311393261 310539017 309802532 309486160 309416542 309611797 309800148 309682846 309357872
3242 309357872 308650246 308076859 308306217 308705330 308833351 308780899 308450928 307965755 307372322 306797981
3252 306797981 306372414 306135178 306295166 306473007 306224346 305953503 306006432 306111336 306131363 306007156
3262 306007156 305505028 305010796 304903507 304966927 305221786 305333366 304834137 304140320 303506622 302949677
3272 302949677 302623024 302369595 302013168 301762810 301839600 302028656 302232971 302320251 302009583 301646957
3282 301646957 301500797 301520348 301879406 302170277 302020302 301496506 300345650 299152145 298455467 298136482
3292 298136482 298398743 298811684 299032440 299001217 298399925 297660599 297076702 296743393 297039261 297406197
3302 297406197 297359467 297055721 296429863 295659542 294861794 294149876 293780098 293439865 292727242 292164574
3312 292164574 292410126 292652359 292150497 291350594 290322781 289453735 289304008 289422035 289623489 289663792
3322 289663792 289144516 288340797 287309647 286307335 285672665 285213470 284908066 284583092 283989182 283331871
3332 283331871 282721043 282193413 281864166 281605721 281385193 281033745 280274391 279397736 278577805 277886620
3342 277886620 277541637 277277946 276920547 276413918 275517941 274609337 274080276 273641109 273086777 272554874
3352 272554874 272099972 271764984 271730652 271635056 271111488 270354748 269331455 268358231 267948151 267475357
3362 267475357 266285896 264976273 263934364 263132095 262814751 262548676 261856308 261112690 260586014
3371 260586014 260115623 259620190 259129047 258649826 258165588 257700920 257137527 256271591 255384674 254772415
3381 254772415 254186401 253339539 252643356 252502213 252649078 253096581 253407478 253030548 252316952 251353493
3391 251353493 250380516 249772301 249211540 248292923 247654438 248195419 248725414 248054276 247080574 246308098
3401 246308098 245730400 245592117 245640278 245737076 245779266 245642185 245249977 244248390 243345737 243286858
3411 243286858 243606091 244231701 244724503 244537582 243919849 242820511 241590271 240445614 239737988
3420 239737988 240178833 240902424 241271496 241309166 240615616 239820709 239490032 239417076 239667416 239989281
3430 239989281 240087032 240156898 240334988 240504494 240562210 240602722 240686893 240809669 240927696 241216660 242123833
3441 242123833 242790947 242381821 241274605 239054909 237262249 237893105 239160767 239760876 240241528
3450 240241528 240746498 241184006 241461754 241723061 242168903 242531776 242524624 242405663 242338409 242318382 242396832
3461 242396832 242567291 242897263 243213425 243263969 243350506 243818283 244284153 244361153 244405270 244676819 245073795
3472 245073795 245548019 246196518 247339725 248256207 248155594 247561455 246563187 245670319 245523930 245816708
3482 245816708 246676216 247438431 247185230 246804714 246902943 247405777 248736382 250005951 250220070 250116825
3492 250116825 250001431 250175953 251222610 252605209 254319420 255348434 254186859 252293110 250303745
3501 250303745 249177933 250926018 253028641 253332863 252747765 250905514 249481926 250615349 252550354
3510 252550354 254219780 255694160 256576767 257202377 257742405 258289108 259071121 259848118 260596752 260893345
3520 260893345 260029564 258833656 258009682 257220497 256213913 255438576 255150318 255672226 257925758
3529 257925758 260370979 261674652 262137184 261228790 260105858 259625435 260153770 262906075 266191483
3538 266191483 268957367 270501862 269359589 266765594 262711296 259459972 259955635 262144566 265596161
3547 265596161 268384933 267603874 265764465 264187088 263536224 265582085 268325806 270129204 271678200
3556 271678200 272681007 274432411 279013157 283773193 287597179 287960281 280198822 269611588 258585453
3565 258585453 251191864 254619370 261903534 268674622 274333954 275950909 276150227 276747227 277236214
3574 277236214 277556419 278185844 279333344 281744003 286909828 292796860 299103737 302122345 296319962
3583 296319962 286869278 275383224 267007599 269727478 276635399 284361839 290277958 288861275
3591 288861275 285422554 283695946 282886982 283984661 285371780 285250187 285151958 285693893 287822952
3600 287822952 294056416 300300369 303193092 303053131 297502518 291266212 288815498 288531303 290946960
3609 290946960 294074535 295332909 297034264 302659512 306118240 300413132 291746140 282486687 277133942
3618 277133942 282758484 294013748 309889793 324445496 331975708 330762634 313379059 291246185
3626 291246185 271350384 259567986 269834042 284956455 289965630 292129040 293544044 294751644
3634 294751644 297544003 300264587 300760498 302313080 308102837 316276321 327276955 337392349
3642 337392349 344985733 344273796 324005585 298944702 279316673 267484436 272696495 284518967
3650 284518967 297156811 305938721 300697098 292124748 287753105 286896935 293380737 301206360 304091225
3659 304091225 306711197 312033882 318899155 329126816 336743355 334874382 328038712 315775642
3667 315775642 306145897 311218033 318506718 320188751 314345131 289347649 266499996 269100914
3675 269100914 279533863 286848068 294342995 301152706 308819294 320092697 330481529 337233315
3683 337233315 337881546 326827049 310712337 291980515 277627468 278658142 285487404 291905403
3691 291905403 298789501 305097580 310376167 313866138 315440655 314808369 311702499 303478012 296976814
3700 296976814 299738655 307024002 318238487 328483582 332771301 330772858 318122635 301942348
3708 301942348 286425114 275990257 278699875 287818184 300723076 313132515 318792572 320996284
3716 320996284 320746193 318659306 315649757 311827183 307113419 302984009 300565948 300825119 305429459
3725 305429459 313398361 327208748 338153610 336365929 327801704 313906441 298344383 283648262
3733 283648262 274657249 278640518 290840626 312748680 332887878 338559151 334918251 319371700
3741 319371700 302465668 293974648 293618927 312065601 326246719 307823906 283273468 271093369
3749 271093369 266878128 274915924 287623405 300071945 308582306 304855576 297820568 293604851
3757 293604851 292310715 297617435 304920921 311347008 315384865 313184738 308887959 306158066 302578926
3766 302578926 295331001 289284477 288974991 292586555 301536331 310660362 314677467 315353622 312008858
3775 312008858 306699524 300343513 295675049 297363510 300518513 301455727 301225891 298665276 296729565
3784 296729565 298993111 302432537 304638863 307340393 312337151 317002773 318623066 319259644 320251236
3793 320251236 321050186 322240372 321764946 317542076 310229778 296714554 286226997 291224251 298911572
3802 298911572 299412956 296425819 287021408 281199226 291912556 307370186 320665131 330094337
3810 330094337 330148239 325338821 316956043 309153786 308825264 309042454 304588795 297220707 283571720
3819 283571720 273791542 281165352 292917480 299726257 304511795 306158295 307450294 311998844
3827 311998844 316207409 316447487 316425800 320411682 323087692 319852352 312826881 300703526 289164543
3836 289164543 284697056 283578148 284467220 286704292 288218021 291900406 300262222 312374344 330671082
3845 330671082 347569695 357695580 356857300 334801445 304336548 270604610 246352196 252086163
3853 252086163 269665718 288688183 306444645 315802097 319627285 317264080 312145958 306826363
3861 306826363 303288231 306069603 310055733 312288513 310835114 299838791 288109550 283482780
3869 283482780 283024063 287291050 293642273 299436569 305229912 312079430 315839043 310122261 302704582
3878 302704582 300317993 299704075 300710449 300748825 294538498 290001392 296659470 304431686 305358162
3887 305358162 302595139 293849220 287507534 294067860 304902306 315586567 324007988 325943718
3895 325943718 323296547 315483322 305736542 297360649 289555779 281911850 276564121 275748482 278752804
3904 278752804 287219048 296317577 300636292 303563595 307119370 309995174 311823845 311801434 308326721
3913 308326721 303421249 297776451 293778648 295397530 298571815 300434113 301372528 300163498 298772335
3922 298772335 298843155 300114403 304029694 307116737 305452824 301831970 297145844 293178787 292412758
3931 292412758 293643723 297037849 300963173 303779602 305676937 306293011 305640945 302979698 300206661
3940 300206661 299170017 299273968 301357040 302961578 300943604 298197517 296721458 296058884 296659946
3949 296659946 297801247 298994064 299983978 300072193 300101509 300977230 301811447 301906109 301594009 300837288
3959 300837288 300048599 299612999 299572945 300318718 301190605 301561832 301721096 301825294 301641235 300854912
3969 300854912 299862633 298894653 298132172 297868500 297996044 298671494 299395332 299616814 299643745 299592495
3979 299592495 299484482 299333801 299278984 299507141 299884071 300441971 300867310 300728073 300409546 300164452
3989 300164452 299956093 299845924 299789658 299784431 299763908 299575806 299474945 299789906 300145378 300162544 300179253
4000 300179253
##END=$$ End of the data block
