##TITLE=$$ Begin of the data block
##JCAMP-DX=5.00 $$ ACD/SpecManager v 10.08
##SPECTROMETER/DATA SYSTEM=16PC
##DATE=Mon Sep 30 10:02:54 2013
##DATA TYPE=INFRARED SPECTRUM
##DATA CLASS=XYDATA
##ORIGIN=
##OWNER=
##NPOINTS=3601
##FIRSTX=400.00000000
##LASTX=4000.00000000
##MAXX=4000.00000000
##MINX=400.00000000
##MAXY=39.09595108
##MINY=0.02598763
##XFACTOR=1.0000000000
##YFACTOR=0.000000100000000
##FIRSTY=35.30609512
##DELTAX=1.00000000
##XUNITS=1/CM
##YUNITS=TRANSMITTANCE
##XYDATA=(X++(Y..Y))
400C53060951L867150J974601J716118K869606P863770P204780k20565m67530Q157044
409C86025925M933586j1121292j5355110j4575234o205330J9376984K1104355R71298
417C85155182p933121j7220726j3533592R867172J2665024j154861p219811j1864662
425C48760605j4122009j4660607j1773338k679825k10533k211075m469166r651184
433B88982868j1307010j1651497q275757L19710N726356J1570206J1755218M317055
441B91437149L206253O160507Q278122J2497902J1963387O507606L652115J627922
449C45330963j4076k431145n48134Q143654Q531800K043037j919060q186569o837349
458C44113121M264565O652603K566604J510849J227837J243591K710610J489372l863793
$$ plain form
400 353060951 356928101 358902702 360618820 363488426 371352196 378556976 378336411 377868881 386025925
409 386025925 390959511 379838219 364483109 349907875 343702545 363079529 384183884 385155182
417 385155182 377222061 360001335 346467743 356334915 368999939 367845078 360625267 348760605
425 348760605 334638596 319977989 308204651 305524826 305314293 303103218 298634052 288982868
433 288982868 277675858 266024361 257748604 258068314 263794670 275364876 287120094 291437149
441 291437149 294643402 300803909 309082031 321579933 333543320 340050926 343703041 345330963
449 345330963 345316887 342885742 342337608 350481262 359013062 361056099 359137039 350950470 344113121
458 344113121 348377686 355030289 357596893 359107742 360335579 361579170 364289780 365779152 361915359
467C61915359l434181L531456M104843p07168k005310k285233m67071N193214O636849
476C72482758N217094L577461l7422j252403m07715n20706j144638j051674k84920
485C76577835R7771M88052L74794m89960o04629k21710J65214J036644R60808j00365
495C78284454n66024p22886j007995j834870j113433K030868K008667j056900k070923
504C73950958j677742k396354m361382m517555l165016k159119p39822r3460J266250
513C56106758j423111p502556j4846344l0465126k8444290j0001411L816375K4427643
521B91667938K7203331J2100220L919105l623962j0194282j7847310j8698215j3811340
529B70715485o815453O720543J2699127J5363236J1836052K24819r023667j8600940
$$ plain form
467 361915359 358481178 362012634 366117477 365410309 363404999 361119766 360652695 365845909 372482758
476 372482758 377699852 381277313 381239891 379987488 379579773 379059067 377914429 376862755 376577835
485 376577835 376675606 377163658 377538452 377048492 376443863 376222153 376387367 377424011 378384819 378284454
495 378284454 377718430 376995544 375987549 374152679 373039246 375070114 377078781 376021881 373950958
504 373950958 372273216 369876862 365515480 360997925 357832909 355673790 354933968 354840508 356106758
513 356106758 354683647 347181091 332334747 301869621 273425331 263423920 267240295 291667938
521 291667938 318871269 330971489 334890594 331266632 321072350 303225040 284526825 270715485
529 270715485 263900032 270620575 283319702 298682938 310518990 310743809 301720142 283119202
537B83119202k8188706m2763710m2739868l4003019j2597800L4293890N1441679M8341751
545B56903419M2239190K3304443J3610840Q005142N023727P004014O057052L613434
553C65761261J836548m27017p29790J214752J812477K374878J248360k388268l600082
562C67103119l421555k652168o31599P95364K863922K476921r22203k010574k346306
571C61254921j021156L929138L736992j688729l218155k664108j906395O32057N22385
580C59576950k559662k891540j201859l00445O22787J137962J214486J404304J619797
589C58622780J658668K063065Q64716k922974l386040q61626Q2703L39737R04350J973839
599C59339218J763611K09084o49910j330147j805535k462158j783600R86328J306038
$$ plain form
537 283119202 254930496 212166786 169426918 135423899 122826099 157119989 208561668 256903419
545 256903419 299142609 322447052 336057892 344063034 349086761 356090775 362147827 365761261
553 365761261 367597809 367170792 366441002 367655754 369468231 371843109 373091469 370703201 367103119
562 367103119 363681564 361029396 360397797 361193161 364057083 366534004 365611801 363601227 361254921
571 361254921 360233765 364162903 367899895 366211166 362993011 360328903 358422508 359054565 359576950
580 359576950 357017288 354125748 352923889 352623444 353246231 354384193 355598679 357002983 358622780
589 358622780 360281448 362344513 363209229 360286255 356900215 356038589 356121292 356461029 357365379 359339218
599 359339218 361102829 361311913 360662003 359331856 357526321 355064163 353280563 354266891 355572929
608C55572929l30925j358032k905578l021737j454124j163940q34733k771606r981384
617C31750870q135071L014793Q146057J1819840J1110535M132499J351624O90193q812
626C63872528J61896k72751j436462j360665J04637L88184J83105p14073l650932l033600
636C54241867J788597K617607L12577l67203j38970q93592k528687l564606m106025
645C47361565n215874o091614q880844j6185284j5453586q801689l17574J6609192
653C03024292J9621849R583015N398026K617836J33247j703720l194084m490394m683724
662C26306343m990578j456489J1884422P212181k0486107k3340950o244888K499580
670B91383514J2580624J3545990L575573M01497J289825n58624m344673o467819p522831
$$ plain form
608 355572929 355242004 353883972 350978394 347956657 346502533 345338593 344503860 341732254 331750870
617 331750870 323615799 326630592 334776649 346596489 357707024 361839523 363191147 363881340 363872528
626 363872528 364034424 363761673 362325211 360964546 361069183 361457367 361640472 360926399 357275467 354241867
636 354241867 356030464 358648071 358960648 358593445 358454475 357560883 355032196 351467590 347361565
645 347361565 342145691 336054077 327173233 310987949 295534363 286732674 286415100 303024292
653 303024292 322646141 332229156 337627182 340245018 340378265 338674545 335480461 330990067 326306343
662 326306343 321315765 319859276 331743698 338955879 318469772 295128822 288883934 291383514
670 291383514 303964138 317510128 321085701 321487198 322777023 322218399 317873726 311405907 303883076
679C03883076q732090r292355j1196136j3484707j8003006k5229912l1406899l9675464
687A46862507m1230917l7582636l1499863k0287752j1956692m044771J609802M912138
695F781816Q078337R632349J3261318J7406702K4613142L7500859M3041467M4933567
703B05249557M1410447K9977073K2379876J5306472J0257492O925812N036125N662651
711C42205505M782448L066292J851349M54635K69204J750679J679916L68118k12669
720C56215477n04036p13081n09262j008034k754936k454262J40419P46727K2888l85284
730C48796616q67157j513443k588044k948532k451896k814522l847847m589806n325546
739C21849823n879173n786648p080326r814015j1742839j2751332j5547752k0613918
$$ plain form
679 303883076 295150986 285858631 274662495 261177788 243174782 217944870 186537971 146862507
687 146862507 105631590 68048954 36549091 16261339 4304647 259876 1869678 6781816
695 6781816 14860153 24492502 37753820 55160522 79773664 117274523 160315990 205249557
703 205249557 246660004 276637077 299016953 314323425 324580917 331506729 336542854 342205505
711 342205505 346987953 350054245 351905594 352360229 352629433 354380112 356060028 356428146 356215477
720 356215477 355711441 354998360 354489098 353481064 350726128 348271866 348412285 349159012 349181900 348796616
730 348796616 347929459 346416016 343827972 340879440 338427544 335613022 331765175 327175369 321849823
739 321849823 315970650 310184002 303103676 293289661 281546822 268795490 253247738 232633820
747B32633820k3314934k4073601k5836716k8986215k9048920k7689218k2723675j2403965
755C8556576n907774L96967J157999n718231o507159l951311q06570N506516P424116
764C0151129M130125O451845J0713577K0791054M2771816M8427115M1301002L5444260
772B40181923K5276413J9068260J5021076J2058506J1138420R504090Q090019N911598
780C46250305K408753Q04634M05540P61032K789269L267555K834053K158661O43234
789C62323036P401k4071p0114P8926K01950L38058N50499J082688Q96911k13394l87192
800C64784698L94364J94549p64846j437416k062798k730637m023284l521691j147995
809C49684944L66211K393494K172241r23424j631012o65436m29840l64799l07312m14124
$$ plain form
747 232633820 209318886 185245285 159408569 130422354 101373434 73684216 50960541 38556576
755 38556576 32648802 33045769 34203768 28485537 21978378 18027067 17220497 22727013 30151129
764 30151129 34281254 40733099 51446676 72237730 115009546 163436661 204737663 240181923
772 240181923 265458336 284526596 299547672 311606178 322744598 332248688 340338707 346250305
780 346250305 348659058 349463692 349869232 350630264 353419533 356687088 359521141 361679802 362323036
789 362323036 362330437 362306366 362236252 362315178 362517128 362855186 363405685 364488373 365385284 365171890 364784698
800 364784698 365179062 365373611 364608765 363171349 361108551 358377914 354354630 350832939 349684944
809 349684944 350051155 352444649 354616890 353693466 352062454 351397018 350967178 350602379 350295067 349880943
819C49880943k22435Q93555l2425m091263l955841J42822J800538L073234K141686
828C49630814j554490l954162p359963o625671j643181K007752P185669Q035659M538308
837C50260735K625465N11398n96275p30743r70383j092186r12171O0044l23258j899490
847C46933136l175278m462700o007194r094010q339653m163742k71549O637573P066021
856C25122604J068802k076835m581948o883373q610249j0812759j3589134j5496979
864B64140129j7907867j6780358j2321968p746448j349202L262024O960640R860268
872B28117218J2084007J3023625J2263546J2073517J2133350J1451015J0002365Q872757
880C20021400P912636O632805M749756L883858M003524L612290L213882K288094N90324
$$ plain form
819 349880943 349658508 350552063 350519638 346428375 342472534 342615356 344415894 347489128 349630814
828 349630814 348076324 344122162 336762199 330136528 328493347 330501099 337686768 345722427 350260735
837 350260735 352886200 353397598 352801323 352070580 351100197 350008011 349095840 349155884 348832626 346933136
847 346933136 343757858 339295158 333287964 324193954 315854301 311690559 311419010 318056583 325122604
856 325122604 326191406 324114571 319532623 312649250 304039001 293226242 279637108 264140129
864 264140129 246232262 229451904 217129936 209383488 208034286 211296310 218256950 228117218
872 228117218 240201225 253224850 265488396 277561913 289695263 301146278 311148643 320021400
880 320021400 327934036 334566841 339316597 343200455 347203979 350816269 354030151 356318245 356908569
889C56908569l82919r61075j322708j148224j540680k119293l305931n354157o828308
898C33945274p492561r726753j3075829j6981354k3329963k5136948k6195297j8319359
906A93687210J217117J3322106K4638901K7685394K1690616J7219792J0865211N692482
914C16018829N85060l058185n755425o834278n217056n889664r066810q906136q025894
923B63850441j798382J3020764J8823852J9113770J7484207J1086464P718086N764961
931C55064163L885956K292175J478920J611939J532554J810799J323433j3809p41730
940C68244400j442642j245995J75476O40869O69976L64532o39457r87511j051674p00226
950C64027748N03769O79016K09084n60036j917610l054848m700889m748345l469963
$$ plain form
889 356908569 356525650 355564575 354241867 353093643 351552963 349433670 346127739 340773582 333945274
898 333945274 326452713 316725960 303650131 286668777 263338814 238201866 212006569 193687210
906 193687210 194904327 208226433 232865334 260550728 282241344 299461136 310326347 316018829
914 316018829 316603889 313545704 307790279 300956001 295738945 289849281 280782471 271876335 263850441
923 263850441 262052059 275072823 293896675 313010445 330494652 341581116 349299202 355064163
931 355064163 358950119 361242294 362721214 364333153 365865707 367676506 368999939 368986130 368244400
940 368244400 366801758 365555763 365731239 366372108 367042084 367406616 366767159 365779648 364727974 364027748
950 364027748 364531517 365210533 365419617 364859581 362941971 359887123 355186234 350437889 346967926
959C46967926j885147J249542J976242O81648k25334j231651k798309m858971p219086
968C32656860j0531425j2382279j1513214j5372276k6572723k7215710k1030426j0999928
976A97038879J0052681J6401539P733345J1026860K6156425K6644936J6771316N893955
984C17719936j3942966k0276070j8931846r070645J8258095K6411762K0941277J6285171
992C37394714O123543J296997M47731j833648m427681o405106r860764p346630J966954
1001C17356110P312049J3209115J2341995L033142o92825j765747k492180j690865
1009C46610794j781006k110481k871513m215470n346756o536751p496585p798195r443283
1018B99010754j3409138j3786316j2309799p949105J236687O451111R363422J2091160
$$ plain form
959 346967926 345082779 346332321 348308563 348990211 348764877 347533226 344734917 339875946 332656860
968 332656860 322125435 309743156 298229942 282857666 256284943 229069233 208038807 197038879
976 197038879 207091560 223493099 231226444 242253304 268409729 295054665 311825981 317719936
984 317719936 303776970 283500900 264569054 255498409 273756504 300168266 321109543 337394714
992 337394714 343518257 344815254 345262985 343429337 339001656 332596550 322735786 315389156 317356110
1001 317356110 324668159 337877274 350219269 353252411 352559586 350793839 348301659 346610794
1009 346610794 344829788 342719307 339847794 335632324 330285568 323748817 316252232 308454037 299010754
1018 299010754 285601616 271815300 259505501 251556396 252793083 259244194 268607616 280698776
1026B80698776J4340172J5168419J5030861J3047218Q299332N337028K987633J391144
1034C56300583P30743J33057l5782l69530p29789j078606j574745j621247j276283
1043C50478401r05723k67525L2196K61764m7683j113167j599083j935959j739731p35054
1053C42428436m07943l85743o73751j657753j791459j120338j010170j080284j490364
1062C32810631k111435l301850m837760p256508j0801544j3964425j7934551j9464969
1070B53137589k0606995j6402474p182617L418465K0597458K7200928K6249656K2813549
1078C09225559J2789746P519683M599610K303085J312752O23703O97365O91681R70115
1087C40733299R16939O15120L47633Q7242l41148j200447j267433m43459l47404o23436
$$ plain form
1026 280698776 295038948 310207367 325238228 338285446 346584778 351921806 354909439 356300583
1034 356300583 357031326 357164383 357128601 356759071 356029282 354950676 353375931 351754684 350478401
1043 350478401 349572678 349305153 349337349 349599113 349551430 348438263 346839180 344903221 343163490 342428436
1053 342428436 342020493 341634750 340960999 339303246 337511787 336391449 335381279 334300995 332810631
1062 332810631 330699196 327397346 322559586 315303078 304501534 290537109 272602558 253137589
1070 253137589 232530594 216128120 208945503 212363968 232961426 260162354 286412010 309225559
1078 309225559 322015305 329534988 334134598 336437683 337750435 338374138 339071503 339763184 340733299
1087 340733299 341650238 342265358 342612991 342700233 342359085 341158638 339891205 339447746 339100342 338476906
1097C38476906j076012k051811k362251k232323j952171j238823r36737q84781q85735
1106C24856262j260032r25293L9100Q64754K163658K254944J160850M70391m31519
1115C29193115o76651j04179k25525r75838j106033q25882n48630J9341J16348k72522
1125C24593544l26653j32293j67389m01726m79240m55590m67300m25835n51910j116066
1135C20069542q18005O81877P22409n16663j095276j622925j602401p68433o81400
1144C14368725r47247j582603k731095l804206n203247n911828n982875o224385o314525
1153B75666714o732464q683205o870994r29337K378693N970478M939327j168499n633354
1162B58937359j0086308j4724483k0914078k2994041k2997151j8456211o531238j052857
$$ plain form
1097 338476906 337400894 335349083 332986832 330754509 328802338 327563515 326626778 325741997 324856262
1106 324856262 323596230 322670937 322710037 323574791 325738449 327993393 329154243 329624634 329193115
1115 329193115 328516464 328412285 328186760 327210922 326104889 325279007 324730377 324749718 324866066 324593544
1125 324593544 324266891 324134598 323967209 323565483 323086243 322630653 322163353 321737518 321185608 320069542
1135 320069542 319251537 319933414 320655823 320139160 319043884 317420959 315818558 315050125 314368725
1144 314368725 313421478 311838875 309107780 305303574 300100327 294188499 288205624 281981239 275666714
1153 275666714 268934250 260251045 253380051 252450714 254829407 260799885 265739212 264570713 258937359
1162 258937359 248851051 234126568 213212490 190218449 167221298 148765087 142233849 141180992
1170A41180992k951145N324602K4649630L3972492M0924320L6030522J5046367M424553
1178B98602333j946907o075859n978127p583618r006958j1860847j6231079k0163994
1186B19754944k4891148k7442932k9141426k7669430k4239540j6320705l956318J0492563
1194G6586008L2192946M2838096M7090054M4606456L1654816K3504753J6053200J0442238
1202C24968567O399650L870240L549804K708703K003402J534233J427422J075249M98542
1211C48035812K21253J05858J77879O45370O49453M05807r1820j223793j462211r21707
1221C46541901o73066k75154m24385j183014j608123j819611k280731l140450l342399
1230C31794968l171196k544403j026383m42772m34608o11534j552582j335144J42784
$$ plain form
1170 141180992 138229847 143554449 168204079 202176571 243100891 279131413 294177780 298602333
1178 298602333 296655426 290579567 284601440 277017822 268010864 256150017 239918938 219754944
1186 219754944 194863796 167420864 138279438 110610008 86370468 70049763 66093445 76586008
1194 76586008 108778954 151617050 198707104 243313560 274968376 298473129 314526329 324968567
1202 324968567 331368217 335238457 338788261 341496964 343500366 345034599 346462021 347537270 348035812
1211 348035812 348257065 348362923 348540802 349186172 349835625 350241432 350149612 348925819 347463608 346541901
1221 346541901 345868835 345593681 345169296 343986282 342378159 340558548 338277817 335137367 331794968
1230 331794968 328623772 326079369 325052986 324610214 324175606 323564072 322011490 320676346 320819130
1239C20819130N48134J75476J75705P5607O16303K026062K648620K916794K753258
1248C32755089J963157J402359Q80471L03039n80330o77337Q4419L21159N22614J10359
1258C37084999j210442j682052j684876j454849o60896l93410m73938n28831o48995
1267C28346710q44955j260262j312485r80377r33647q43544j357307k759209l265629
1276C14789295l034344l220100l856888l655205k707233j934299r51996l79563j87397
1285B94862270J23730L52402Q02040J862984J669426N12352r07174l120422m703522
1294B91454086o423950o637115n920411l610115J220704M198303P150421P137756L818760
1303B92388439J498223r52244l327141o004791p678032q469124r199143j0372619r151230
$$ plain form
1239 320819130 321367264 321542740 321718445 321794052 322410355 324436417 327085037 330001831 332755089
1248 332755089 334718246 336120605 337001076 337304115 336723785 336046448 336130867 336452026 336974640 337084999
1258 337084999 335874557 334192505 332507629 331052780 330391884 329998474 329524536 328995705 328346710
1267 328346710 327501755 326241493 324929008 323948631 323014984 322171440 320814133 318054924 314789295
1276 314789295 311754951 308534851 304677963 301022758 298315525 296381226 295429230 295049667 294862270
1285 294862270 294986000 295338402 296140442 298003426 299672852 300185204 299278030 296157608 291454086
1294 291454086 285030136 278393021 272472610 268862495 270083199 274281502 281431923 288569679 292388439
1303 292388439 293886662 292934418 289607277 283602486 275924454 267455330 258256187 247883568 238732338
1312B38732338n909195j991043L116836Q702050J7179966J9598961J7264118J3906250
1320C10600281O904373L008118N42411n42640N27839P03583R08394M94690q36105j244812
1330C21066132j029473q38527l82424j71413M1008k21977j222382j438370j571884
1339C14230690l39279L403663L795624J024971J99547L87917K07405J5754k36282p58400
1349C21931610o64253M68750O2218k081147k593536j885414j683941j198292j866569
1358C10489426k338181o580830j5973091k1033287k5260925k4140835j8750419r296189
1366A87115669P980347J8251648K7019749K7104129J6850968J0053386J070977j328945
1374B94117928L464469M238129L420582K511024N79834j54247m18663M76341M139195
$$ plain form
1312 238732338 232823143 230832100 233948936 242650986 259830952 279429913 296694031 310600281
1320 310600281 317504654 320512772 321055183 320512543 321040382 321743965 322652359 323147049 322310944 321066132
1330 321066132 320036659 319198132 318815708 318644295 318685303 318463326 317240944 315802574 314230690
1339 314230690 313891411 317295074 321090698 322115669 322315216 322703133 322910538 322926292 322690010 321931610
1349 321931610 321267357 321736107 321798325 319717178 317123642 315238228 313554287 312355995 310489426
1358 310489426 308151245 301570415 285597324 264564037 239303112 215162277 196411858 187115669
1366 187115669 195096016 213347664 240367413 267471542 284322510 294375896 295446873 294117928
1374 294117928 297582397 301820526 305241108 307752132 308331966 308177719 307759056 308235397 312374592
1383C12374592L445148j634121l861427n897274m337807K120266M858017P247677M416466
1392C18731537p537842q136749K708435M163742j383782k649059k820015m31309P969399
1401C10614357P106533l790607o363411l639927j869908J896134K109527j565704k239227
1410C02257767j061898l20930L16162J806488O395569M142303o400356r505749r304046
1419B88325310n001297R170761R343872n859146p063866L585339N290508J670361r55334
1428B98506508o372223n759716J172543M440536R499798M510631j5816688j8483620
1436B71697769o057033j268387K633800J374016p495155r911080o974678q345852r995937
1445B25657463j8383026l9774666m2644491l3949852j7390966J4237403L5812140O2649259
$$ plain form
1383 312374592 315819740 314185619 310324192 304426918 300089111 302209377 307067394 314315071 318731537
1392 318731537 311193695 303056946 305765381 309929123 308545341 305896282 303076267 302644958 310614357
1401 310614357 317720890 313930283 307566872 303926945 302057037 303953171 306062698 304496994 302257767
1410 302257767 301195869 300874939 301191101 302997589 309393158 313535461 307135105 297629356 288325310
1419 288325310 283324013 292494774 301838646 295979500 288915634 292500973 297791481 299461842 298506508
1428 298506508 292134285 286374569 287547112 291987648 301487446 305998077 290181389 271697769
1436 271697769 265640736 264372349 267006149 268380165 260885010 250973930 243999252 235653400 225657463
1445 225657463 207274437 167499771 124855280 90905428 73514462 87751865 123564005 186213264
1453A86213264N8607808J6776561R39598k696266k744446O997357J0333061J3221035
1461B87647972Q023262j0550041j3702393m272918K97050N245209P059822Q497238
1469B88245201K041092j8016090k1329880q853684p121543j2068997j3422718j2641907
1477A96831474j4166126j6620388k1067867l2254219l0136586j8207788k542496K6512862
1485H8348866L6417722L3382654K5105229l77884k910843J6051750K2168884K4681569
1493B42867947K0966529O892910J607190J739750J620044K259503N280246J2318364
1501B95552483J5207538K1060467R590378k9613953l4622688j0211945P91092J1376381
1509B79129753J2409916m29401p26452J2277126R132385j2774467j3539543O463051
$$ plain form
1453 186213264 244821072 261597633 262537231 259840965 257096519 264093876 274426937 287647972
1461 287647972 295671234 285121193 271418800 267145882 267442932 272688141 279747963 288245201
1469 288245201 290286293 272270203 250940323 242086639 234965096 222896099 209473381 196831474
1477 196831474 182665348 166044960 144977093 112722874 82586288 64378500 61836004 88348866
1485 88348866 124766588 158149242 183254471 182876587 179965744 196017494 218186378 242867947
1493 242867947 263834476 270727386 272334576 274074326 275694370 277953873 283234119 295552483
1501 295552483 310760021 331820488 341410866 311796913 277174225 266962280 267753372 279129753
1509 279129753 291539669 291110268 290383816 302660942 311793327 299018860 285479317 291942368
1517B91942368Q824348r76105o447544j6096363j2388935J0549068J1685143q725662
1525B78366318j0673523J046676N602112R198666P842541K79426m482498j3430366
1533B73749352p626305J9954929K2272358M791012p311821k7931213k6664734R34601
1541B52168179O675243m395485m278908L454209N086670L221988J162777m232902l701210
1550B55160561M080314M556408l598461n28336K0752202J2443294l1902542l8696766
1558B22266674j6866684m291534J4415035J5585174m057655p741203N32627l109n607357
1567B14231968j0477066k0019055j8410453k200356j016846j0727415j8237114l3516168
1575I9627495k9781342o749391P660865K3642302K8340101K3153067J5340805j18485
$$ plain form
1517 291942368 300766716 299790611 293343067 277246704 264857769 275406837 287091980 278366318
1525 278366318 267692795 268739471 274341583 283540249 291382790 291662216 287179718 273749352
1533 273749352 266123047 286077976 308350334 313141346 305829525 277898312 251233578 252168179
1541 252168179 258843422 254447937 250169029 253623238 258709908 261931896 263094673 258861771 255160561
1550 255160561 259240875 263797283 260198822 259670486 280422688 292865982 260963440 222266674
1558 222266674 205399990 201108456 215523491 231108665 227051010 219309807 219842434 219839325 214231968
1567 214231968 203754902 183735847 165325394 163125038 162108192 151380777 133143663 99627495
1575 99627495 69846153 63096762 70757627 94399929 122740030 145893097 161233902 161115417
1583A61115417j0398635j9893408k3854017k2678376j9525766j2931347n596161M404783
1591E0642490J2071610J9070864K3733854K7547359K6233197J8349647J3938198J0102272
1599B01689491Q383980R614945Q925666P406960N563965L474006L20435n010128p248402
1608B33120918o652355p459392r292374r424439n165348j0005245k8976908k8460025
1616A27684832q626700k411842k306462n414247j6001701j9901514k1384001j7538548
1624C4099817n264282J24455M50372L736258R224415J1922121J3059139J2707710J0427714
1633I0487719P905006J682281L900528J6005516K0071030J8660546J9444227K1129379
1641A99286232K1214943K2710094J6078473m424572o285191P250061J6650200L7291775
$$ plain form
1583 161115417 150716782 130823374 106969357 84290981 64765215 51833868 46237707 50642490
1591 50642490 62714100 81784964 105518818 133066177 159299374 177649021 191587219 201689491
1599 201689491 210073471 219688416 228614082 236021042 241585007 245059013 245379448 240369320 233120918
1608 233120918 226468563 219009171 209716797 200292358 195127010 185121765 156144857 127684832
1616 127684832 119058132 116646290 114339828 108925581 92923880 73022366 51638365 34099817
1624 34099817 28835535 28959990 29410362 33146620 42371035 54293156 67352295 80060005 90487719
1633 90487719 98392725 100075006 103975534 119981050 140052080 158712626 178156853 199286232
1641 199286232 220501175 243211269 259289742 254865170 248579979 255830040 272480240 309772015
1649C09772015K7198543k2842407l4005165j8435936o378899J7465115K2141933Q138886
1657C03054085M458675P409802K751846j2032051j2634277j80951N524636J1937389
1665C10289154R038925o011505j1833191j5866279r731293J5386829J5845299q706799
1673B98411140j3222942n431423N32646J2082329J3697395L668785M350663K1578788
1681C35667381R655228m4123421m3247223J3315201K4927864N239964K90622j964321
1689B99761295O11306J3093700J3040085K294769m079323j4587173j0275383J9162903
1697C19022179J3543586l5023670l4794807J2494087K2041798O331920K30084p415066
1705B96430111o865749M159927O796379L467064L341675N037079M915962M987716Q49000
$$ plain form
1649 309772015 336970558 314128151 280122986 261687050 255308151 272773266 294915199 303054085
1657 303054085 307512760 314922562 317674408 305642357 293008080 292827129 298351765 310289154
1665 310289154 319328079 313316574 301483383 285617104 275885811 291272640 307117939 298411140
1673 298411140 285188198 279756775 280289421 292371750 306069145 309737930 314088593 335667381
1681 335667381 345322609 301199188 257951965 271267166 296195030 301434994 301725616 299761295
1689 299761295 300372601 313466301 326506386 328801155 324721832 310134659 299859276 319022179
1697 319022179 332565765 297542095 262747288 275241375 297283173 303615093 303845177 296430111
1705 296430111 289564362 293724289 300520668 303987732 307329407 312366486 317282448 322270164 323119164
1714C23119164r249211j3908863j8730640j2711048J0401496J4596940K932052q13236
1722B95636654k799511k166977L233185L942718N17388J91917J846085K724876Q665314
1731C11791649r26724l8133144l4032345J5736828K4806252L219604k833137m738083
1739B74890900l142586N894165P252941J523724J463661O803036N861988m58947m082450
1748B96006432q384457p939587k779960J794109J0889053R377480n766392p314682
1756B85881996L141403M738579J444569j751423j0050297p638454Q335342J0649223
1764B94750938J538983p18117L35445N89371L399620n50747j5676498j5003204J730442
1773B70396233O501922L731480L760090N292186L166199m766216m751701M381675M193058
$$ plain form
1714 323119164 313869953 299961090 281230450 268519402 278920898 293517838 296449890 295636654
1722 295636654 292837143 290670166 293903351 297846069 298363457 298555374 300401459 303126335 311791649
1731 311791649 310864925 272731781 238699436 254436264 279242516 282462120 279628983 274890900
1739 274890900 271748314 277642479 284895420 286419144 287882805 294685841 300547829 300088882 296006432
1748 296006432 287621975 279682388 276902428 278696537 289585590 298963070 293196678 285881996
1756 285881996 289023399 293761978 295206547 293455124 283404827 275766373 284101715 294750938
1764 294750938 296289921 295571804 295907249 296496620 299896240 299345493 283668995 268665791 270396233
1773 270396233 276898155 280629635 284389725 289681911 292848110 288081894 283330193 287711868 291904926
1782B91904926n071163n957126n35965K023220M936695M505634J034737k999535j2441635
1791B77399788j0392189N207519R221802N402336L875485K377987j66664n282860n798340
1800B81844864j873970m1733J606217J967201P54833K16961J73092r06239l801803
1809B79939423l862152j457444K41032L052235K871513q35190j827240j236191p78198
1818B76107788J51863Q49495K723217Q42571p263412o780624K912273M514217O52542
1827B74709930j883506p315636n547276N448342P466793K357960R26265J127701L32832
1836B77623405k297153p78198O696949O914844J731873l066311j3173561j1601448
1844B62050400M073143P166366M56810m88510J794815J881123O07967N0068l29723
$$ plain form
1782 291904926 286833763 280876637 280340672 282363892 287300587 291806221 292840958 289841423 277399788
1791 277399788 267007599 272215118 281436920 286839256 290714741 293092728 292926064 287643204 281844864
1800 281844864 279970894 279929161 281535378 283502579 284257412 284474373 284647465 283741226 279939423
1809 279939423 276077271 274619827 274860859 277913094 280784607 279949417 278122177 276885986 276107788
1818 276107788 276259651 277109146 279832363 280674934 273411522 266630898 269543171 274057388 274709930
1827 274709930 272826424 265510788 259963512 265411854 272878647 275236607 276162872 277290573 277623405
1836 277623405 275326252 274548054 281245003 288159847 289891720 286825409 273651848 262050400
1844 262050400 266123543 273289909 273746719 273258209 275053024 276934147 277542114 277592182 277262459
1853B77262459m58718j58805k16713n29290p25021r30080j013050j360169n61237K050876
1863B73360252K397061J615276p67708p331848p287254q22296K025108M163990L993282
1872B71345863N91030p53879j204491j397362q97655q11329j059074q55446j29929
1881B64827728M6501o82830J78337L794670L009548k641201m144897l424645j801739
1890B59161472L201962K995262k982864l899804j125106j3581P16210J290779J767883
1899B61112213J687279Q73814M88529J84517J85260Q44956N20706q48293j378784j726857
1909B61943340j152038O54220J714230L090134K509117m02909j879463l696213k516975
1918B60263443L469944L681183j783371k743244o50883J22318R65824O91662j008281
$$ plain form
1853 277262459 276803741 276644936 276428223 275898933 275173912 274243832 273230782 271870613 271309376 273360252
1863 273360252 275757313 277372589 276604881 269273033 261985779 261163483 263188591 267352581 271345863
1872 271345863 271936893 271183014 269978523 268581161 267683506 266872177 265813103 264957657 264827728
1881 264827728 264874229 264191399 264369736 268164406 271173954 268532753 264387856 260963211 259161472
1890 259161472 262363434 265358696 262375832 258476028 257350922 257337341 258053551 259344330 261112213
1899 261112213 262799492 263673306 264161835 264346352 264531612 265376568 265897274 265048981 263670197 261943340
1909 261943340 260791302 261445522 263159752 266249886 268759003 268356094 266476631 262780418 260263443
1918 260263443 263733387 267414570 265631199 262887955 262237072 262359390 263325214 264016876 263008595
1927B63008595j714459j811027k181778k714634k974759l211975k864341k181054p27195
1936B42627373K329597L221741K780685J447449k537269k578011J837959K061844j322975
1945B49868393k003670q23498p23590j432419j096974N61238N75065j202106j216889
1954B42505550K66781P50790P88441O64005R2983p4158j34697K50092J635094J459121
1964B48204002o07261o87828Q34465J612892K598762K331009N71747k66323q44002
1973B53747463r31740l82423j5964M94956O59218N16892L97682P2002J26591P57713
1983B55442390N92461n52406n72453N78175O10103j22547p50313k198448j636028J571655
1993B52962589K053509K44370k24343j5507j09424m01268l33061K24819J92890n20706
$$ plain form
1927 263008595 261294136 259483109 257301331 254586697 251611938 248399963 245535622 243354568 242627373
1936 242627373 244956970 248178711 250959396 252406845 249869576 247291565 249129524 251191368 249868393
1945 249868393 247864723 247041225 246317635 244885216 243788242 244349480 244924545 243722439 242505550
1954 242505550 242772331 243523121 244311562 244975567 245068550 244994392 244859695 245109787 246744881 248204002
1964 248204002 247596741 246908913 247743378 249356270 251955032 254286041 254857788 254591465 253747463
1973 253747463 252815723 252433300 252417336 252912292 253571510 254088402 254486084 254558086 254684677 255442390
1983 255442390 256034851 255482445 254909992 255488167 256098270 255975723 255225410 253026962 251390934 252962589
1993 252962589 255016098 255260468 255036125 255020618 254911194 254509926 254176865 254401684 254594574 254073868
2003B54073868m71840L94821M12216m38690m14848N16433M81358n35488n99861L00884
2013B53718853J78814j005402j107216k84919n2224j37081j17302j35669m5529K32945
2023B51245270K32200P630j95503n20707o40621n98202n49316m25091l47137l02315
2033B47906208k24113j13240l5286R1553N474l84579m53453l05175j49022K37713J73073
2044B46749153m52499n20478r5367l9101j95732l30467n45006o68525q45681o70662
2054B42385635M58J83602l7690j4763J29204K35558M48723L48796k16960k18163K94933
2065B43539333M91848N69344N70793M87785L06855j0262k98252q21819o90956K82058
2075B44426727M53949k0504j20411n226n8174k58446l08284k77520j86920M4346J10397
$$ plain form
2003 254073868 253602028 253996849 254409065 253970375 253555527 254071960 254553318 254017830 253417969 253718853
2013 253718853 253897667 252892265 251785049 251500130 251447906 251310825 251193523 251057854 251012325 251245270
2023 251245270 251477470 251485100 251289597 250768890 250128269 249530067 248980751 248555660 248208523 247906208
2033 247906208 247682095 247568855 247533569 247625122 247630596 247246017 246792564 246487389 246338367 246576080 246749153
2044 246749153 246296654 245776176 245680809 245641708 245445976 245115509 244570503 243901978 243056297 242385635
2054 242385635 242386093 242569695 242532005 242517242 242646446 242882004 243330727 243679523 243462563 243244400 243539333
2065 243539333 244031181 244600525 245171318 245659103 245965958 245955696 245657444 244835625 244144669 244426727
2075 244426727 244880676 244860172 244739761 244734535 244676361 244417915 244109631 243832111 243645191 243689537 243799934
2086B43799934J09902m8638m87327o29196o05812m68254n6744L8395j15395k00767
2096B41336098l71208l32356p0324O2943J83563J77879J0491o6758j27792j29700n7468
2107B40615368j6461Q5125j5010m03901m71115k62966k08149k64873j74046J04904
2117B38988876J49498l1242n1270M7455M3869n1975o0329P4386n1956n74837n49545
2128B37932930O8893J52817j57108k98500n04742m06971J20869K05765m8161j87168
2138B36878624l94096l93391j63326o9123J0720m6502l08265l81947l30219k96345
2148B34506130k47707j72615l7918J1215K0027m9591k45819l39279m43917l35464J18484
2159B32783546J61896k04563k28176P0343K0027m42276l93867K14119K61535j69754
$$ plain form
2086 243799934 243909836 243861198 243373871 242744675 242138863 241670609 241613865 241652260 241536865 241336098
2096 241336098 240964890 240632534 240562210 240625153 240808716 240986595 240997086 240930328 240802536 240672836 240615368
2107 240615368 240598907 240684032 240669022 240265121 239794006 239531040 239322891 239058018 238883972 238988876
2117 238988876 239138374 239107132 239055862 239103317 239147186 239095211 239034882 239109268 239057312 238482475 237932930
2128 237932930 238001823 238154640 237997532 237699032 237194290 236787319 236908188 237113953 237065792 236878624
2138 236878624 236484528 236091137 235927811 235858688 235869408 235822906 235514641 235132694 234802475 234506130
2148 234506130 234258423 234085808 234047890 234059105 234079132 234029541 233783722 233444443 233000526 232665062 232783546
2159 232783546 232945442 232740879 232512703 232583046 232603073 232160797 231766930 231981049 232242584 232072830
2169B32072830k87781k12898k55585m10804l90759k35081p3909K45800K39143q6784
2179B30604172k78702n76515m75884J15166L20911L52612K40574j56880l04451k80876
2189B29560127l08990l80020l07579p6046O3896K07424K22683J19209j0738l09220
2199B28780746l02791P2727Q4381k08359l11851l59535l12348q3923o0310k51999k31285
2210B26815453j8826L7670J6689n0544k23160k95887l07312l11127k91366k57950j62125
2221B24951515j91459l76931m07467l40213k60601j04428m4822l1949r3212k69184
2231B22831249l72886n09510m45595j18981j2397K861j07518m39644n77449o91643
2241B19558487n16663J05381K76318J01814N5790m9114O2466M96158N52883L06836
$$ plain form
2169 232072830 231785049 231572151 231316566 230905762 230515003 230279922 230206013 230451813 230690956 230604172
2179 230604172 230325470 229748955 229273071 229388237 229709148 230061760 230302334 230145454 229841003 229560127
2189 229560127 229251137 228871117 228563538 228487492 228551388 228758812 228981495 229100704 229089966 228780746
2199 228780746 228477955 228550682 228635063 228426704 228114853 227755318 227442970 227359047 227298737 227046738 226815453
2210 226815453 226796627 226834297 226850986 226800442 226577282 226281395 225974083 225662956 225371590 225113640 224951515
2221 224951515 224760056 224383125 223975658 223635445 223374844 223270416 223225594 223193645 223100433 222831249
2231 222831249 222458363 221948853 221503258 221384277 221371880 221374741 221267223 220827579 220250130 219558487
2241 219558487 219041824 219147205 219423523 219525337 219581127 219532013 219594479 220090637 220643520 220950356
2251B20950356J59511j6212j13736j45187j71432k15035j24473K03628K01225o5574
2261B20663071k94915p07874p23362k93732j93367l04451l24478l95069k54154K46525
2271B17418194K51522j92394m17958o68754o37284l45001j4076O51131O87828L814
2281B16737022p1983L45688L86734J67351R1800Q6537M1256m9343n4360Q5831p25m11034
2293B17354774l87191J10626J65462j29947k31247l82195j53541N79109Q86211J060009
2303B18872070Q58307J35651k85378n70068q82378j350879j300335q06580k44598N69572
2313B14995384J273880K444496K138863K84195q88825k250213k551079j747837j266727
2322B12432137p61738j91212P98702P51248j59016j175632l578911l006935R04083
$$ plain form
2251 220950356 221109867 221093655 220979919 220834732 220663300 220448265 220323792 220527420 220728645 220663071
2261 220663071 220368156 219660282 218936920 218643188 218449821 218145370 217820892 217425823 217171669 217418194
2271 217418194 217669716 217477322 217059364 216390610 215753326 215408325 215394249 216045380 216733208 216737022
2281 216737022 216665039 217010727 217397461 217564812 217656612 217743149 217784405 217735062 217680702 217766533 217765808 217354774
2293 217354774 216967583 217078209 217243671 217113724 216882477 216500282 216346741 216925850 217812061 218872070
2303 218872070 219730377 219866028 219580650 219010582 218128204 216777325 215476990 214670410 214425812 214995384
2313 214995384 216269264 218713760 220852623 221136818 220247993 217997780 215446701 213698864 212432137
2322 212432137 211670399 211479187 212277889 213029137 212870121 211694489 208115578 205108643 206012726
2331B06012726K334595K997627J859665k722245l144989O33011Q40893j161098l043652
2340B04606533o131420p455826r177914n625248M324189J0509033J7497520J7176171
2348B25723038Q852958L408890l210525n670319l840446l576050l208161l558158m959813
2357B09961414n258083m917145m237900k590179k193680l281822k702007n33810L87192
2366A84633980R40323M41055k094021k048969N96771J144161J42804R1323N60761P65571
2376A85173759Q49228J020680J203785J491051K031326K133617J862526J649857J338482
2385A98754311J123657J021385P72247L01133J65939M58221K51065n53131o40622m7683
2395B01606522N6018k11010j54495J91937K65827J67389N8632j37081k78225m63734
$$ plain form
2331 206012726 208347321 211344948 213204613 210482368 207337379 207970390 208811283 207650185 204606533
2340 204606533 198475113 191019287 181841373 176216125 180540314 191049347 208546867 225723038
2348 225723038 234575996 237984886 234774361 229104042 225263596 221687546 218479385 214921227 209961414
2357 209961414 204703331 199786186 195548286 192958107 190764427 187482605 184780598 184246788 184633980
2366 184633980 185574303 186015358 183921337 181872368 182469139 183613300 183756104 183847427 184408188 185173759
2376 185173759 186022987 187043667 188247452 189738503 191769829 193903446 195765972 197415829 198754311
2385 198754311 199877968 200899353 201671600 201972733 202138672 202596893 202847958 202294827 201654205 201606522
2395 201606522 201662540 201451530 201297035 201488972 201754799 201922188 201980820 201843739 201565514 201101780
2405B01101780m41303j91689m7932J26839J16825j69277j52340J61400K16961J28994
2415B00850258q354l23525l99360k97318j90487Q5831M3621l60489m66805m04853l19481
2426A98209038j33972j2398J30405J14441p2002k05269m12483m12445j96953q2016
2436A96926346J19934k8839p45545p25975N3864J90983j14689k62490m84943m56104
2446A94472542j32561j5259J3352j7872j85261k12421j25180r8457o8436j16100k48661
2457A93265686l60031n21660n55496n13325l68118k8362J11579J49479Q5583k44141
2467A91021194j85470L21140L83129P3929j0986O8664m3869m05311m34380j29700q1558
2478A90576782k51274k04811M2915J15395Q7738L4103r0847j80950k98042l00865j91460
$$ plain form
2405 201101780 200660477 200468788 200420856 200547695 200664520 200495243 200342903 200504303 200721264 200850258
2415 200850258 200841904 200518379 200119019 199821701 199631214 199717045 199760666 199400177 198933372 198528519 198209038
2426 198209038 198075066 198062668 198193073 198307514 198235512 198030243 197617760 197205315 197008362 196926346
2436 196926346 197046280 197017441 196271896 195545921 195599785 195790768 195676079 195413589 194928646 194472542
2446 194472542 194339981 194324722 194338074 194320202 194134941 193922520 193797340 193698883 193630447 193514347 193265686
2457 193265686 192905655 192383995 191828499 191315174 190947056 190918694 191030273 191179752 191265335 191021194
2467 191021194 190835724 191156864 191539993 191613922 191602936 191671600 191627731 191222420 190788040 190658340 190576782
2478 190576782 190325508 190120697 190163612 190279007 190366745 190400848 190310001 190129051 189831009 189530144 189338684
2489A89338684j03950M0054N8899n1747r3460r9659j37329k36034k10514m769k9335
2500A88470840l53584k90871J91460K74429P4616n5084k71073l00636j76201m1008
2510A87522888K67506K41985j89781k33879O7940Q5830o8893k14577n15461m99725
2520A86463833j77632J8616K68212K85148K8134n1976K2164j11809n44548n52406j58806
2531A85488930L814J22071Q2016j90010k87781k98500k82517k51045r9678L19023L09448
2542A84915771j38282k90146k34604l52860p02858o74018k72751q3676J12057K0981
2552A82299614n17120n68161k35787m1504J76430K91824L68615K76565m9839k19097
2562A81781540l42617l68118k69413k04564j24931o7234l338j0242r9182j48068k16007
$$ plain form
2489 189338684 189234734 189274788 189333687 189281940 189188480 189088821 188951492 188715458 188504944 188500175 188470840
2500 188470840 188117256 187826385 188017845 188292274 188366890 188311806 188040733 187740097 187563896 187522888
2510 187522888 187790394 188032379 187842598 187608719 187676659 187762489 187693596 187479019 186963558 186463833
2520 186463833 186286201 186304817 186573029 186858177 186886311 186834335 186856499 186744690 186200142 185647736 185488930
2531 185488930 185492744 185614815 185696831 185506821 185219040 184920540 184638023 184386978 184287300 184606323 184915771
2542 184915771 184777489 184487343 184252739 183899879 183197021 182523003 182250252 182166576 182278633 182299614
2552 182299614 181782494 181214333 180978546 180937042 181113472 181405296 181773911 182050476 182000637 181781540
2562 181781540 181438923 181070805 180801392 180596828 180471897 180404663 180401325 180391083 180291901 180143833 179927826
2573A79927826j89552r1782N4131M27246L31878l35941m64916j86920q8692L6964n2452
2584A79367790m74930n19046k24114j47343k20069j60218L6011O8436k5749r7275k32945
2595A77370548k34852j22070j9531K07405J43299l25680l31878J14441J84059m6006
2605A76939735n7945J53313M7684m20342n30014l72162l04222k07901j99318l34511
2615A74714317k76317k1458P6065R6550O9389q7032p7953N8403J77860L92208L97434
2626A75519466J91212Q3695j0491o2713q3447o0787J02501L814m09126n27611m37736
2637A74308777m05083m28428k47956K51770L47614J41144n4111m42753n20706l38803
2647A72611465k00977P8678N9605l75271l17345K78721L20683j20411k39620k35787
$$ plain form
2573 179927826 179738274 179646492 179700623 180127869 180459747 180123806 179658890 179471970 179383278 179420242 179367790
2584 179367790 178892860 178373814 178149700 178002357 177782288 177622070 177658081 177726517 177700768 177603493 177370548
2595 177370548 177135696 177013626 176994095 177201500 177344799 177019119 176687241 176801682 176985741 176939735
2605 176939735 176881790 177035103 177082787 176662445 176132431 175760269 175456047 175248146 175048828 174714317
2615 174714317 174438000 174416542 174492607 174589157 174658546 174571514 174493561 174551964 174729824 175122032 175519466
2626 175519466 175710678 175794373 175783882 175721169 175637722 175576935 175679436 175683250 175274124 174746513 174308777
2637 174308777 173903694 173475266 173227310 173479080 173826694 173967838 173913727 173470974 172950268 172611465
2647 172611465 172410488 172489166 172548771 172173500 171856155 172134876 172455559 172335148 172095528 171859741
2657A71859741j21841J90735L59306N51453M37984n9605k99453m39167m90437m32014
2667A71556702l37830j01814p7954k77996l02085k17896j55449k5749n6267l12347
2677A69691315l08266j22070O9389N02090M08898l37601m61349j20163L7689K38171
2687A69598103K22454m3412j68075k18620l20206n03063n21660l93391k97069j67847
2697A67187214q8215n9605K861N0545J92890N60036N21660R9659j66416n10445n37872
2708A67252312j84059j04676j85241k29378l28522l13301k07405q6556J32790J91689
2718A65937653J64756Q812m11262n12600l76701k62509p2708O1035K11239K18143L6011
2729A65001869M997J14212O5804j54266j92395l0994r7275m25567m51584k39830r7523
$$ plain form
2657 171859741 171737900 171928635 172287941 172839394 173277378 173217773 172918320 172479153 171988716 171556702
2667 171556702 171218872 171117058 171039104 170761108 170459023 170241127 170085678 170059929 170003662 169691315
2677 169691315 169383049 169260979 169330368 169832458 170241356 169903755 169442406 169322243 169359932 169598103
2687 169598103 169820557 169777145 169609070 169390450 169070244 168567181 168045521 167652130 167355061 167187214
2697 167187214 167098999 167039394 167042255 167092800 167285690 167845726 168367386 168467045 168300629 167790184 167252312
2708 167252312 167068253 166963577 166778336 166548958 166220436 165907135 165699730 165613174 165745964 165937653
2718 165937653 166102409 166111221 165699959 165187359 164810658 164548149 164475441 164536476 164747715 164965858 165001869
2729 165001869 165006866 165121078 165186882 165032616 164840221 164809227 164711952 164286385 163834801 163594971 163497448
2740A63497448J33038J26361j27792k64168m22954m09851j99547r0599L2196L090k86579
2751A61990643k37713J59511K66781K32945R8705k44618m05788n18074m41551n0545
2761A60850296J1902k08359k54879Tj58777R1066K13623L35942K29835k32696l12100
2772A60310974n0049j9569j43051j58539r3222j02997j44004k37465m59433m86135
2782A58416510l35694k61783j92166j64270k56300j18971L54528L87669O4612j74761
2792A57719374o05583n69344K0504J56164j1444q1301j70231k15292k34127k22683
2802A55786037j73568j23024m9114o676N7935j5735k16484m31061q34465q42094m71592
2813A52680159k37227O9618J28031r1314j53542j72853j28508O199J00851J70469K85626
$$ plain form
2740 163497448 163630486 163756847 163629055 163364887 162941933 162532082 162332535 162241936 162274132 162277222 161990643
2751 161990643 161752930 161912441 162179222 162412167 162510872 162266254 161860466 161342392 160900841 160850296
2761 160850296 160862198 160653839 160398960 160144081 159985304 160076370 160289993 160625935 160855770 160623074 160310974
2772 160310974 160260925 160241356 160098305 159939766 159846544 159743547 159599543 159362078 158902645 158416510
2782 158416510 158080816 157819033 157626867 157462597 157206297 157087326 157441854 157829523 157894135 157719374
2792 157719374 157113791 156544447 156564951 156721115 156709671 156628370 156458139 156242847 156008720 155786037
2802 155786037 155612469 155489445 155440331 155433655 155491590 155475855 155259371 154828310 153993845 153151751 152680159
2813 152680159 152442932 152512550 152640581 152549267 152395725 152222872 152094364 152100563 152201414 152371883 152657509
2824A52657509N05924N21422M13179J64509m64440m99725J00374J95265n4121j51634
2834A53388262j56164l29495p41482q54015o99997o87122p25270p70807q76427q77142
2844A46670341p84635p18355o88076n38349k11955r6082j49250j51634k07186j23024
2854A43001795J91688J79530j80483k47002j27077l4809J93834J14918k74897n20944
2864A42296553q28028q33273m21286m19378q15868q32796m47274n31196j021862j300097
2874A34845495j604080j601458j113891j190186j924038j893282j110553r48191j262188
2883A22197628j257896j064778r62019j033544o67572R1552Q08478J662016K371788
2892A22145653L168583L408670L065109K885819K794504K348661J415253R66072R36032
$$ plain form
2824 152657509 153163433 153684855 154098034 154262543 153798103 153298378 153398752 153594017 153539896 153388262
2834 153388262 153232098 152902603 152161121 151307106 150607109 149919987 149194717 148423910 147547483 146670341
2844 146670341 145885706 145167351 144479275 143940926 143728971 143632889 143483639 143332005 143124819 143001795
2854 143001795 143193483 143373013 143192530 142945528 142818451 142783642 142977476 143092394 142817497 142296553
2864 142296553 141468525 140635252 140213966 139794588 138978720 138145924 137698650 137167454 136145592 134845495
2874 134845495 133241415 131639957 130526066 129335880 127411842 125518560 124408007 123459816 122197628
2883 122197628 120939732 119874954 118912935 117879391 117211819 117303371 118111849 119773865 122145653
2892 122145653 125314236 128722906 131788015 134673834 137468338 139816999 141232252 142198324 143134356
2901A43134356O13451l0280j70707J65701K60114L10898K43664k9802q5116L9578P0095
2912A44521952J18494R775l04937m55857n79834n00440j95027O6042N44310M61817
2922A43686295k83480n05686m04358l69310k72751k36750l07083j80244K67982K33889
2932A41628504l44038m18425j05619J2159Q0347R8705N0307J669j02997j07527J3590
2943A40806675m77k53200p0572O57320Q14199O59228K69651p34806r11713l55243j33753
2954A40747309Q0585M5061l37124m37974l67642l14951j87874j67846k59638k64168
2964A38535738j88112k04802l43084l17097j39952m7445J5736O1512R2268Q5115M3869
2975A37593746k5272j39713k38419l79086l94582k23637k81572n92470o48261m65869
$$ plain form
2901 143134356 143747807 143717527 143546820 143712521 143972635 144283533 144527197 144497395 144412279 144451857 144521952
2912 144521952 144640446 144650221 144345284 143889427 143309593 142809153 142614126 142680168 143224478 143686295
2922 143686295 143402815 142897129 142492771 142123461 141850710 141613960 141306877 141126633 141394615 141628504
2932 141628504 141284466 140866041 140760422 140772581 140852928 140951633 141001940 141003609 140900612 140793085 140806675
2943 140806675 140806198 140552998 140482426 141139746 141953945 142613173 142882824 142148018 141236305 140881062 140747309
2954 140747309 140827894 140872955 140535831 140097857 139730215 139415264 139227390 139059544 138799906 138535738
2964 138535738 138347626 138142824 137799740 137482643 137342691 137295246 137310982 137372494 137464762 137549877 137593746
2975 137593746 137568474 137428761 137190342 136811256 136416674 136193037 135911465 135318995 134670734 134204865
2985A34204865m88043p06196p15256m87566n39780q36610j004696j184941j187801
2994A27053976j062155q03709k76804k8848N7935N9367j76907j18971K10047L67641
3004A25281572N40972M22478J1682l82900r94444j201391j003742j024246j035929
3013A20614052j327276k142191k219677j730442j252413k83718k57492j169682j604080
3022A08627081k062798j955747j276493o43730K69174P73668P27654J387358K911567
3031A08757734L407717L254890K827645J843452J054526K43187m73977j267910j573085
3040A18074179j467228j206875n50747k10524J11580o5803q24452j357793j846791
3049A10655546k375841k946615l468752m103422m299641m219770l765107k863168j904965
$$ plain form
2985 134204865 133716822 133010626 132295370 131807804 131268024 130431414 129426718 128241777 127053976
2994 127053976 125991821 125188112 124911308 124882460 124940395 124999762 124822855 124703884 124913931 125281572
3004 125281572 125822544 126245022 126256704 125873804 124879360 123677969 122674227 121649981 120614052
3013 120614052 119286776 117144585 114924908 113194466 111942053 111658335 111400843 110231161 108627081
3022 108627081 106564283 104608536 103332043 102688313 102957487 103731155 104458809 105846167 108757734
3031 108757734 112165451 115420341 118247986 120091438 121145964 121389151 120915174 119647264 118074179
3040 118074179 116606951 115400076 114849329 114638805 114750385 114684582 113860130 112502337 110655546
3049 110655546 108279705 105333090 101864338 97760916 93461275 89241505 85476398 82613230 80708265
3058H0708265r07182N85556K815723M355669N731821O262541N918264N497218M823684
3067A15791559L799439K149582J071930K10523k09331q9169m9353M5777K71082O97851
3077A23689890R63449J214266J226425J002312P56264L12805J56403K20060K86817
3086A29828691M74692N28335M17948N16892Q91447R00984N63383M46319M29631M26054
3096A35424376N67197M12464j52349k32935J56164J78814j16825q7738K57730L07084
3106A36713982J56402L2664j79530k48432k26974j36376J25408J70231Q8930r6082
3116A36400223n29766o58036o29901m04835K09093M01497L54051J48058m44412n94139
3126A34251833m16994k78711K0504M5299j96695l01361m05789l66211j89781N722M35829
$$ plain form
3058 80708265 79801083 80386639 83202362 87558031 93289852 99552393 105470657 110967875 115791559
3067 115791559 119590998 121740580 122812510 123023033 122813702 122724533 122675180 122720957 122992039 123689890
3077 123689890 124653339 125867605 127094030 128096342 128852606 129165411 129321814 129541874 129828691
3086 129828691 130303383 130831718 131249666 131766558 132658005 133558989 134122372 134568691 134998322 135424376
3096 135424376 135991573 136404037 136251688 136018753 136174917 136353731 136236906 136149168 136406898 136713982
3106 136713982 136870384 136903048 136723518 136475086 136248112 136111736 136237144 136407375 136496305 136400223
3116 136400223 135870457 135212421 134582520 134177685 134386778 134788275 135142326 135290384 134845972 134251833
3126 134251833 133834839 133556128 133576632 133621931 133425236 133123875 132718086 132351875 132162094 132167816 132603645
3137A32603645L55721k96354n29528o33478m42267L29972L72886k00033n33581j024961
3147A30002022r42707k15769J37567M01736M55141J86920J58548L59297K69890j68562
3157A30644083k02417J13248K43426M15325K52008l59773n93186o24895n75781l70502
3167A28941536j90735R7513J38045j19686j18971J37329J01804k70843k54869J69038
3177A28630161J97649n5074k41995n52416n79119l19242j93835j12533j7882J73808
3187A26929522P0333m99248m61817K07185L33548J31369q2255n35488o33240m64677
3197A24995232k70605J52349K31028j6928r0361j02043j05619l7670j00375l47376
3207A24307632l64542j49250j27554l13758k24591K38419J95742l58820n23568m99010
$$ plain form
3137 132603645 132959366 132663012 132133484 131500006 131057739 131387711 131760597 131560564 131026983 130002022
3147 130002022 129059315 128843546 128981113 129382849 129837990 130024910 130183458 130542755 130812645 130644083
3157 130644083 130441666 130554914 130798340 131213665 131465673 131105900 130512714 129887819 129312038 128941536
3167 128941536 128750801 128848314 128986359 128866673 128747702 128885031 128986835 128715992 128461123 128630161
3177 128630161 128827810 128772736 128530741 127978325 127399206 127079964 126886129 126773596 126755714 126929522
3187 126929522 126999855 126500607 126038790 126245975 126579523 126710892 126628637 126093149 125459909 124995232
3197 124995232 124724627 124876976 125108004 125091076 125000715 124898672 124793053 124755383 124655008 124307632
3207 124307632 123943090 123793840 123666286 123352528 123127937 123366356 123562098 123203278 122679710 122180700
3217A22180700l88145m0293M4346p5102j36375k82049k05040J73568K28167Q4400j37329
3228A21446848p03335o71387k6464K28882M38928K26736o25371q69513o89745n99623
3238A18155956n09500k66552K98977L55243j68323j60694L12805M00782K26974J44482
3248A18790150K861M8876M00781L38793j73807k73228m5061j3113m8399j43051m04120
3259A18480682m14371j96457p7724J2874J17779L01361K61545P153j98126n02825n78880
3270A17213011m54188l45230j74045l9339J40190J37090q0585j60933j91211j75476
3280A15869284m1485p5817l39270l05176N1499J01804q8214j56165j51872k40565m94241
3291A14129782m62771j59502J7882K27689K31028q822j07049j83344j46389R4890Q3924
$$ plain form
3217 122180700 121792555 121752262 121796608 121721506 121585131 121303082 121098042 121271610 121499777 121584177 121446848
3228 121446848 120743513 120072126 120045662 120274544 120713472 120940208 120314837 119445324 118755579 118155956
3238 118155956 117646456 117379904 117678881 118034124 117865801 117705107 118017912 118418694 118645668 118790150
3248 118790150 118793011 118841887 119242668 119581461 119407654 119134426 119089365 119076252 119027853 118884802 118480682
3259 118480682 118066311 117869854 117792130 117805004 117922783 118224144 118485689 118492842 118294716 117791891 117213011
3270 117213011 116758823 116413593 116239548 116200209 116340399 116477489 116396904 116235971 116044760 115869284
3280 115869284 115827799 115751982 115412712 115107536 115159035 115260839 115172625 115016460 114864588 114624023 114129782
3291 114129782 113667011 113507509 113525391 113753080 113984108 113975286 113868237 113684893 113538504 113633394 113717318
3302A13717318j48297k70605m15325l86953q5354j06573m30346n44548o30855m78030
3312A10220432Q4162J62125k21491k63691o2227l0280j14202j16825j6689r9659m42505
3323A09099150m53949k06471k861M14372L14712m15802n92947m02689k86102q3923
3333A07383490M768K4080n722q7499k30074n08070o15359o84738m91619J54257K66790
3344A05210304r6321j81436j09435j50203k69175l37601m25100l85046j40905j47581
3354A02967501m43936m21762o1512n1737l89338m00781j46866n8174k5273n8174j90735
3365A00719213k79426m33445l62873k1935J15633K09809R1314l58820m97818m07934
3375I8773718m05550m13895m24385m72069m28438k30074k62260o30140n30243L1471
$$ plain form
3302 113717318 113569021 113298416 112883091 112496138 112410784 112304211 111873865 111329317 110698462 110220432
3312 110220432 110304594 110466719 110245228 109981537 109919310 109889030 109774828 109658003 109641314 109541655 109099150
3323 109099150 108645201 108438730 108435869 108850241 109164953 108749151 108156204 107753515 107467413 107383490
3333 107383490 107388258 107412338 107406616 107319117 107089043 106580973 105965614 105280876 104789257 104943514 105210304
3344 105210304 105113983 104932547 104823112 104672909 104403734 104066133 103641033 103255987 103115082 102967501
3354 102967501 102523565 102101803 102040291 101988554 101599216 101198435 101051569 100993395 100968122 100909948 100719213
3365 100719213 100439787 100006342 99643469 99621534 99737167 99946976 100038290 99679470 99181652 98773718
3375 98773718 98368168 97954273 97529888 97057819 96629381 96399307 96137047 95506907 94976664 95008135
3385I5008135K75373M51804L37839k65599l39746J19686P4625m16994n48840n20467
3395I4175816l40462J99318K74896m6968k10285m25339m10318j63317K6226L43323
3405I3422890L35216o5088j40190Q5592q583m56810n01871k29836n6982L34025Q8215
3416I2806578j080036j173974l47852J6927K01464M60863R07660Q35895K26260j41383
3426I2712402n69820o30379k67744j33991o7473o2942k12669j56403J14918K02656
3436I0928555K09331J20401j67369k27690o8665q6784j95742l45945p24793o34193
3446H8807106q9645K69651P83443P31230j2874k25306j62125k4080M12941M51088J36852
3457I1078281k0980j85729k13861k1219q8454n02586m37736P7247L31640O27041M65870
$$ plain form
3385 95008135 95283508 95735312 96073151 95807552 95467806 95587492 95662117 95245123 94696283 94175816
3395 94175816 93835354 94034672 94309568 94262600 94052315 93626976 93216658 93053341 93079567 93422890
3405 93422890 93758106 93693018 93552828 93638420 93629837 93173027 92671156 92441320 92384338 92718363 92806578
3416 92806578 91726542 90552568 90204716 90221643 90423107 90883970 91791630 92627525 92853785 92712402
3426 92712402 92142582 91512203 91244459 91110468 91042995 90980053 90767384 90610981 90725899 90928555
3436 90928555 91137886 91258287 91090918 90863228 90794563 90707779 90512037 90166092 89441299 88807106
3446 88807106 88717461 88987112 89770555 90501785 90488911 90263605 90101480 90077400 90490341 90941429 91078281
3457 91078281 91057301 90871572 90657711 90636492 90548038 90045452 89607716 89684963 90016603 90643644 91109514
3468I1109514l74555n06640m9114Q5115J6928J72854O39438O42538K29121j6690l37124
3479I1611385l50713L9577O1512k19583k93494l03507j90258J30892K60592K83479
3489I1029882K60592J65701L9816k43902k20061P2241L22580Q81434O56366n31912
3499I2432737q76188p96795m21285P36475Q58783J24455l65496j231909j093864K11716
3509H9578629O50405N96047N87940M51803L44038J57118J63555M27246M16994K63691
3519I3637466k8133o78301q14199m11749m42267r61065p76768J07527N12362P55071
3529I0899944P46012M04596J39237l02553l22581%L81232J158952J264334Q07285M14610
3540I5591068j20401n98669j359463j246452j79768L64065J023770P19070r85861j269102
$$ plain form
3468 91109514 90734959 90228319 90179205 90264320 90281248 90454102 91093540 91736078 91965199 91948509 91611385
3479 91611385 91260672 91300249 91361761 91142178 90848684 90545177 90354919 90485811 90746403 91029882
3489 91029882 91290474 91456175 91495991 91252089 91032028 91104269 91426849 92308283 92964649 92432737
3499 92432737 91556549 90759754 90338469 91074944 91933727 92058182 91692686 90460777 89366913 89578629
3509 89578629 90229034 90825081 91413021 91864824 92208862 92365980 92529535 92956781 93373775 93637466
3519 93637466 93609333 92931032 92116833 91705084 91262817 90301752 89524984 89632511 90144873 90899944
3529 90899944 91645956 92050552 92189789 91887236 91564655 91564655 91945887 93104839 94369173 95176458 95591068
3540 95591068 95470667 94871998 93512535 92266083 92086315 92450380 93474150 94193220 93207359 91938257
3550I1938257n60045L4332J176596J323223M73261J70946j26123K07662J614332J699210
3560I7951651R93251k36034k789259l733396m090548k706528J547098L001690K722502
3569I2660427K115011J47343m60148p1287M6968K44618L86953M21524O89984J259327
3579I7440720J517057K013922J156807j359701k722979m302740l433943O40154K224207
3588I3173504K783298K152205o94275j493216r38177n19275N71489N88894o38724o82353
3598I4303370J3351P95603K462387K474308J101017j97172k588511k861738j091480
3607I4411135j91927P59601R83954J83821L26156J842976J037836k494335l439427
3616I3419790l066539j615525J937866L735304N097866M597187K223492n58376n496741
$$ plain form
3550 91938257 91378212 91412544 92589140 93912363 94385624 94556570 94430447 94638109 96252441 97951651
3560 97951651 98944902 98708868 95919609 92186213 88095665 85389137 86936235 89937925 92660427
3569 92660427 94775438 94922781 94462633 94391346 94438314 94682932 95069885 95491409 96181393 97440720
3579 97440720 98957777 100971699 102128506 100768805 98045826 93743086 90309143 90949297 93173504
3588 93173504 95956802 98109007 97414732 95921516 94983339 94464064 95035553 95624447 94985723 94303370
3598 94303370 94316721 95112324 97574711 100049019 101150036 100952864 98364353 95502615 94411135
3607 94411135 94219208 94978809 95962763 96146584 96472740 98315716 99353552 96859217 93419790
3616 93419790 90353251 88737726 90675592 94410896 99508762 104105949 106329441 105771065 100274324
3625A00274324p065057o789208m094600L705501N287409J354217M16041P54118P33375
3634I4576120Q69275P34090R2984L10421J197576K141953M025459L930092K790212
3643A10668182k15768p218600q875608o786347l898620K359390M647970M555464L065825
3652I8301888j919270k992630j040936P1764J873255K114773N23329M37021J256466
3661I8625660K040863L984928L249407l11375k277612m631520l865957J283884K251387
3670A00349665Q92400j650571q842945p968665J831532M402161J933574J819849K468109
3679I5235109K854109L614426L224849K207518j907m688978o148339n528211l943205
3688H6825371N5313J786470K065897K309799K062798J728296J171112N26905k50339
$$ plain form
3625 100274324 93209267 86420059 82325459 86030960 91318369 92672586 93088627 93842745 94576120
3634 94576120 95445395 96179485 96272469 96582890 97780466 99922419 103947878 107877970 110668182
3643 110668182 110452414 103233814 94358206 87571859 83673239 86032629 90680599 95236063 98301888
3652 98301888 96382618 93389988 92349052 92420816 94294071 96408844 96932173 97369194 98625660
3661 98625660 100666523 104651451 107900858 107589483 105311871 100680351 96814394 98098278 100349665
3670 100349665 101242065 99591494 90748549 82779884 84611416 89013577 90947151 92767000 95235109
3679 95235109 98089218 101703644 104928493 107136011 107134104 102445126 96296787 90768576 86825371
3688 86825371 86880684 88667154 90733051 93042850 95105648 96833944 98005056 98531961 98281622
3697I8281622j113892k913236k300263R74894K561807L967762L511668J066446j181602
3706A02855206m754067n751371n012513l084659J439810L477812M309177L897667J372814
3715I8749876K50578k04086n67437n35965p49111j242637j237631r98974k47002J211882
3725I4429493K323389M251003L392458n12361k823115n198240n645752m534006k383232
3734H3299637K044439M314184N909682N328893K184153m74691m689694n345106l041029
3743H9530468m94957N766869M566907n645751p490159l429174r93967K513647L830433
3752H8154316L625631K482653q62360j939535j686096q25882J668930K410650K106428
3761I5134735J313686q08477j456022p21216j039982k612353k203703N8413J448870
$$ plain form
3697 98281622 97167730 94254494 91954231 92929125 95490932 99458694 102970362 104036808 102855206
3706 102855206 98101139 92349768 87337255 84252596 85692406 89170218 93479395 97377062 98749876
3715 98749876 99000454 98796368 98228931 97692966 96943855 95701218 94463587 93464613 93217611 94429493
3725 94429493 96752882 101003885 104396343 103883982 101060867 95862627 90216875 85682869 83299637
3734 83299637 85344076 89658260 95567942 100896835 103080988 102606297 97916603 92571497 89530468
3743 89530468 89035511 94802380 99369287 93723536 86233377 82804203 81810236 84323883 88154316
3752 88154316 91779947 94262600 93400240 91460705 89774609 88948727 90617657 93028307 95134735
3761 95134735 96448421 95639944 94183922 93462706 92422724 89810371 87606668 87665081 89113951
3770H9113951L146648L157616J411438J82152j396418k136707k512932j816034P57694
3779H9907408J282930J65224k95639q85725p62462K05755O46591P89404J086950J649380
3789I3789816J581430R31502L98159m60625n78165K88248R9897p33375j813650m557848
3799H8945389l698826J778603K544879m37736j690626l617287k083540M324675N815267
3808I1880798L911019K313137n72920k072334l181219k590180R33886J146555j412869
3817I0355873k657175m602671l273248K614021L950596J710653J102448Q73089Q23736
3826I0897322J358509J058101l46183l63112J311779R66788j132250k339602l756523
3835H7654829l627062j779079o58036N33343J050711N84840J113653K386332L427029
$$ plain form
3770 89113951 92260599 95418215 96829653 97011805 95615387 93478680 90965748 89149714 89907408
3779 89907408 91190338 91355562 91059923 90174198 89411736 89617491 90264082 91053486 92140436 93789816
3789 93789816 95371246 96302748 96700907 96240282 95662117 95950365 96050262 95316887 93503237 88945389
3799 88945389 85246563 87025166 89570045 89132309 87441683 83824396 81740856 86065531 91880798
3808 91880798 95791817 98104954 97532034 95459700 92278481 89688301 90622187 91768742 90355873
3817 90355873 87698698 83096027 79822779 82436800 86387396 88098049 89200497 90073586 90897322
3826 90897322 92255831 93313932 92967749 92604637 93916416 94883204 93750954 91411352 87654829
3835 87654829 84027767 82248688 81590652 82123995 83174706 83759546 84873199 87259531 90686560
3844I0686560N171299M849434L251791j5259o780625r335994j0103464p105113K183199
3853G2801828N685330N639076N168676K948285J153707j308441k241850j997709j369715
3862H6479187M67539J005411R90152n5790l374815l519535o96897M73022J008272J454592
3872H4231138J535654J811266K843619J821279k089977k744675o51359P7486P62224
3881H7596655K33650k520561k283812J199484J689673j3352q71897k439022j542806
3890H1048012K499342L781557L620386K654076Q3684j533031l133774l527164k519131
3899H2973957k078056j988888j144409O72817J483440J655102J696587J312256J175880
3908H5758686J279116R78470L21626k38895r56297j272678j425267j026153K43902
$$ plain form
3844 90686560 95857859 100707293 103959084 103943825 97163200 87827206 77723742 70618629 72801828
3853 72801828 78487158 84126234 89294910 92243195 93396902 92088461 89846611 87848902 86479187
3862 86479187 86946726 87952137 88942289 88886499 85511684 81992149 81295252 81768274 82776546 84231138
3872 84231138 85766792 87578058 90421677 92242956 90152979 87408304 86756945 86834431 87596655
3881 87596655 87830305 85309744 83025932 84225416 85915089 85901737 85029840 82590818 81048012
3890 81048012 83547354 87328911 90949297 93603373 93687057 92154026 89020252 85493088 82973957
3899 82973957 80895901 78907013 77762604 78435421 79918861 81573963 83270550 84582806 85758686
3908 85758686 87037802 88016272 88337898 88099003 87142706 85870028 84444761 83418608 83662510
3917H3662510P18355Q26836N16891o44922q74043n19275K7179J499415J352072n07355
3927H6057663j163721j333237j069546l6954M72545Q10623Q59738N68151K59638k51532
3937H5173368n48124q25405p21931j23501J49727M29391K06948q20875r34124k60115
3947H1725359j2159L0040J98841N13792N63622L28541K97308N91516K32458r90867
3957H3478451j257658q12531n01156j12772L51906J213312J189232J76430j32084l815
3967H3589315o3419k29359k06470J9073R5606J39714L4332l38555l92437k05040n5551
3978H2387209K43425K18630j64509k94447l19719k58207J6927J3352l29256k78235
3988H1235170J74046K61068J21355l3378l90291m12941j32800L8147L19243K42948
$$ plain form
3917 83662510 84380865 85207701 85724592 85079670 84205627 83686352 83713531 85212946 86565018 86057663
3927 86057663 84893942 83560705 82491159 82454205 82926750 83737373 84597111 85165262 85424900 85173368
3937 85173368 84625244 83799839 83077908 82954407 83104134 83533525 83740473 82919598 81985474 81725359
3947 81725359 81713200 81743240 81942081 82455873 83019495 83348036 83645344 84236860 84469318 83478451
3957 83478451 82220793 81408262 80907106 80794334 81146240 82359552 83548784 83725214 83593130 83589315
3967 83589315 83525896 83296537 83090067 83109140 83204746 83344460 83378792 83040237 82647800 82442760 82387209
3978 82387209 82630634 82849264 82684755 82390308 82070589 81812382 81829309 81842661 81513405 81235170
3988 81235170 81409216 81670284 81791639 81758261 81367970 80955029 80822229 80860376 81179619 81422567
3998H1422567l47614l57866
4000H0717087
$$ plain form
3998 81422567 81074953 80717087
4000 80717087
##END=$$ End of the data block
