##TITLE=$$ Begin of the data block
##JCAMP-DX=5.00 $$ ACD/SpecManager v 10.08
##SPECTROMETER/DATA SYSTEM=16PC
##DATE=Mon Sep 30 09:52:01 2013
##DATA TYPE=INFRARED SPECTRUM
##DATA CLASS=XYDATA
##ORIGIN=
##OWNER=
##NPOINTS=3601
##FIRSTX=400.00000000
##LASTX=4000.00000000
##MAXX=4000.00000000
##MINX=400.00000000
##MAXY=45.04943085
##MINY=15.61934948
##XFACTOR=1.0000000000
##YFACTOR=0.000000100000000
##FIRSTY=38.05282211
##DELTAX=1.00000000
##XUNITS=1/CM
##YUNITS=TRANSMITTANCE
##XYDATA=(X++(Y..Y))
400C80528221J2188683J5132408K2164345J7000427k089729j1901627k1221619j8108635
408C93692474L175278P734528k225876o30608J1534233J2134056J985054m3869L674546
417D31029816L761749K518883J18751l674278q093834j8094559j4627685N660324J0305405
426D08904572L930778N07851n684624n736580K060623J959572n629539o602288l282280
435C90428085m81872M350433N820999N373955K626152m327049p484169j0016937p242928
444C79046669L779907O599884L704567J592865l061294l452530L00636J863976K564163
453C92938843L427048N833625L231049o544838q286476l717919j153678K464523L215790
462C91407967K40554Q97179N828400N104065j632691l025322q54225O42777L714065
$$ plain form
400 380528221 392716904 407849312 430013657 447014084 444924355 433022728 411801109 393692474
408 393692474 396867752 404602280 402376404 401745796 413280029 425414085 427399139 427355270 431029816
417 431029816 434791565 437310448 437429199 433754921 425661087 407566528 392938843 398599167 408904572
426 408904572 412835350 413343201 407658577 401921997 403982620 405942192 400312653 393710365 390428085
435 390428085 389946213 394296646 400117645 405491600 408117752 403790703 396306534 386289597 379046669
444 379046669 382826576 389426460 393131027 394723892 391662598 388210068 388510704 390374680 392938843
453 392938843 396365891 402199516 405430565 398885727 390599251 386881332 385727654 388192177 391407967
462 391407967 391648521 392545700 398374100 403478165 401845474 398820152 397965927 398608704 402322769
471D02322769L600846j31608r88502J004448n47409p818222n718918O823540J0427704
480D08974648Q207817P086029O028633K247581o375084q581619n484123l894310j881142
489D06328430l59993J786690J003494l484459n023231m563599m957886o171264n491486
498C79066696l062477j021614J563797L098221M588127L601341j337051j897125J224060
507C85823975K483368K788047M051209O672859P138023O524086M033089j712303m407425
516D13394928n783539n223541j980515L39013L721466L826637L16391j118927k310753
525D05181160j624336J900177K786178K222519R29871k065926l591537m672280m383087
534C96682739j741638j604309k828598n127945j0237656j1506347j1358948o747017
$$ plain form
471 402322769 405923615 405792007 404803505 405807953 405260544 397442322 391723404 398546944 408974648
480 408974648 417182465 424268494 430297127 432544708 426169624 417588005 412103882 408209572 406328430
489 406328430 405968437 407755127 408758621 405274162 400250931 395687332 390729446 384558182 379066696
498 379066696 376004219 374982605 376546402 379644623 384232750 387834091 386497040 384599915 385823975
507 385823975 388307343 391095390 395146599 401819458 408957481 415481567 419514656 417802353 413394928
516 413394928 407611389 402387848 400407333 400746346 404467812 408294449 408610840 407491913 405181160
525 405181160 403556824 405457001 408243179 410465698 411395569 409329643 405738106 401065826 396682739
534 396682739 394941101 393336792 390508194 385380249 375142593 363636246 352277298 345530281
542C45530281O893158Q256912n21660o674766j6409416j7668000j2646446m621734
550C02138329J1682510J8435249J9450913J7302017Q351822M573097L871651K649803
558C88455391J926651J219749Q88825k4071k488594j669922L366966M047165J506539
567C97228699k23847l240356l189087L03993J385460J240006R79652j33743k61078
576C94089699O93321N06630q35648j054039o12487O5307J864205J668434q65441j250991
586C94268990O8893L78609J07040K51312O82373R16710J152764J078834N58853M45824
596C99910202J070747K55356k660751k860565j085739Q09898M896622M744568P4844
605D05155182j567841k031097j469612J092186J904258J235238J760025L976097L216514
$$ plain form
542 345530281 352423439 360680351 360158691 353483925 337074509 319406509 306760063 302138329
550 302138329 313820839 332256088 351707001 369009018 377360840 381933937 385805588 388455391
558 388455391 390382042 391601791 392490616 392466545 389977951 388308029 391674995 395722160 397228699
567 397228699 397004852 393764496 390575409 390879402 392264862 393504868 394484520 394350777 394089699
576 394089699 394783020 395289650 394454002 393399963 392787476 392852783 394716988 396385422 395519981 394268990
586 394268990 394337883 394716492 394823532 395074844 395757217 396673927 397826691 398905525 399464378 399910202
596 399910202 400980949 401236305 398575554 395714989 394629250 395439148 400335770 405080338 405155182
605 405155182 403587341 401556244 400086632 401178818 403083076 404318314 406078339 410054436 413270950
614D13270950m05540k679367n747071n253067o73294J538964L057022L639679L336220
623D10084496K189636o13938j861572k597313j860657J270791K147178J549034J003723
632D11311378Q4420j030464k919426l449212l224830j961250J183280K553711K916336
641D05463943K860299J914482J372604J382828N8403l718834l590126N54542J915703
650D08213844J883278J694184N47905M06761J564941Q83598j973877k523880j413116
659D09283638n38597J313209J182824k960472l6965J4957924J0922661j5124550k0155449
668C98844223j0761261l606529J0243416J1710624J02539k733497n95093j41830O66122
677D03728714L27835j313934k132187k523422l030053l529052l970871n165596l924828
$$ plain form
614 413270950 412865410 410186043 404438972 399185905 398512611 400051575 403108597 406748276 410084496
623 410084496 412274132 411660194 409798622 407201309 405340652 406611443 408758621 410307655 411311378
632 411311378 411395798 410365334 407445908 403996696 400771866 398810616 399993896 402547607 405463943
641 405463943 408324242 410238724 411611328 412994156 413052559 409333725 405743599 406298141 408213844
650 408213844 410097122 411791306 412339211 412745972 414310913 415194511 413220634 410696754 409283638
659 409283638 408745041 410058250 411241074 408280602 408243637 423201561 434124222 418999672 398844223
668 398844223 388082962 384476433 394719849 406430473 406533012 403799515 403204422 403062592 403728714
677 403728714 404056549 402742615 400610428 398087006 395056953 391527901 387557030 382391434 378466606
686C78466606m41093K867241Q345375R027481M842987L038864J970291R68018k38915
695D08846855R9678K831421K812653N31654q22792k183914l011208l527641l382454
704D02194252k385139j649132j235733K12898L580589L972283J244545Q66432K249946
713D09050941K277375J198044J131782K512436J483002k200394l707161l787041m275093
722D03683891m984359m830590m842758j992721N180358P804642P938843O217499M31289
731D14606094j219520L01628O46591J019440R51767M17022j1444n37643r20067j534233
741D13719635j120300P55310J098137O7939J7891O97632P54357M81605N4588j124382
751D15402412q39729J169701J641273J729965P8659m420967n981445n090485n584716
$$ plain form
686 378466606 378025513 380892754 389238129 398265610 403108597 406147461 408117752 409085770 408846855
695 408846855 408946533 411777954 414590607 415122261 414299469 412115555 409104347 405576706 402194252
704 402194252 399809113 398159981 396924248 397137146 400717735 404690018 405934563 406800995 409050941
713 409050941 411328316 412526360 413658142 416170578 417653580 415453186 411746025 407958984 403683891
722 403683891 398699532 393868942 389026184 387033463 392213821 400018463 407957306 414174805 414606094
731 414606094 413386574 413688202 414334793 415354233 416306000 416723022 416711578 416173935 415253868 413719635
741 413719635 412599335 413354645 414452782 414520721 414538612 415236244 415990601 416472206 416526794 415402412
751 415402412 414562683 415732384 417373657 419103622 419182281 414761314 408779869 403689384 398104668
760C98104668p064591p294884q507728m010658Q788795J2826920J1081695Q704911
768D12629128K504577R5368L26423J86424P28837P50541O51627L2425j588593j887092
778D14429665j007309o97861p32422k68707R71107J030197M4556n76019j458626j506577
788D10228004p04269k12898M76112M86603l33786n02815k47269j43051K18429k22473
798D09042587k022743j894226K69432P51228J68343k31514r28650j252174j176338
807D02725945j478196k308159k288093j474838j020699q2245q83560l316879n589257
816C84284019q113632j1032562j6706009j5551796q514404j399765J1337051J3321877
824C47624779N208015P55539l843536p119408q940697j1306076j3572426j6315231
$$ plain form
760 398104668 391040077 383745193 375237465 371226807 380015602 392842522 403924217 412629128
768 412629128 415133705 415229073 415555496 415741920 416470757 417221298 417872925 417905350 416316757 414429665
778 414429665 413422356 412724495 411992073 411723366 412694473 413724670 413769226 413193207 411734581 410228004
788 410228004 409523735 409310837 409786949 410273552 409939766 409436951 409189682 409046631 409265060 409042587
798 409042587 407019844 405125618 405395050 406146278 406314621 406083107 405154457 403902283 402725945
807 402725945 401247749 398939590 396651497 395176659 394155960 394073715 393190155 389873276 384284019
816 384284019 376170387 365137825 348431816 332880020 324365616 322965851 334302902 347624779
824 347624779 352832794 353588333 349744797 342625389 333684692 322378616 308806190 292490959
832B92490959j9631862k2556782k6883354k6403923k2876492j5478611k466440Q360624
840A64554119K0081997K8178940L4925461L5741310L0061722K4724731J6504288J1466255
848C66238823Q582344N899925L684273K824326L784637L817329L728638L039131J202545
857D02801971Q82416J988144K217331K290459J627464k05765q96454q24699p84378
866D09096489n97267j84021P61032R32693O83289r1782j987457k520103j847039j823425
876D02422409k081833k238998k306710k624282m014473k847672R96819L403206N828857
885C96537323O557922N456467M776230M130592K814064L68805o69708o92825o71883
894D18606987k81334J45187Q32596J213761J646537J264573k36054p73201p42874o46362
$$ plain form
832 292490959 272859097 250302315 223418961 197015038 174138546 158659935 156193495 164554119
840 164554119 184636116 212815056 247740517 283481827 313543549 338268280 354772568 366238823
848 366238823 374821167 380721092 384405365 387229691 391014328 394831657 398560295 401599426 402801971
857 402801971 403684387 405672531 407889862 410180321 411807785 411602020 410705566 409880867 409096489
866 409096489 408499222 408315201 409076233 410008926 410692215 410600433 408612976 406092873 404245834 402422409
876 402422409 400340576 398101578 395794868 393170586 389156113 386308441 387305260 390708466 396537323
885 396537323 403095245 408551712 413327942 417458534 420272598 420641403 419971695 419278870 418606987
894 418606987 418325653 418470840 419303436 420517197 422163734 423428307 423192253 422419052 421676178 421029816
904D21029816l14026P5836P65800R62258P54356N77431K79694L0746l01361l59764
914D23500786k69661J11084J176376J205902L97950l23067j688500j697998m60624
923D21952248M58259K064209J899262k18888j104583j454850j667976j670113j361122
932D18896446m11262k39640n75523j084328j945266k775917m446030l860474j118164
941D02439842J078377M247894N014649L530044K562752J213074L10402l14942q16116
950D19265976j064301j421928j781921k210617k882500l036003l007660k214661o95000
959D00951385J120072M335899M961968L176918K253532J227379O82106Q95767J69754
968D19774780j400223k501754l360749m388084o639976n481453q82378K399178O939430
$$ plain form
904 421029816 420715790 420791626 421557426 422519684 423274040 423851471 424131165 424161911 423860550 423500786
914 423500786 423231125 423342209 424518585 425724487 426122437 425799370 424110870 422412872 421952248
923 421952248 422410507 424474716 426373978 426155090 425050507 423595657 421927681 420257568 418896446
932 418896446 418485184 418245544 417670021 416585693 414640427 411864510 407418480 403558006 402439842
941 402439842 403518219 407766113 412780762 416310806 418873558 420086632 420397034 420082092 419265976
950 419265976 418201675 416779747 414997826 412787209 409904709 406868706 403861046 401646385 400951385
959 400951385 402071457 406407356 411369324 414546242 416799774 418027153 418709259 419605026 419774780
968 419774780 418374557 415872803 412512054 408123970 401483994 396002541 395120163 397519341 404458771
977D04458771P191162K640991Q86650J60942o5803P53898R58176J076965O52047o17486
987D18096313j069564r38187r51271j054268p38869K94190L37601m96369r51538j397591
997D11130447j614341j575241j609307j515426j771927k447357k789956k265472l762474
1006C91778946o646385j0567208k0884246j6512413M162788J3596039J9922256J8145104
1014C92994881M614830j075020k983589m467697l995438m338036m448166n747566q403053
1023C62151146j0328522j2366066j3235550j4025459j1665115n916596q03222N691528
1031B99502144R523144J1600971J2330513J0933647J0116348R052506Q337745Q069992
1039C79467010P261735O032028M888992L588905K596169J865387J112213J13220M3869
$$ plain form
977 404458771 411649933 414290924 415177574 415338516 415272713 416026611 416984787 418061752 418713799 418096313
987 418096313 417026749 416088562 415137291 414083023 413344154 413638344 413975945 413479576 412528038 411130447
997 411130447 409516106 407940865 406331558 404816132 403044205 400596848 397806892 395541420 391778946
1006 391778946 385132561 374565353 353681107 337168694 341331482 354927521 374849777 392994881
1014 392994881 397609711 396534691 393551102 389083405 385087967 380749931 376301765 370554199 362151146
1023 362151146 351822624 339456558 326221008 312195549 300530434 294613838 293810616 299502144
1031 299502144 309025288 320626259 332956772 343890419 354006767 363059273 371397018 379467010
1039 379467010 386728745 392760773 397649765 401238670 403834839 405700226 406812439 406925659 406969528
1048D06969528J101265J319885J147767P56721j71165n36461m68483n52407r11941
1057D08654709m69933J146317J366119N16167j42784j213341j546593j350403r42726
1066D06017532P4883M25339M02679J07765n01175j360168k811661l550301l747673
1075C95057220m024772m161568m420051m874726m966240n377044l940354K8610J623612
1084C64944687K124329J317253j516114l289222m473915o271859r163131j0025711
1092C33646317j0195771p454147r65347L707409Q929004J0802765Q622627R109040
1100C56201897J2097587J1522751Q519440M613876j899719n725861q343467r132615
1108C67853889q273353n668182o50177M012832J0573158J2787819J1474839R602546
$$ plain form
1048 406969528 408070793 409390678 410538445 411295166 411124001 410587540 410119057 409566650 408654709
1057 408654709 408184776 409331093 410697212 411213379 411070595 409857254 408310661 406960258 406017532
1066 406017532 406092415 406517754 406920433 407028198 406527023 405166855 402355194 398804893 395057220
1075 395057220 391032448 386870880 382450829 377576103 372609863 367232819 363292465 363321075 364944687
1084 364944687 367069016 368386269 366870155 363580933 359107018 352835159 343672028 333646317
1092 333646317 323450546 315996399 315031052 318738461 327667465 338470230 347092857 356201897
1100 356201897 368299484 379822235 388341675 392955551 391055832 385329971 376986504 367853889
1108 367853889 359580536 353912354 353262177 357275009 367848167 380635986 392110825 401713371
1116D01713371N311470L071099K101898J049499K82555l21426r00498p80563K84881
1125D11812286O35643TM87290j1902k56538l47863m86831q56629n26924P69615J030922
1136D12884712N66712J38778n56945j068612j738548j650085o79970k40097O2713O5804
1146D07784462k52953o42776j367111j623612j703491j245041J96228M81110L95050
1155D02021866j064987l943940p060279j3058434j2543678o740570j48049J2155304
1163C69617233J4980545R489289O221313J505852n16892j70250l04451K71569l58582
1172D00735626k199402l316879m704742m323464k234001k34375K899437M068375L760109
1181C94450684L121833J840592J7662k756386m947395p578621q095055p892113l943443
$$ plain form
1116 401713371 407024841 410095940 412197838 413247337 413529892 413208466 412307968 411527405 411812286
1125 411812286 412447929 413083572 413570862 413558960 413302422 412954559 412467728 411611099 411084175 411853790 412884712
1136 412884712 413451424 413590202 413033257 411964645 410226097 408576012 407896042 407655945 407718658 407784462
1146 407784462 407531509 406888733 405521622 403898010 402194519 400949478 401145706 401626816 402021866
1155 402021866 400956879 397012939 389952660 376894226 364350548 357609978 357461929 369617233
1163 369617233 384597778 394087067 400308380 401814232 401297340 401127090 400822639 401094208 400735626
1172 400735626 398536224 395219345 390514603 386191139 383957138 383722763 386622200 390690575 394450684
1181 394450684 397572517 399413109 399430771 396674385 391726990 384148369 376053314 368161201 364217758
1190C64217758N965462R948006J0530243R491195N134125K466202j49956j173019l59536
1199D06070480k26745k01721o1036K89460K47726j94778m03672m38919o95228j300087
1209D03085480j350403r87053n51720M16756M13895n18303j044998j679421j703491
1218C96080742r93996p64122o47316q99048j669883k104073k390137k630233k775879
1227C81206055k921601l157844l030319k206536k472419l637810m679909o054649o964417
1236C46080551p805366p793427o733169o191483n913506n353450m164219m283180n585919
1245B92256832o633510p818947r011498j0234127j1528015j3498783j3685703j3272286
1253B06573963r984970m018783L130664J3020287K0916462K9855022L2424431K9381523
$$ plain form
1190 364217758 370183220 380131226 390661469 400152664 405286789 407752991 407603035 406430016 406070480
1199 406070480 405843735 405642014 405580978 405870438 406118164 405923386 405519714 405080795 404385567 403085480
1209 403085480 401735077 400748024 400196304 400613060 401026955 400508652 399463654 397784233 396080742
1218 396080742 395086746 394322624 393675308 392776260 391106377 389002304 386612167 383981934 381206055
1227 381206055 378284454 375126610 372096291 369889755 367417336 363779526 359099617 353044968 346080551
1236 346080551 338275185 330481758 323748589 317557106 311643600 306290150 302125931 297842751 292256832
1245 292256832 285623322 277804375 268792877 258558750 247030735 233531952 219846249 206573963
1253 206573963 196588993 192570210 195700874 208721161 229637623 259492645 291917076 321298599
1261C21298599K5108567J6633529J1461258P712822N396385N249710M310151L233413
1269D00404434K356301J670379Q70705l5553p73888j522064j845360j719970j678467
1278C97726517j607895j428833r34601j033287j340637k487908m542808o603737r310722
1287C68436089j1006813j3199807j1517524p096291K35558J5563468J8371354J1027565
1295C70813599M572143o205063j1505584j4440079j2367478l292579K161026Q916397
1303C38652382P901878l629684n619736j990814K888222J3660659J6119957J1610756
1311C79593620Q958092N125275L433952M005203L032189P43637K8610N68848P45086
1320D06234512J115799J065712M35601M77561J126290J388550J628875J380425N25017
$$ plain form
1261 321298599 346407166 363040695 374501953 382214775 387611160 392860870 397171021 400404434
1269 400404434 402760735 404431114 405301819 405266266 404492378 402970314 401124954 399404984 397726517
1278 397726517 396118622 394689789 393755188 392721901 391381264 388893356 384350548 377746811 368436089
1287 368436089 357429276 344229469 332711945 325615654 325851212 341414680 359786034 370813599
1295 370813599 375385742 369180679 357675095 343235016 330867538 327574959 329735985 338652382
1303 338652382 346554260 342924576 337304840 335314026 338202248 351862907 367982864 379593620
1311 379593620 388551712 393676987 397110939 401116142 404148331 404891968 404920578 405489426 406234512
1320 406234512 407350311 408416023 408851624 409329185 410455475 411844025 413472900 414853325 415378342
1329D15378342R53o20842n63392K09083P73201K012482J312981j532059l085175n074234
1339D08811340m027366J384964K372741m17213p85370N00679L09715j119384j614342
1348D05415764j519432j631966j797447j839142j921692j563301q07533L6011J537551
1357C95908813J722832J622658r11942q228759q790284l701438q2741N693435O235390
1366C89467964L32337K19116M996528O024361N733986L037682n126000n423775K413025
1375D01675224L974419J492271M45595r27429j061668k99454J161308N421677M275055
1384D16156998k869339n443116o540298m353523L124962O054382Q209953M328499j0519524
1393D08148994j1353492K184143L680725l988991n913010n698661l828545K805214
$$ plain form
1329 415378342 415379295 414758453 414195061 414404144 415177345 417189827 418502808 416970749 413885574 408811340
1339 408811340 404783974 406168938 408541679 408124466 407339096 407839775 408149490 407030106 405415764
1348 405415764 403896332 402264366 400466919 398627777 396706085 395142784 394335251 394371262 395908813
1357 395908813 397631645 399254303 398342361 390113602 381323318 377621880 377539139 383232574 389467964
1366 389467964 389800301 390019417 395015945 401040306 406774292 409811974 404685974 399262199 401675224
1375 401675224 405649643 407141914 407587509 406660080 405598412 405298958 406460266 411881943 416156998
1384 416156998 413287659 407844543 401304245 396950722 400075684 406130066 414340019 418668518 408148994
1393 408148994 396795502 398979645 402660370 398671379 392758369 387059708 383231163 386036377
1401C86036377K251396p020683o938248R83238M730950Q220444P801742K075195K89231
1410C98429642N64079J167793K961884M230728Q152962L727188j2276192j5937805
1418C91020279j1961670n451431J1561851J2302628n139351o348839O409416P776261
1426D00169144J566620k121888q360176o963463L358574P258416J1803398M071235
1434D10781860k3857116k7386437j0840645j522522J0390511J2909393M863739K922783
1442C78261566M603157L166428K22931l931542j3038635j2428970j403580K571335
1450C58022690O17752N711059K4769783J7143250k2896042l1787643j8712731j0508079
1458C22360039J641502R309998J7296104J4829636l275185n507202N270958Q995781
$$ plain form
1401 386036377 388287773 381267090 374328842 375312080 380043030 388263474 396065216 398140411 398429642
1410 398429642 398993721 400161514 403123398 407354126 415507088 419234276 406958084 391020279
1418 391020279 379058609 373607178 385169029 397471657 392332306 385983467 392392883 400169144
1426 400169144 401735764 399613876 391253700 384290237 387648811 394907227 406710625 410781860
1434 410781860 386924744 359538307 348697662 347175140 357565651 370475044 375338783 378261566
1442 378261566 382864723 386031151 386254082 382322540 369283905 356854935 355451355 358022690
1450 358022690 358640442 364351501 389121284 406264534 383368492 351580849 332868118 322360039
1458 322360039 324001541 333311539 350607643 365437279 362162094 356654892 361925850 370921631
1466C70921631J0231018J0784607J3419380N272865k0858993k3300171k966652K126236
1474C65629921j999855j420021J843681J952172j74981k380142o882934o964646j628647
1483C47974548j582412o237259p240753n106926o133576j2690048r003639O883373
1491C06863308J1367321R840012M335174j1162529j4628887p655621n902061n986214
1499B87070503n779724o101608n805512j879921p517814l1091213k5919667Q395653
1507B11370697K3578415L1804562L2643318K0199775J8483143K8924485K1790275q142967
1515C80651703j0248184J6258239J7611275L40004p909317j8863678j3262749J7682076
1523C82259369J9555092p087479j0058174M190445R279251J3164291J0399094j157494
$$ plain form
1466 370921631 381152649 391937256 405356636 410629501 389770508 366470337 363503685 365629921
1474 365629921 363630066 362210045 364053726 366005898 365830917 363450775 356567841 349603195 347974548
1483 347974548 346392136 340154877 332914124 327807198 321673622 308983574 299979935 306863308
1491 306863308 318230629 328070641 332405815 321243286 306614399 298958778 293056717 287070503
1499 287070503 281290779 275189171 269383659 267503738 259985924 228894711 202975044 211370697
1507 211370697 234949112 266753674 299396992 319596767 338079910 367004395 388794670 380651703
1515 380651703 370403519 386661758 404273033 404613037 396703720 377840042 364577293 382259369
1523 382259369 401814461 394726982 384668808 388859253 398138504 411302795 421701889 420544395
1531D20544395p494239j7825356r306679K8540879L0956039M406433j2220383l8341064
1539C99260025l5177689M477501J3015252k755852k464295R022942J0802040O284447
1547D02464371K726822m505158m133453N852203O132126n474548r27468L0480843J7878570
1556D50494308m9524307n7696609j8504372J482239K6305694K6366005n869407j0673027
1564C62380524O637573P604103j221428p588844k0242691j6458512R228211J2232323
1572C52571259k004853j0667343k7604103k0236015J7850647K8421859K1176110J5551338
1580C75058899K910385j638908N48820k18353k140770k725868j826248k523919n041847
1589C62402191n408516l293495l990173p454415q571396q443336p776260o404648m284382
$$ plain form
1531 420544395 413050156 395224800 385918121 414459000 445415039 449821472 437601089 399260025
1539 399260025 364082336 368559837 381575089 378819237 376354942 385377884 396179924 402464371
1547 402464371 405191193 400686035 396552582 402404785 408536911 403062363 402134895 432615738 450494308
1556 450494308 400970001 343273392 324769020 326251259 352556953 378922958 373053551 362380524
1564 362380524 369018097 376622200 375400772 367811928 347569237 331110725 340338936 352571259
1572 352571259 350566406 339899063 312294960 292058945 309909592 338331451 359507561 375058899
1580 375058899 377969284 376330376 376879196 376660843 374520073 371794205 369967957 367444038 362402191
1589 362402191 356993675 353700180 349710007 342255592 333684196 325240860 317464600 311059952 306775570
1598C06775570j487255K227058P897148J1127701J3595123J2989045Q860588N312919
1606C67297897M01001k199630l399620l235093q11576L28750O595154m107971m0479660
1615C20389252m5628529k4781227j3925076k775669L514767K846718Q769989K2302399
1623B70712624K5822868K2794495J6983032J834869k01721R999771J3482819J6873092
1631C78301849J2621651k00500j0331383k8472901k3082275J2588501K0003815M751434
1639C66180191L013840Q851051R839783J2272110L400802k5949478k6333084j636276
1647C49638939J4238853M3448677L1269303l5708199m9125671k4763565p859001K2239456
1655C43378792K8163185R864082M901657Q105736K595902j4887085j4427414L506889
$$ plain form
1598 306775570 305288315 307515373 315412521 326540222 340135345 353124390 361984978 367297897
1606 367297897 367698898 365499268 362099648 358864555 358052979 358381729 364976883 360868912 320389252
1615 320389252 274760723 249979496 236054420 233278751 236793518 239640236 248410225 270712624
1623 270712624 296535492 319329987 336313019 338147888 337946167 347945938 361428757 378301849
1631 378301849 390923500 390723000 380391617 351918716 328836441 341424942 361428757 366180191
1639 366180191 369194031 378045082 387884865 400156975 403557777 377608299 351275215 349638939
1647 349638939 363877792 407326469 438595772 402887573 353761902 328998337 321139336 343378792
1655 343378792 371541977 381406059 386307716 394413452 397009354 382122269 367694855 371201744
1663C71201744J0869026J6855240J2724648n697747j2974243j8355865j0279160K3067703
1671C87411346K2871972j1957169j8244019n788078J430016J3087997J4454384L285370
1679D06551819L285675K0867576O676674n4903259n2054672J8041153L2291870O734848
1687C87491684L10440k222061J158218J7303238J6781807J466293o703147j8277894
1695C97308578j2994041K1784325J5249252m2423973m1129112J7997017K9393653P823716
1703C93009415k04316q789520q045196N084991Q485527N265236N104294O521950N758552
1712D12190933M772187n11666j2555122j7435799k1431198j3354301J4778595J9845733
1720C86299362N264282M85917k233735j370925O081352O571541K89650K4566M771462
$$ plain form
1663 371201744 382070770 398926010 411650658 405952911 392978668 374622803 364343643 387411346
1671 387411346 410283318 398326149 380082130 374294052 375724068 388812065 403266449 406551819
1679 406551819 409837494 430705070 437381744 382478485 330423813 348464966 380756836 387491684
1687 387491684 387802124 385580063 386738281 404041519 420823326 422289619 415586472 397308578
1695 397308578 384314537 406098862 421348114 378924141 337795029 355792046 385185699 393009415
1703 393009415 392805099 384015579 375970383 381055374 389540901 394806137 399910431 406432381 412190933
1712 412190933 416963120 416451454 403896332 386460533 365029335 351675034 366453629 386299362
1720 386299362 391563644 392049561 389815826 388444901 394526253 401097794 401387444 401412010 406183472
1729D06183472N757103J0020256j822243m5422783l8789749K5490761L5769462L760109
1737D00946388n746116q256455o534119N065690O725540p94640p18803O839981N557518
1746D03084984l911972p864228j0524253q697510j367111M202613J4033776J1300812
1754D00257111q818856j0212440N925178Q257637K186776k561570j3460655j0346374
1762C71226807J0843010J3692627Q70475j881141J070289J451226L552436j518478
1770C99307251j9720535j8326531L532868R649772N715828N169869O099930K712745
1778C94141197q375892p837754O269913O844521n365105o254196J231422M768105Q887787
1787C94309998P786026J839904m656334j8749466j6549835M604111J0174751N366555
$$ plain form
1729 406183472 411940575 421960831 420138588 374715805 335926056 361416817 397186279 400946388
1737 400946388 395200272 386943817 380409698 385475388 392200928 391406288 390687485 397527466 403084984
1746 403084984 399173012 391308784 380784531 372087021 370719910 374922523 388956299 400257111
1754 400257111 391438255 381225815 387150993 395408630 397595406 395033836 381573181 371226807
1762 371226807 382069817 395762444 396632919 394751778 395822067 397273293 400825729 399307251
1770 399307251 379586716 361260185 364793053 374442825 380158653 385328522 391428452 394141197
1778 394141197 385765305 377927551 384197464 391041985 385676880 379422684 380654106 385422211 394309998
1787 394309998 402096024 403935928 399279594 380530128 363980293 368584404 378759155 384125710
1795C84125710L896217K902984J11619o319314o752243j531829J081466L611069M221458
1804C85347137K703400J726875Q30651q12760m300842m418373j402626M78287L215561
1813C83367310L110885m81872j283150m24614L40195J642952K709617N721817K725144
1822C97428284j0062218r559898N276222P188301j74980m153481j0981560q381614
1830C66579056O956558R511719J604309n28069j37329m54445j815300L51906Q594284
1839C90662689Q149834N53627n575905j7416000j4877320N638123R645958O17714q50907
1848C76547813J735459J796226K73247k0981N91278N84832K30064l2654l48816n80292
1858C80776176r89189o68068J06583J533241M893074M863015K824783j428833j2041092
$$ plain form
1795 384125710 388021927 390924911 391036530 384717216 377964973 376433144 377514610 381125679 385347137
1804 385347137 388050537 389777412 390608063 389795303 385494461 381076088 379673462 380151749 383367310
1813 383367310 386478195 385996323 384713173 384288559 384628754 386271706 388981323 394703140 397428284
1822 397428284 387366066 377806168 383082390 390270691 390095711 385942230 374960670 366579056
1830 366579056 373535614 383047333 384651642 384123573 383986244 383531799 381716499 382068405 390662689
1839 390662689 398812523 399366150 393790245 376374245 361496925 367135048 376781006 377398720 376547813
1848 376547813 378283272 380079498 380352745 380331764 380923042 381507874 381737938 381705284 381356468 380776176
1858 380776176 379786987 379118919 379225502 380758743 385651817 390514832 393339615 391910782 379869690
1867C79869690j2233963k267838K117615N333214N472412J184692k22435q6288l67203
1876C78799896o44417o41365k78244j53770n7221k33879j457939l87420M634628L637314
1886C83217583m029274n794297m115829j735916M670372M545212k790909m064331q29468
1895C69073143j42097q03681n55038L21617O94999P69845Q58306Q63533Q59528J097412
1905C73037567M97818j243820j831513j937179j170616R02633K151986L899307K984085
1914C77290268j205216l063926m901657l086090N083084N169639l037681m261284m83246
1923C67503891R46274K189636J946220m90684r93958p858J17035k24342k60811j17569
1933C70607834o6986l00408K17209J876106K080231J658898j10398n295257m903069
$$ plain form
1867 379869690 367635727 365367889 367485504 372818718 378291130 379475822 379253387 379167099 378799896
1876 378799896 378155479 377514114 377235870 377082100 377024879 376791000 375333061 374945641 379580269 383217583
1886 383217583 379188309 373394012 369278183 367542267 372212639 376757851 373966942 369902611 369073143
1895 369073143 368931046 368127365 367572327 367893944 368588943 369358788 370217094 371080627 371940155 373037567
1905 373037567 373535385 372291565 370460052 368522873 367352257 368254890 370406876 374306183 377290268
1914 377290268 376085052 373021126 368119469 365033379 370116463 375286102 372248421 367987137 367503891
1923 367503891 368450165 370639801 372586021 372095337 371101379 371093521 371210556 370986214 370725403 370607834
1933 370607834 370540848 370240440 370457649 372333755 374413986 376072884 375962486 370667229 365764160
1942C65764160J770935K912064l98407o71387J246452J251488n11665n19028J275749
1951C72120361J162796q48312j088600J35155L80287O4850m3374j97410j53542P0076
1961C71602287L01857J112671L89824k564659k847672r23881J61400J582184J688003
1970C70502014K83203k02408k68440l48091l26385k31286K8382J14441J05629K3346
1980C69680405k55585k61078J49269o6032j230240j011391Q66165R66797k49634j188736
1990C67399940l144035k536774J399041K019653j55678n63392P1983Q4419l33786k87285
2000C63954086K99912K28157n44052o54717j64261j92642p84378o41136K42958N43137
2010C62287064M12674N63163J276741P11174j674652j876335q1062M55131M00086L38287
$$ plain form
1942 365764160 367535095 370447159 370048752 369377365 370623817 371875305 371363640 370844612 372120361
1951 372120361 373283157 372434845 371346245 371481400 371861687 371926537 371883163 371685753 371532211 371602287
1961 371602287 371904144 373016815 373406639 370841980 367994308 367070427 367231827 368814011 370502014
1970 370502014 370785217 370582809 370314369 369966278 369639893 369408607 369436989 369551430 369657059 369680405
1980 369680405 369424820 369163742 369313011 369246979 368016739 367005348 367871513 368838310 368588676 367399940
1990 367399940 364255905 361719131 363118172 365137825 364982147 364418755 364490738 364575157 364241371 363954086
2000 363954086 364253998 364482155 363938103 363283386 363119125 362926483 362142105 361500969 361743927 362287064
2010 362287064 362699738 363262901 364539642 365250816 363576164 361699829 361618767 362073898 362473984 362812271
2020C62812271o1722n9852L67164L85743O3171l6926k0295l0975p400n3635j64261
2031C63193283k59628m31061l95317j24474j6670J52359j20163j075744j246682q05893
2041C58870010n31158j34506R308n3406j35651l35464m48456n64575n29290l63121
2051C55783691j40190K33193M52995O25610O27976M37050K67486j182j02043r537r5139
2062C58079910m31785l56674J76658L17612J62124J73302L19023K64893M0970j38741
2072C58607292m55627l99361R8496K53677K08588J75247N7945K4796N3405O4850R8953
2083C58788261P2709O446j00402k48642m37012q61435p41234k632K74887L00674L14942
2094C57366562K34146J52588N4588r3002l95775m00047r3956K0981O4163N8861m1008
$$ plain form
2020 362812271 362750549 362690697 363057861 363443604 363506775 363469849 363449554 363418579 363411179 363357544 363193283
2031 363193283 362933655 362502594 362107277 361982803 361966133 362118492 361998329 360922585 359675903 358870010
2041 358870010 358338852 358204346 358213654 358160248 358024597 357689133 357240677 356676102 356146812 355783691
2051 355783691 355643501 355876694 356329689 356955299 357583275 358020325 358287811 358286629 358184586 358175049 358079910
2062 358079910 357648125 357291451 357468109 357785721 357947845 358121147 358440170 358705063 358746033 358607292
2072 358607292 358151665 357752304 357850800 358104477 358313065 358488312 358546257 358571053 358624458 358689308 358788261
2083 358788261 358860970 358867416 358767014 358518372 358081360 357219925 356478691 356476059 356750946 357051620 357366562
2094 357366562 357600708 357753296 357807884 357714882 357319107 356919060 356825104 356846085 356910248 356969109 356928101
2105C56928101p6981o8932r9182j31340k31781n33790m39873J69029K17667k97547
2115C55435371k87780J99546K64206k4109m4326J77841J20392k46506k83737k2392
2125C55288506K0256n3177j36109l43322l25928j14670O2447M31327L13721m24614
2135C54718437n71251l63083o7978O12031P53631N11398J90049m72565p34329p45049
2145C53831291o49223l62625p7744L43819N40008O51131M74701j41640l85742m19159
2155C53804817m10538l31420j30883M20800L53126l58353o45637q12531p12394k20070
2165C50956917J4763J86233J67351j82610j76200J69258K33421R2049O1988Q2970P8888
2176C51685028O4621N5084O9390J4762j05857k13127l89328l85552k58446l0975N19257
$$ plain form
2105 356928101 356851120 356782188 356683006 356551666 356319885 355786095 355346222 355515251 355732918 355435371
2115 355435371 355147591 355347137 355611343 355587234 355542908 355720749 355841141 355594635 355310898 355288506
2125 355288506 355308762 355255585 355119476 354776154 354450226 354335556 354398003 354829330 355143051 354718437
2135 354718437 354147186 353784103 353716125 354328156 355081787 355593185 355783234 355310669 354576340 353831291
2145 353831291 353182068 352819443 352741699 353085518 353625526 354276657 354751358 354609718 354223976 353804817
2155 353804817 353394279 353062859 352931976 353352776 353705902 353347549 352701912 351889381 351176987 350956917
2165 350956917 350971680 351157913 351325264 351142654 350966454 351135712 351369133 351461182 351523170 351606140 351685028
2176 351685028 351749649 351804733 351874123 351888885 351783028 351569901 351180573 350795021 350536575 350505600 351024857
2187C51024857N25245R308k51770n24063n19981j43509o8665k41775k06452l9596J08719
2198C49672318M16526L21617k48184m45366m54445l84559j77155M1008M47998M57039
2208C49646797R8725j64299n76706o23017l23257j14212K09808K60353L0022o3172
2218C48381042j24206j54038j00135j74027m86374l86238J73073L51219L52364J97639
2228C48030319l11126m02909j80969m044L78342L22571k69165l65715n2681j9798j11580
2239C47013245k60353o50177o12755j57814Q4152L34282L37105O1988j15623l85056
2249C45648994l64761K3613Q1749j21345j63308p4386j57357m77066m73289j70479
2259C43752365l3607Q5601N6992j15623l18795p38144p46727l20892j84784k27928
$$ plain form
2187 351024857 351550102 351559410 351307640 350783577 350263596 350120087 350051422 349809647 349603195 349563599 349672318
2198 349672318 350088844 350410461 350162277 349716911 349262466 348877907 348700752 348741760 349189758 349646797
2208 349646797 349745522 349581223 349004517 348381500 348058243 347944031 348153839 348414192 348444214 348381042
2218 348381042 348256836 348102798 348002663 347828636 347342262 346956024 347129097 347480316 347832680 348030319
2228 348030319 347719193 347316284 347135315 347131271 347509613 347832184 347563019 347197304 347144623 347124825 347013245
2239 347013245 346752892 346102715 345489960 345332146 345416298 345750580 346087685 346149673 346034050 345648994
2249 345648994 345284233 345307846 345389595 345268250 345104942 345030556 344873199 344396133 343922844 343752365
2259 343752365 343718758 343804359 343861351 343745728 343426933 342688789 341942062 341621170 341436386 341208458
2269C41208458j69983o1302J7433J23711J04904n3635j43051l12805j76888L29705
2279C40866547N59845O03408P44362J072884R40323K70843J3352n4131P134L65753
2289C45390320M05311K36283L0517m25605m51050j02768J63536O32515O21338M57l0746
2300C46470108L31192O72302J369744J326065N65300Q8691l06587q13255j645584j754036
2310C46303940j605034l83377K797584L573456K481461J735916P30972l25660j661301
2319C53647957k574921l820686l083191K22893J438141J847267R68246k053985l320008
2328C43271713l917198l396492j488228K77519L456574L352661k79198j763572k229233
2337C37284546k837868k648353m265061q038788r962310j3796807q508205P231235
$$ plain form
2269 341208458 341038475 340977173 340994606 341118317 341223221 341169586 341026535 340713730 340536842 340866547
2279 340866547 341426392 342029800 342774162 343847046 344787369 345058212 345071564 345017433 345024567 345390320
2289 345390320 345795631 346031914 346062431 345636826 345185776 345083008 345246544 345879059 346500397 346500854 346470108
2300 346470108 346801300 347473602 348843346 350169411 350734711 350823402 350516815 349703560 348057976 346303940
2310 346303940 344698906 344315529 347113113 350686569 353168030 354903946 355634918 355309258 353647957
2319 353647957 351073036 347252350 344169159 344392052 345830193 347677460 348645706 346591721 343271713
2328 343271713 339354515 335958023 334469795 334747314 338203888 341556549 341277351 339513779 337284546
2337 337284546 334446678 331798325 327533264 319494476 309532166 295735359 287227154 294458389
2345B94458389J7076264K8537025K7914772J4204025N124093o471405r718171l420372
2353C67704620l228912o710968p949371q402596q156052o431083o259003q000355p181644
2362C05384636m112015k030830L06587J159668N18799J60942p65324o31580P18117
2371C00709000J029262N12829N77698J025200J238823J163482J635075K720585L314514
2380C13926468L769627L779430L332596K778549J815796J299591J125564Q54989N86967
2389C33269577L60985J45683K6932J7891k2888q6785o6757P1755Q1520l3608m3602
2400C33720703N6496J4305j85967k28881j49270j26571j10893j22529j56173k16484
2410C32494736l47863l68843l35693k05498J36147J88103m7188q1330L0289J9074j07270
$$ plain form
2345 294458389 311534653 340071678 367986450 382190475 387314568 380843163 371124992 367704620
2353 367704620 364475708 357764740 349815369 341412773 333256721 326825638 320566635 312566280 305384636
2362 305384636 301272621 299241791 299548378 300708046 301226845 301387787 300622463 299990883 300709000
2371 300709000 301738262 302251091 302828789 303853989 305092812 306256294 307891369 310611954 313926468
2380 313926468 317696095 321475525 324808121 327586670 329402466 330702057 331827621 332682610 333269577
2389 333269577 333630562 333776245 333803177 333821068 333798180 333711395 333644638 333716393 333797913 333764305 333720703
2400 333720703 333777199 333791504 333605537 333376656 333227386 333100815 332989922 332867393 332711220 332494736
2410 332494736 332146873 331778030 331442337 331236839 331372986 331561089 331513901 331432571 331462860 331481934 331374664
2421C31374664j11122L1014j5030l10898k78244J35193J39923k46735l05404r4185
2431C30319176j00632l21388k84195P3700K8610m76379m89960p9880P1564Q2931J60714
2442C28984261L19023K91557R2735p1029l21160l78608k36016k02904k29606k06223
2452C28042030j35193j17988j18523j80702l64799l89557k87552k10037j18256j8578
2462C26100845J20163J76659K21977R0828l45726m07677j25656o0081j12534j19209
2472C25539589p2708j66893m51088n34554n33104l74069M6959K39143L82195K47231
2482C24322701l34740m61350k99682q3924N04494M22020m35600o10848l28521j48087
2492C22546463J16348K78740M39415L80745J7166r1095k8114j7662L0785k2889j82647
$$ plain form
2421 331374664 331263542 331294556 331279526 330968628 330690384 330825577 330965500 330718765 330413361 330319176
2431 330319176 330218544 329897156 329612961 329686661 329715271 329238892 328748932 328669052 328740616 328823547 328984261
2442 328984261 329303284 329594841 329687576 329616547 329295387 328916779 328680763 328477859 328248253 328042030
2452 328042030 327906837 327788849 327670326 327489624 327124825 326735268 326447716 326237679 326119423 326100845
2462 326100845 326221008 326397667 326619644 326710472 326364746 325957069 325831413 325771332 325658798 325539589
2472 325539589 325466881 325299988 324848900 324314346 323781242 323407173 323454132 323693275 324075470 324322701
2482 324322701 323987961 323526611 323226929 323143005 323647499 324069519 323633919 323023071 322694550 322546463
2492 322546463 322662811 322941551 323380966 323761711 323778877 323687782 323659668 323642006 323672791 323649902 323467255
2503C23467255k92054m51583m18663j81656l2921J61896J55220r8229j72615j38512
2513C21998138j43051j48315j60217k23160j54267J05858J34964l8414j07994j08948
2523C21154594k07176m35829m96407m44412l58810j50910r9182j95503j95999j39465
2533C18430901j14918p7496j17302l01361k72503j9321N1994l109j430M6501k403k01455
2545C17418098j94072R289R2277J85738Q1291l65486l70274K4796K04086L57876L38554
2556C17782173R6321k3613j03473j62602k29111j74064M6501J27068J22070J16348
2566C17597618J00632K6455j63784j93138r2965j6937J17302J31378J2627j1921N6744
2577C17564011o199k34127k69661j64986p1030J47572R9182l45707k79903L77178L95775
$$ plain form
2503 323467255 323175201 322723618 322304955 322123299 322090378 322252274 322407494 322309265 322136650 321998138
2513 321998138 321855087 321706772 321546555 321323395 321169128 321274986 321409950 321371536 321263542 321154594
2523 321154594 320947418 320511589 320015182 319570770 319211960 319061050 318961868 318766365 318570366 318430901
2533 318430901 318315983 318238487 318121185 317819824 317547321 317528000 317579994 317576885 317575455 317621956 317619553 317418098
2545 317418098 317224026 317233315 317325592 317511330 317592621 317227135 316856861 316881657 317085743 317443619 317782173
2556 317782173 317878494 317854881 317751408 317588806 317359695 317185631 317232132 317359200 317481270 317597618
2566 317597618 317698250 317724705 317560921 317367783 317274818 317257881 317375183 317506561 317519188 317507267 317564011
2577 317564011 317557812 317323685 317054024 316889038 316818008 316965580 317064762 316719055 316439152 316816330 317212105
2588C17212105j37329l41645m54197m07218j43528L7193K59628L23296K64415J38035
2598C16750755j72615k57950j41639j39942j89305k29111l82919k18849M40826M51813
2608C15911064j78833l38783k10991j77155j39007j10626j16101m5070J40915J75247
2618C14910660R1781J8120j01089j73092k53201k14348k5978N9357J49269O3896k90413
2629C14234962l62396k06947j59264k02179p1525L75290L03497l16391n32856n66730
2639C12495461m87557k06222j1693J99318L02067L86238K14577m00543m71573n2223
2649C11967850Q2016R4413J07041J38779j1445m57057n43347l15208k49138l02086
2659C10511818j71413J41849L35941N48115N29785L03021K5043n39551o08444k27699
$$ plain form
2588 317212105 317074776 316733131 316278934 315871716 315728188 315765381 316025009 316348305 316612720 316750755
2598 316750755 316578140 316320190 316178551 316038609 315849304 315620193 315237274 315018425 315459251 315911064
2608 315911064 315732231 315393448 315182457 315005302 314866295 314755669 314639568 314594498 314735413 314910660
2618 314910660 315002441 315020561 314919472 314746380 314493179 314278831 314252853 314312210 314461479 314525375 314234962
2629 314234962 313872566 313665619 313506355 313304176 313232651 313607941 313911438 313595047 313062191 312495461
2639 312495461 312007904 311801682 311789989 311989307 312291374 312677612 312892189 312491646 312020073 311967850
2649 311967850 312049866 312144279 312251320 312390099 312378654 311921597 311378250 311063042 310813904 310511818
2659 310511818 310340405 310482254 310818195 311366310 311896095 312199116 312224159 311684608 311076164 310848465
2669C10848465J202L35216L48091O3420j89782o69956o72817j95751M5776K98042K90146
2680C10502052m6005j70002j93844k11220j64032j93367l47366k95410o9389J27086
2690C08938503M82083M46090o7005j63078J16596M2420m12217m11758M2457J19439
2700C09133530n6267j54972k81086l49541m22478l37104k8153P8201K9564N9624J66893
2711C07838211J20392j13011j70459q3218r0847k03133j43051J53084J51634j37825
2721C07321777k20298j65940j89781k56767k93007m13895k32696L78360N18551L71228
2731C06817532J03702n64327o78768l21160j21593J20640K29358K62013J64757j85490
2741C05826664k45094p5589K5044K47707J24226n01156n40008m6731J05362J08014
$$ plain form
2669 310848465 310849667 311184883 311532974 311596394 311406612 310736656 310063839 309868088 309913864 310211906 310502052
2680 310502052 310456047 310286045 310092201 309880981 309716949 309523582 309176216 308880806 308811417 308938503
2690 308938503 309420586 309866676 309799671 309636593 309753189 309795609 309383392 308971634 309014091 309133530
2700 309133530 309077263 308922291 308641205 308291664 307869186 307532082 307503929 307582130 307611694 307671318 307838211
2711 307838211 307958603 307845592 307675133 307591915 307501068 307297935 307154884 307307968 307459602 307321777
2721 307321777 307101479 306935539 306745758 306488991 306195984 305782089 305549393 305927753 306446304 306817532
2731 306817532 306921234 306356907 305678139 305356979 305235386 305356026 305585384 305847397 306012154 305826664
2741 305826664 305581570 305505981 305531025 305778732 305902958 305401802 304861794 304815063 304920425 305028439
2751C05028439O5097r4184j92166l32832k80133K2889J11580P7476J5736j39237k23407
2762C04059258l11127k70844j22547Q1062N64576M81357k77748m30107r6798p9155
2772C03597927k84672k83718j53293j8368K88257K19346k91825m33922l73840k55127
2782C02010765O7005J55201P0343M540j45207j61876k1229l9578k27451k26727m5776
2793C01440010j1940k8114j55945n74341n07355J47591K03590k88467l46680r4642
2803B99783707k2660j3103m8638k06470j96228K6474p401k96344l77407l98407k33651
2814B98009872L10173L31650j77612k83966q7261j22776l53585l95050k86827k56767
2824B96687851j98135l10173o01311q42323j111985j324882j473427j675377j941681
$$ plain form
2751 305028439 305093536 304999352 304807186 304474354 304194221 304217110 304328690 304406166 304421902 304282665 304059258
2762 304059258 303748131 303477287 303354740 303435802 304000378 304481735 304203987 303773880 303677082 303597927
2772 303597927 303313255 303029537 302876244 302857876 303146133 303365479 303073654 302639732 302265892 302010765
2782 302010765 302077770 302232971 302303314 302307854 302162647 302000771 301979542 301939964 301712513 301485786 301440010
2793 301440010 301428070 301399956 301244011 300669670 300162315 300309906 300513496 300225029 299878349 299783707
2803 299783707 299761047 299747944 299699306 299492836 299296608 299323082 299315681 299019337 298641930 298243523 298009872
2814 298009872 298320045 298651695 298474083 298190117 298102856 297980080 297626495 297231445 296944618 296687851
2824 296687851 296489716 296179543 295578232 294735909 293623924 292299042 290825615 289150238 287208557
2833B87208557k111435k534637j974564l70025P95364K134075K680073K439251K352466
2842B90619125K265225J853237J058083M35600k83241n79110m68502m06742j99318
2851B94294357j69983k97088l45230l86696l70026k46544k64168m87556m12216J4305
2861B91329155P4387j51406k70614l35694n32608r38663j059056r02900r28631j114140
2871B85169830j090278q38051q05855j037598r09080m81606j36604K51770N60989Q44956
2881B81528473J008987J071930J049996Q49952Q27084J055469Q82874K47231M5318
2890B88567314K03838J18962j69029k19574m6273l5743j44501j61171j25160r1782
2900B87896881k8858j2646r537p7705k25563l64532p34559m66842O10122R41277P54356
$$ plain form
2833 287208557 285097122 282562485 280587921 280217896 281013260 283147335 285827408 288266659 290619125
2842 290619125 292884350 294737587 295795670 296231270 295948029 295368919 294900417 294493675 294294357
2851 294294357 294124374 293827286 293482056 293095360 292725334 292478790 292214622 291727066 291314850 291329155
2861 291329155 291403542 291252136 290981522 290645828 290113220 289174557 288115501 287212601 286283970 285169830
2871 285169830 284079552 283241501 282435646 281398048 280488968 280007362 279870758 280122528 280683517 281528473
2881 281528473 282537460 283609390 284659386 285509338 286336422 287391891 288274765 288521996 288567314
2890 288567314 288771152 288890114 288721085 288501511 288455238 288419495 288274994 288113823 287988663 287896881
2900 287896881 287868023 287855377 287845840 287768135 287542572 287178040 286443481 285976639 286586761 287528038 288282394
2911B88282394O92368O40392M12693j14193k60353l5763q2492l50476m00543k37236
2921B88546791k82745l89824p27654j491317j732102j625290j419792r28879o53267
2930B79295921n59578k82039J62124M74224P04518R50813J272450J330833J163025
2939B84512291R58672O55651L12328j96686m28200m93049l93868j9569J85013N13324
2949B85605907K35558p56741j301288j737843j871814j567364j562844j821975j753350
2958B73468246j612167r70840M44641J108398J148224J578331K359390K633591K597313
2967B82755127K319832J594047J178513R31740O58760L52135K35786L66211K92320
2976B90684471K3117l0041R6074J36623K08607J05400j87874m08173p90844o60419
$$ plain form
2911 288282394 288974762 289615154 290027847 289913654 289653301 289617538 289535046 289184570 288784027 288546791
2921 288546791 288264046 287874222 287146568 285655251 283923149 282297859 280878067 279949188 279295921
2930 279295921 278736343 278454304 278616428 279090652 279795170 280745983 282018433 283349266 284512291
2939 284512291 285470963 286126614 286438942 286242256 285814056 285321007 284927139 284907570 285092583 285605907
2949 285605907 285841465 285084724 283783436 282045593 280173779 278606415 277043571 275221596 273468246
2958 273468246 271856079 270885239 271329880 272438278 273586502 275164833 277524223 280157814 282755127
2967 282755127 285074959 286669006 287847519 288779259 289438019 289790154 290025940 290392151 290684471
2976 290684471 290707588 290677547 290773621 290910244 291118851 291224251 291036377 290628204 289837360 289176941
2986B89176941J87397K58446l24955n59578p73430o57807q4381J25161J32083J12782
2996B87592659o6051m9344L25203N1957q91686j412392j849880j940975j574974j460800
3006B78723717j569271j308194q44955j02291J083622J977424K969285L230800K822399
3015B86982536K330056J357803R03606Q70705O47545L55244J21116j58310j99318Q2493
3025B93293476O5556r1782m03881j194954j154652j97906K4090l35446k39868K32697
3035B89997330L57170K78702J39961k40574k80628K155R6073J62125O5346k83013l93638
3046B89901009l83377k77749O4125J02997r2258k61059n53627o30608n67207m03633
3056B86898613j8597J40667K03133R8705l01609m14848l89099k16236K44140M19617
$$ plain form
2986 289176941 289364338 289622784 289297829 288738251 287964821 287307014 287222633 287347794 287479877 287592659
2996 287592659 287526608 287477264 287802467 287854424 286962738 285550346 283700466 281759491 280184517 278723717
3006 278723717 277154446 275846252 275001297 274899006 275982628 277960052 280929337 284160137 286982536
3015 286982536 289312592 290670395 291574001 292444706 293092251 293447495 293568611 293410301 293210983 293293476
3025 293293476 293359032 293267250 292863369 291668415 290513763 290315857 290339947 290004501 289764633 289997330
3035 289997330 290354500 290633202 290773163 290532589 290251961 290254116 290350189 290512314 290577660 290294647 289901009
3046 289901009 289517632 289239883 289304008 289407005 289314747 289053688 288500061 287869453 287302246 286898613
3056 286898613 286880016 287020683 287223816 287322521 287020912 286606064 286216965 286000729 286244869 286664486
3066B86664486L99589L95527L98407K31266k27222l15418q3924M769M4117J19667L41911
3077B87973175J80950m54902o72093o91414n23567K3594J92394J13487J8616j68800
3087B85991440l75996p91073p35511k01474R8477L77159M94499M32243M01497M09851
3097B86101112K15531l46432l75271J02272K88735M21047L46184m6482j62125o2714
3107B86481857r7503k57988k31018N722M8866m8390r7751j84536j58310Q0585j8844
3118B85522690n42393n96294l19481n1499M78993N24521M8160n7220J34239K3594l76453
3129B84788857n18799n51720m31519j0032P3204k06223j11351L69072M51088K47956
3139B84100533Q9168k69184j82610N43099M85420k39372o74706j276264j178493k06948
$$ plain form
3066 286664486 287064075 287459602 287858009 288089275 287862053 287546635 287462711 287467480 287511597 287631264 287973175
3077 287973175 288154125 287699223 287027130 286335716 285812149 285835743 286028137 286141624 286160240 285991440
3087 285991440 285615444 284824371 284088860 283887386 283985863 284363022 284857521 285289764 285691261 286101112
3097 286101112 286316643 285970211 285594940 285697212 285985947 286406994 286753178 286706696 286544571 286481857
3107 286481857 286384354 286126366 285895348 285901070 285949936 285901546 285803795 285619259 285460949 285541534 285522690
3118 285522690 284980297 284384003 284064522 284013023 284492016 285016537 285064697 285007477 285141716 285165310 284788857
3129 284788857 284270058 283718338 283286819 283276787 283349991 283143768 283032417 283401489 283852577 284100533
3139 284100533 284189701 283920517 283737907 284281006 284766426 284527054 283852348 282576084 281397591 281190643
3149B81190643P4139l6717j69277o46839n48363K20070L60260R289q6079j28250n4607
3160B80184269K25544K87056J77860J29948J50909k5024m81148o20346n96046l93868
3170B79039154K07176L07560L5038k22206q03451p41730m292L07789N20001M29859
3180B79074898r4872l23791m08402m76360o07014l56903M73251O41823L20206O1264
3190B78304100m22478n34286k48909k64416n69820n11399q5373L8395%r3937l96728
3201B75215149m05083q3198p7973m05540l56198O5098J67847L0022L0288J41621R2983
3212B74415016q7967k43187m41799n68390p60784n84373J18484K80628N6019j04904
3222B72078743m37489m51793j39237k5520M2191k3594l18528l72886k16961k00997
$$ plain form
3149 281190643 281264782 281228065 281058788 280411949 279863586 280083656 280443916 280453205 280367126 280238876 280184269
3160 280184269 280409813 280696869 280874729 281004677 281155586 281130562 280649414 280029068 279433022 279039154
3170 279039154 279246330 279553890 279588928 279366722 278563271 277821541 277817249 278125038 278645039 279074898
3180 279074898 278980026 278656235 278247833 277771473 277164459 276807556 277280807 277922630 278242836 278304100
3190 278304100 277881622 277347336 277098427 276834011 276264191 275752792 275667419 275705814 275705814 275611877 275215149
3201 275215149 274810066 274726868 274648895 274243355 273887157 273952255 274120102 274150124 274180412 274322033 274415016
3212 274415016 274327049 274083862 273642063 273073673 272312889 271728516 271847000 272127628 272183647 272078743
3222 272078743 271641254 271189461 271050224 271024704 271066895 271043301 270724773 270351887 270134926 269933929
3232B69933929k74887k91824l24478k31037P9403R8934j18008k82783n45254n94387
3242B67449608n45731k51045N17845O97365M54426J83811l49998o02227o84738o96182
3252B66173134o00586m44641j78337M4098L13282M19864M48933K67506k86580m32968
3262B65723705k57969j96933j02997j31130l12577l68824l38077l49274l82671l90053
3272B62893200m77314k71072L84082M91619J64261n6019m15325m72297j77384j70250
3282B61893501m25091m05788j45435n0297m2458k9564m5280m7932J6461j12534m94728
3293B60110855o32515o37054n64575l16163k32925l33557k02637J82858L14235L40691
3303B58029213J70708l07789n57652p36484p53403n54085m49886m09126k47498J60713
$$ plain form
3232 269933929 269659042 269367218 269042740 268811703 268891106 268990040 268872032 268589249 268043995 267449608
3242 267449608 266903877 266652832 267170677 267868042 268322468 268506279 268156281 267554054 266869316 266173134
3252 266173134 265572548 265127907 264949570 264993668 265306950 265726814 266175747 266443253 266156673 265723705
3262 265723705 265465736 265268803 265165806 265034676 264722099 264353275 264015198 263665924 263283253 262893200
3272 262893200 262415886 262144814 262528896 263020515 263184776 263128757 262713432 262241135 262063751 261893501
3282 261893501 261468410 261062622 260917187 260866890 260824432 260794868 260749588 260701656 260718117 260605583 260110855
3293 260110855 259478340 258841286 258276711 257960548 257727623 257394066 257191429 257374287 257688522 258029213
3303 258029213 258199921 257892132 257334480 256597996 255844593 255290508 254840622 254431496 254183998 254344711
3313B54344711J25389m22935n18093l10192j65444Q3924J31836L0746j25160m37966
3323B52736816n94387o85215o62079n07602l43075k2659j0491k68707m85172q78086
3333B48279343q88119n13325l23753j68343q3675J6212j78585q15143r97792r42459
3343B43384361o80923N7449K21977n1498k56767n88417p74632r45568q55923m15554
3353B39094505k31285j74980j54743j74770l10898o32038p86782q86440q39462n79129
3363B34323978m66098l75290m47026q41846p79400k70595n4856K0752Q1291J92414
3373B31383324l4809p46479r69887q91686p40776k42004k69890q64029r94434r18637
3383B24710693o36558J02272K95410M4823n6038j90258k19593o6986j79520n87959
$$ plain form
3313 254344711 254470100 254047165 253529072 253218880 253053436 253137360 253269196 253299942 253174782 252736816
3323 252736816 252142429 251457214 250795135 250287533 249944458 249921799 249911308 249642601 249157429 248279343
3333 248279343 247391224 246877899 246554146 246385803 246302128 246318340 246139755 245324612 244326820 243384361
3343 243384361 242703438 242760887 242982864 242931366 242674599 242086182 241311550 240365982 239510059 239094505
3353 239094505 238863220 238688240 238533497 238358727 238047829 237415791 236629009 235742569 234903107 234323978
3363 234323978 233857880 233482590 233035564 232193718 231414318 231143723 231088867 231109619 231190910 231383324
3373 231383324 231348515 230602036 229632149 228740463 227999687 227757683 227487793 226623764 225629330 224710693
3383 224710693 224074135 224176407 224471817 224516640 224460602 224270344 224050751 223983765 223804245 223216286
3393B23216286p23114p60079n71022n474K05746K71797Q3694o02245p02152l32108
3403B20081329j12056K04086K49863K9316j09673k64168l95527o36577m94728J47819
3413B18699684L25928L45001n5084j234779j494408j144409o42777N15709P65801K31742
3423B16312408k0256l31878m03176j87397j74522l92914k40078L91007M68254N4111
3433B15475559o9866o1035p3185q5831k8610J30653J90983L31879L4084q46615j217136
3444B13780880j559258j041412P70817J307487R36509P54814L83377K38666K79675
3453B15851555K53429K97299J13258m21047n19505l18069o2218N42641N59807n9605
3463B16237545j83811l0518J36128N72204N15461j32560k16485J44482K70596K56538
$$ plain form
3393 223216286 222493172 221733093 221162071 221156597 221362343 221634140 221717834 221115589 220413437 220081329
3403 220081329 219969273 220173359 220423222 220452538 220342865 220078697 219683170 219046593 218551865 218699684
3413 218699684 219025612 219370613 219315529 218080750 216586342 215441933 214799156 215314865 216080666 216312408
3423 216312408 216292152 215960274 215557098 215369701 215195179 214802265 214562187 214953194 215421448 215475559
3433 215475559 215405693 215344658 215271473 215185642 215157032 215287685 215478668 215810547 215844631 214998016 213780880
3444 213780880 212221622 211180210 211951027 213258514 214195023 214949837 215333214 215571880 215851555
3453 215851555 216104984 216402283 216515541 216094494 215574989 215256920 215194702 215737343 216297150 216237545
3463 216237545 216053734 216023216 216159344 216731548 217247009 217114449 216897964 217042446 217313042 217569580
3473B17569580M03652Q49476P41501K13127m19121j788635j681080o923O60667J049766
3483B17592010Q21114n72929o04630N92709J022339J235256J022796J20888k05993
3492B21023560l13759m3869Q75702J196632J454830P54605j402150k130260k290497
3501B19124794j327286J821060K350083P78675j65939j757870j630535M86374J143932
3510B20823288J004448Q64277K55585K52723P84626J059780J470814J235008L59288
3519B28109837m03881j619111j781921p42207o07967j292458j037139r537P01446J576882
3529B22893944J781463J440545Q85009m33216o55651j14918O58989K421379K680531
3538B31558075J857529P58171j249790k443562l824692l113041K85149J714706K589932
$$ plain form
3473 217569580 217973232 218822708 219564209 219777336 219358215 217569580 215888500 215881577 216542244 217592010
3483 217592010 218413124 217840195 217235565 217828274 218850613 220085869 221108665 221229553 221023560
3492 221023560 220709801 220665932 221541634 222738266 224193096 224947701 223545551 221415291 219124794
3501 219124794 217797508 219618568 221968651 222747326 222581387 220823517 219192982 219679356 220823288
3510 220823288 221827736 222692013 222947598 223200321 223984947 225044727 226515541 227750549 228109837
3519 228109837 227705956 226086845 224304924 223562717 222954750 221662292 220625153 220615616 221317062 222893944
3529 222893944 224675407 226115952 227000961 226567745 225912094 225797176 226456165 228877544 231558075
3538 231558075 233415604 234173775 232923985 230480423 226655731 223542690 223827839 225542545 228132477
3547B28132477J906166j467934k002716m61349O79245K718696K933274J242866O88553
3556B34369278K35329R80377L835182M053116L079662j21364p683030j0036945r744396
3565B18967209o129990L952980P241020N851975M578114J124858j23748K05993K31991
3574B35900402N25723O80675L54061J321793M100303M847527N178452K473125m707336
3583B50674725p989178j0682564p922172K765655O619911P092476N135307k239952
3591B43454208m032135j666774m43211J696816J818428n04036o34652M56086K012977
3600B42157707N743256N570888J972199q83808n584717n952129j845112o676J351109
3609B42522717J817951N76477J304874N466461L527890n409966q218288q565197m909268
$$ plain form
3547 228132477 230038643 228570709 226567993 226106644 226785889 229504585 232437859 233680725 234369278
3556 234369278 234604607 235584984 239420166 243473282 246552944 246431580 238748550 228711605 218967209
3565 218967209 212837219 216790199 224031219 229883194 234461308 235586166 235462418 235668411 235900402
3574 235900402 236426125 237106800 237460861 238782654 242882957 247730484 252908936 255382061 250674725
3583 250674725 242685547 232002983 224080811 226846466 233466377 240558853 245694160 243454208
3591 243454208 239422073 237755299 237312088 239008904 240827332 240323296 239688644 240144730 242157707
3600 242157707 247900963 253471851 255444050 254560242 248975525 243023396 241178284 241171608 242522717
3609 242522717 244340668 244917145 246222019 251688480 255216370 249806404 241588116 233022919 228113651
3618B28113651N285263J0331631J4078140J2818108O657829j121998j5655994j9688129
3626B40818501j6988755r735355R320507J3362884M014264J597633J741409J606713
3634B45737801K388000K143364L06854J081696M414329O315003Q674621P917405N939941
3643B84919014j269798j8583794k2505989j6969910r739647N457879J1291732J1843682
3651B44443169Q116722n109062p957230k970200J44711N488872O364346K185822J989116
3660B52696266M444618N833626Q848191O438007k233257o772995j1796494r238701
3668B48219261M757881O694794N79834o122837k2395611j9774666M185906J1237869
3676B27382431P291069O951809O077518O631394R726276Q944264O078014L72639j1334648
$$ plain form
3618 228113651 233398914 243730545 257808685 270626793 277284622 276162624 260506630 240818501
3626 240818501 223829746 214094391 223414898 236777782 240792046 242389679 244131088 245737801
3634 245737801 248125801 250269165 250576019 251657715 256072044 262387047 271061668 278979073 284919014
3643 284919014 283649216 265065422 242559433 225589523 215849876 221307755 232599487 244443169
3651 244443169 252559891 247450829 239493599 236523399 236668110 242156982 248521328 250707150 252696266
3660 252696266 257140884 262974510 271822701 278260708 276027451 269254456 257457962 248219261
3668 248219261 252977142 259671936 260251770 254128933 231733322 211958656 216144562 227382431
3676 227382431 234673500 241625309 247702827 254334221 264060497 273004761 279082775 279455414 268120766
3685B68120766j5639077j6173820j1813660J364003O543159O623974O822128N305996
3693B51153469M184971L115654J360645j170406l378620p428646n760918K364655O427764
3702B50868568J0151368R162902L314267k431164j1927109j4724502j3147583q350621
3710B22916126L120671Q603553J1563797J0801068M383335J236915o47087k159576
3718B59818802k995262l485203l690968l035774j804352N65529M837265P394333J1197796
3727B68802166Q018742l822327r381294j2168179j3090381j2967339p614365N217305
3735B22994328J2347221J9216289J7241478N041848l278008j4607925j5495301o187667
3743B37272263Q49247J5097141J1094818j6224632k1132946j0144711k931595Q280030
$$ plain form
3685 268120766 252481689 236307869 224494209 225858212 232401371 239025345 245847473 251153469
3693 251153469 255338440 258454094 259814739 258644333 255265713 247837067 242076149 244440804 250868568
3702 250868568 261019936 270182838 273497105 271065941 259138832 244414330 231266747 222916126
3710 222916126 226036797 234640350 246204147 257005215 261388550 262625465 261978378 259818802
3718 259818802 256823540 253338337 249647369 246611595 244807243 245372772 250210037 257604370 268802166
3727 268802166 276820908 272998581 263617287 251449108 238358727 225391388 217777023 222994328
3735 222994328 235341549 254557838 271799316 276841164 273563156 258955231 243459930 237272263
3743 237272263 238121510 253218651 264313469 248088837 226955891 216811180 213879585 222159615
3751B22159615J2064476J0524025O675243l898144o550789l412246o10352N277634
3759B42229462O686210M741192K502442k230397l718147j948833k709637o655693n379429
3768B33517170J028538M519691Q009911P881164L783474P33624l288269n222321o345997
3777B44616985m610538K038956L330955K31972q52814j992722j317729J861095K917290
3786B46223450K413749K724877L834019L432979J477013M52995l84808n41210Q62122
3795B60495186j85967l250122o063690j2333412r499779N458355P893314M87328k843857
3804B40157356q272400n025138R853115J3766994J0731697P280121J57585m150619
3812B64498711q556366p899056L01361R62982m354705o810913j1109581p277260Q064270
$$ plain form
3751 222159615 234224091 244748116 251423359 247525215 240974426 237562180 236951828 242229462
3759 242229462 248915672 253656864 256159306 253928909 250210762 248261929 245552292 238896599 233517170
3768 233517170 234545708 239065399 247075310 254956474 258739948 259473572 256185303 250962982 244616985
3777 244616985 240006447 242045403 245376358 245608330 244755516 242762794 241445065 243306160 246223450
3786 246223450 248637199 251362076 255196095 258629074 260106087 260559082 260174274 259633064 260495186
3795 260495186 260309219 257059097 250995407 238661995 229162216 234620571 242513885 243001213 240157356
3804 240157356 231884956 226859818 236712933 250479927 261211624 268491745 268649330 264498711
3812 264498711 255942345 248043289 248344650 249307632 244952927 238142014 227032433 219755173 227819443
3821B27819443J1426449N336055L174057J201859R91592L563881L263245m311k09312
3830B56562958L236999J948128l667126o858349j0528335r818306m017105q29697K006989
3839B28036156L143806J464596K781620O265888R419441J5208950J4265061Q660812
3847B89246330n28106j8472901k5564441k8408299k0193806N919705J5756607J5740623
3855B33495712J4351368P670403K888927l011246n151500m078160k485027J904965
3863B45585442K676963J204262j593590q853683q947849k144566R98249L023148M317531
3872B36265907M490605M715213N858880L278503n043030o396770j625309p0572J076946
3881B42550373p9155o309986m638195O599426P772923R31740k495041p629166n415440
$$ plain form
3821 227819443 239245892 244581947 247756004 248957863 249949455 253513336 256776581 256772270 256562958
3830 256562958 259799957 261748085 258080959 251222610 240694275 230875969 226858864 226029167 228036156
3839 228036156 231179962 232644558 235426178 241692066 251111507 266320457 280585518 289246330
3847 289246330 288718224 270245323 244680882 216272583 196078777 201998482 217755089 233495712
3855 233495712 247847080 255517483 258406410 255395164 250243664 246165504 243680477 245585442
3863 245585442 248262405 249466667 247873077 239019394 230071545 227926979 228925228 231948376 236265907
3872 236265907 240756512 245471725 251330605 254609108 249566078 243169308 241543999 241473427 242550373
3881 242550373 242471218 236161232 231523037 238122463 245895386 246827126 244332085 236702919 231287479
3890B31287479O318798R826661Q702526O315231M05312l361226o958484q157730o536484
3899B37842083o013622o472836m460811K12440L330689O834526P174720L635178K626648
3908B44709015L307571K631436J242389l91006l033142m096985m449139l211498P82967
3917B37491608J985073J270542O84967q61397j057396l45955P30515L628025L062496
3926B46588478j146564k995243m378567l723145l95775J496315L356228L678551K323380
3935B44803658J354942J82876q98361k470512k501240j076698J12285K438088K100696
3944B44045734j294136k372036k459278j628628J008034J968136J991749J599312J65462
3953B43024349l28541j17073k45552n05218o87123j033535p84645J76430O20117R98268
$$ plain form
3890 231287479 237606277 247432938 256135464 262450695 262856007 259494781 252536297 244378567 237842083
3899 237842083 231828461 225355625 220894814 221107254 224437943 231272469 238447189 242082367 244709015
3908 244709015 248016586 250648022 251890411 251499405 248466263 244369278 239920139 236708641 237491608
3917 237491608 239476681 240747223 241432190 240570793 239513397 239167442 239897957 243525982 246588478
3926 246588478 245441914 242446671 238068104 234344959 233949184 235445499 238801727 242480278 244803658
3935 244803658 246158600 246341476 245443115 242972603 240471363 239394665 239506950 241945038 244045734
3944 244045734 242751598 240379562 237920284 236291656 237299690 239267826 241259575 242858887 243024349
3953 243024349 242695808 242578735 242333183 241827965 241140842 240107307 239322662 239499092 240119209 241117477
3963B41117477P31240o02494p36961K60124L90282n9586k41527m56562l50952J74522
3973B40225563L66211L84083L39031J67122J2646k98748k14329M03404M48227l109
3983B41830101j51863q2741k57244p57923p93228m04358k20299m9362l2425l54519
3993B38726139j37081P25975R31511O67801M83284Q6288R1553
4000B41575470
$$ plain form
3963 241117477 241848717 241246223 240509262 240769386 241159668 241100082 240858555 240401993 240051041 240225563
3973 240225563 240591774 240975857 241314888 241482010 241494656 241195908 240981579 241384983 241833210 241830101
3983 241830101 241678238 241595497 241338253 240580330 239787102 239382744 239162445 239113083 239080658 238726139
3993 238726139 238589058 239315033 240246544 240914345 241397629 241483917 241575470
4000 241575470
##END=$$ End of the data block
