##TITLE=$$ Begin of the data block
##JCAMP-DX=5.00 $$ ACD/SpecManager v 10.08
##SPECTROMETER/DATA SYSTEM=16PC
##DATE=Mon Sep 30 10:57:28 2013
##DATA TYPE=INFRARED SPECTRUM
##DATA CLASS=XYDATA
##ORIGIN=
##OWNER=
##NPOINTS=3601
##FIRSTX=400.00000000
##LASTX=4000.00000000
##MAXX=4000.00000000
##MINX=400.00000000
##MAXY=37.30628586
##MINY=9.84768867
##XFACTOR=1.0000000000
##YFACTOR=0.000000100000000
##FIRSTY=34.05208588
##DELTAX=1.00000000
##XUNITS=1/CM
##YUNITS=TRANSMITTANCE
##XYDATA=(X++(Y..Y))
400C40520859j7192612r315243J5739193J7154007m057655j1135368j2472611j1258602
$$ 340520859 323328247 314013004 329752197 346906204 342848549 331713181 319240570 307981968
408C07981968n074749m06971O350269P258187K175102l94592m796257k153645J0911236
$$ 307981968 302907219 302500248 308850517 316108704 318283806 317889214 313092957 310939312 321850548
417C21850548J2010307J676331J65710N392304N444068K644310l89366p919311n516510
$$ 321850548 333860855 335537186 335702896 341095200 346539268 349183578 348794212 340874901 335358391
426C35358391Q883934J2592316J0934829N293389j0358353j3297768m429359k859612
$$ 335358391 344242325 356834641 367769470 373062859 362704506 349406738 344977379 342117767
434C42117767n507431n590439n895385k058983R156227J0436058K786369n02815k582283
$$ 342117767 336610336 331019897 325124512 323065529 332221756 342657814 345444183 344941368 342359085
443C42359085m142761n861282m340668J484146L953934M989853M564781J962166P2250
$$ 342359085 338216324 332355042 328014374 329498520 333452454 338442307 343007088 344969254 345041504
452C45041504k346497l220329l163567j795043K563209K815971p16438k223015m211921
$$ 345041504 342695007 339474678 336311111 334516068 337079277 339895248 339178810 336955795 332743874
461C32743874k464028N030861O012192K100944r26246p207642n969276M292946O787796
$$ 332743874 330279846 335310707 341322899 343423843 342497597 335289955 329320679 333613625 340401421
470C40401421M572868K208710l373871m458657q36372j061935n459290m177818K908935
$$ 340401421 344974289 347182999 343809128 339350471 338514099 337452164 331992874 327815056 330723991
479C30723991N444069O388893M253388k909660n823594o482162o188126l825683k555599
$$ 330723991 336168060 342556953 346810341 343900681 338077087 331594925 325406799 321581116 319025517
488C19025517j753808p57694P630J577606N347023M700889n00908l085861o172886
$$ 319025517 317271709 316514015 316521645 318099251 323446274 328147163 327646255 324560394 318387508
497C18387508m460582L429413O679306Q143425P219314K655983N7678k445221k981186
$$ 318387508 313926926 317356339 324035645 332179070 339398384 342054367 342112045 339666824 336685638
506C36685638j173706m01039J36872O15577R67751J285324J927147J362762l52859
$$ 336685638 335511932 335110893 335247765 335863342 336831093 338116417 340043564 341406326 341053467
515C41053467j910897m129409n048027n095520m518509k932778j632194P48634M0283
$$ 341053467 339142570 335013161 329965134 324869614 320351105 317418327 315786133 316534767 316575050
524C16575050l930568o303788q521080r677887p578601j1912117k4923096k7944069
$$ 316575050 312644482 306340694 297819614 288141727 280563126 268651009 243727913 215783844
532B15783844k5133381j8525600k456665K450714j202m400005j8296967j6902447k875804
$$ 215783844 190650463 172124863 169668198 172118912 172117710 167717705 149420738 132518291 129642487
541A29642487R630918K8786898L6067009L4553299L0439376J9081574J2857685Q774052
$$ 129642487 139273405 168060303 204127312 238680611 269119987 288201561 301059246 309833298
549C09833298O426315P196426N958786L301888J993904J551361J137009J417656N62439
$$ 309833298 316259613 323456039 329414825 332716713 334710617 336261978 337398987 338816643 339379082
558C39379082k256165j898537J964570K876510K377281P61032l792991m295807r70840
$$ 339379082 337122917 335224380 337188950 340065460 342442741 343203773 339410782 335114975 334144135
567C34144135Q4152N8632K92320M14123N65758Q23746P37190K07443P8202O31065j03950
$$ 334144135 334228287 334286919 334579239 334993362 335559120 336382866 337120056 337327499 337405701 338036766 337932816
578C37932816k709122k885819p78198j10893l0975k26021j271019j181603L6240M20570
$$ 337932816 335223694 332337875 331559677 331448784 331417809 331191788 329920769 328739166 328775406 329195976
588C29195976m7912O66847L234863K939682p22389j020432J847496J941681k34108
$$ 329195976 329148064 329814911 333049774 335989456 335267067 334246635 336094131 338035812 337801704
597C37801704p58171p7247l26653j716118j271743J604576J543998j450538k023239
$$ 337801704 337043533 336966286 336639633 334923515 333651772 335256348 336800346 335349808 333326569
606C33326569q33283o02455j063843n66482J120109J420250N06401K62032N29518N3177
$$ 333326569 332493286 331890831 330826988 330260506 331380615 332800865 333307266 333569298 334098816 334151993
616C34151993j563568j482010J07536J125832K628326K470474R6321j28746J798401
$$ 334151993 332588425 331106415 331213951 332339783 334968109 337438583 337534904 337406158 339204559
625C39204559J497727p57447j683235k549400j562843K470970K980957O61850o97136
$$ 339204559 340702286 339944839 338261604 335712204 334149361 336620331 339601288 340263138 339566002
634C39566002k930641k489319J894455J600990l040314m728813o373863l639221N847664
$$ 339566002 336635361 334146042 336040497 337641487 334601173 329872360 323498497 319859276 325706940
643C25706940Q259544N729942L548851q66661k475013k041130j547776n264O08902
$$ 325706940 333966484 339696426 343245277 342378616 339903603 337862473 336314697 336309433 336918335
652C36918335O75201O48041J68801K14118Q67844Q15849L14942l47862j785508j833915
$$ 336918335 337593536 338241577 338410378 338624496 339492340 340308189 340623131 340275269 338489761 336655846
662C36655846k070427J650581J4399757J1745949p736206j3916015j4081002r213943
$$ 336655846 334585419 336236000 350635757 362381706 354645500 340729485 326648483 317434540
670C17434540P164230J0117569J281967r53674O0081o66389k563477k921829j494140
$$ 317434540 324598770 334716339 335998306 335044632 335104713 334438324 331874847 328953018 327458878
679C27458878j982232m216194n176067o588688m566917J726379N055199P292976Q181343
$$ 327458878 325476646 321260452 316084385 309495697 304928780 306655159 311710358 319003334 327184677
688C27184677P734528O153831K347946M79699k18621q40912r71336j182060j272202
$$ 327184677 334919205 341073036 343420982 343900681 343682060 342841148 341869812 340687752 339415550
697C39415550j475105j856079j921425j944771j327514K76107Q84018J040497N47867
$$ 339415550 337940445 336084366 334162941 332218170 330890656 331166763 332050781 333091278 333639145
706C33639145j224747j556625k52266q16574k496262m800529o996422j2510052k4737835
$$ 333639145 332414398 330857773 330605507 329788933 327292671 322492142 315495720 302985668 278247833
715B78247833k6669731k3746033j1216621J8574219L0250549L1202812K7241936J2073517
$$ 278247833 251578102 227832069 216615448 235189667 265440216 296643028 323884964 335958481
723C35958481N063553K213211J50451N74570N7221p12853j065483j211662r77288J2894
$$ 335958481 341022034 343235245 343385696 343960266 344017487 343304634 342239151 341027489 340050201 340063095
733C40063095Q0109p10259r41963r51538q10623k47002k78015r22432j089821j098861
$$ 340063095 340143204 339432945 338490982 337539444 336728821 336481819 336203804 335281372 334191551 333092690
743C33092690p68166J27792N03273N82238N51681K58217J28517K70348j75705j820565
$$ 333092690 332324524 332452316 332955589 333537827 334089508 334347725 334476242 334746590 334570885 332750320
753C32750320j363983K082825J663666k832642l705025j725196j508255j930466k873650
$$ 332750320 331386337 333469162 335132828 332300186 328595161 326869965 325361710 323431244 320557594
762C20557594n252609n527496m566193k439957J833420M395027O754628O730556L715515
$$ 320557594 315304985 309777489 305211296 302771339 304604759 308999786 315754414 322484970 326200485
771C26200485K317200J695137O02989j123695j584511p26700o63528q70209j335640
$$ 326200485 328517685 330212822 330815811 329692116 328107605 327380905 326717377 325847168 324511528
780C24511528k687950k426376k80838J67350p03087q26835n74837n31425l97683p85350
$$ 324511528 321823578 319397202 319116364 319283714 318580627 317753792 317178955 316647530 316249847 315464497
790C15464497k030621k179375j333713j040707q39939j025906j544494k319088m052639
$$ 315464497 313433876 311254501 309920788 308880081 308040142 307014236 305469742 303150654 299098015
799B99098015m012108j844406j696587l264656l620148k896080l492126n148888o504287
$$ 299098015 295085907 293241501 291544914 288280258 284660110 281764030 278271904 273123016 266618729
808B66618729q224488r009838q902073r036789r560814q751392o757259m708767j323700
$$ 266618729 258394241 249384403 240482330 231445541 221884727 213133335 206376076 201667309 200343609
817B00343609o02245j645089m049530r291191j1872043j3106823j3236046j1610747
$$ 200343609 199741364 198096275 194046745 184755554 172883511 159776688 146540642 134929895
825A34929895j0586977j0081052q073569m729986j408577L862143M551649P46488j370668
$$ 134929895 124342918 114261866 106188297 101458311 100049734 103911877 108463526 109210014 107839346
834A07839346n352020l174782N635023J1156797J6913414J8730641J6538381J4791241
$$ 107839346 102487326 99312544 104947567 116104364 133017778 151748419 168286800 183078041
842A83078041J1606941J0056973R600162R328118J0142097R343624O991387N548477
$$ 183078041 194684982 204741955 214342117 223670235 233812332 243155956 250147343 255695820
850B55695820L864765M074326O583938P632256Q407593P915496O003857M273167J789589
$$ 255695820 259560585 263634911 270218849 277851105 286258698 294174194 300178051 304451218 306240807
859C06240807O86149Q25653O22025N58624K87056l79791l48091O58989M37488j133442
$$ 306240807 306926956 307752609 308374634 308933258 309220314 308840523 308492432 309151421 309588909 308455467
869C08455467j368294r2010o93569l298054m018536k723445l829251p239818q924008
$$ 308455467 307087173 306995163 306301594 303003540 298985004 296261559 292432308 285192490 276268482
878B76268482j0777721r250145m592438O47316Q559456J3328323J7013321J7189484
$$ 276268482 265490761 256240616 251648178 252295494 260854950 274183273 291196594 308386078
886C08386078J3259659J0037651N637893K786408O95228k10304N64118O13212M51813
$$ 308386078 321645737 331683388 337321281 340107689 340802917 340592613 341156731 341769943 342221756
895C42221756M23889M89006M62036M06037K52723q7013j91231j59492j7166M94003
$$ 342221756 342645645 343134651 343596687 344002724 344255447 344168434 343977203 343817711 343800545 344294548
905C44294548L66440m52271p46727q16803o79512j06315L090m51317j71433J050454
$$ 344294548 344660988 344208717 343461990 342645187 341965675 341859360 341862450 341411133 341239700 342290154
915C42290154J082420N264l75290m36058m77791m33426k70385K18620J71432l56445
$$ 342290154 343372574 343377838 343002548 342566490 342088699 341655273 341384888 341603508 341774940 341418495
925C41418495p28340j239548j348991j147270q12989N0545L2883q17299j284599j391411
$$ 341418495 340690155 339450607 338101616 336954346 336141357 336191902 336224785 335407486 334122887 332731476
935C32731476k266617m240761m863739m790554l854275j406440k09561K82040O46839
$$ 332731476 330464859 326224098 321360359 316569805 312715530 311309090 311099529 311381569 312028408
944C12028408L96977R04083K318611K664566K176285J890907J534195J165886P00722
$$ 312028408 312425385 313329468 315648079 318312645 320488930 322379837 323914032 325079918 325780640
953C25780640M16259N51720j29967j119117l217698p619133q750209p660389n727539
$$ 325780640 326196899 326748619 326618652 325499535 322281837 314662704 305912495 298252106 292524567
962B92524567j140347K33173p60803j639366m028320l909340j392365n7449J050453
$$ 292524567 291384220 291617393 290856590 289217224 285188904 281279564 279887199 279829750 280880203
971B80880203J690636J385460K283325M640808N281696M413357M379044N121708M526138
$$ 280880203 282570839 283956299 286239624 290880432 296162128 300575485 304954529 310076237 314602375
980C14602375K428303J596908J728325J266938M45594j13945p21473p63398j18026
$$ 314602375 317030678 318627586 320355911 321622849 322068443 321954498 321233025 320469627 320351601
989C20351601J10626K44369R8954m55132p16705p68891r82284j236191j643429k276897
$$ 320351601 320462227 320706596 320805550 320350418 319633713 318864822 317882538 316646347 315002918 312726021
999C12726021k732754l332844l196964j989117j935959k070426m036675p393360j2263050
$$ 312726021 309993267 306660423 303463459 301474342 299538383 297467957 293431282 286037922 273774872
1008B73774872k1193047k3874988k6447773j4665127J6807308L2383919M3495178M0003319
$$ 273774872 252581825 228706837 202259064 187593937 204401245 236785164 280280342 320283661
1016C20283661J6211014N044708j225472m608650k988815k824059k459983k057076
$$ 320283661 336494675 341539383 340313911 335705261 332716446 329892387 327432404 325375328
1024C25375328j356125j233101j623878j909733k442360k436161j875153j609802j368065
$$ 325375328 324019203 322786102 321162224 319252491 316810131 314373970 312498817 310889015 309520950
1033C09520950j390457j774063j891613j905918j793385j623859j142273j58539L08743
$$ 309520950 308130493 306356430 304464817 302558899 300765514 299141655 297999382 297840843 298149586
1042B98149586M09126N59807O70681O81629N97477M57039K40574j1444m01745n61714
$$ 298149586 298558712 299118519 299789200 300470829 301068306 301525345 301765919 301754475 301352730 300791016
1052C00791016n23568n27134m17957n76477r71794j348495j935959k072106j773357
$$ 300791016 300267448 299740314 299322357 298745880 297774086 296425591 294489632 292417526 290644169
1061B90644169j637211j401901j519203k005349k344856k640953k996216l542652l652820
$$ 290644169 289006958 287605057 286085854 284080505 281735649 279094696 276098480 272555828 268903008
1070B68903008l238907l282318l179551m364967p079582q927841j0413399j1917343
$$ 268903008 265664101 262381783 259202232 254837265 247757683 238829842 228416443 216499100
1078B16499100j4144898j3894577j1904945q425484l267994L062248J1854172J8455506
$$ 216499100 202354202 188459625 176554680 168129196 164861202 167923450 179777622 198233128
1086A98233128K5534381K7070294K3930797J8665772Q766174J716862m463196r337425
$$ 198233128 223767509 250837803 274768600 293434372 302200546 303917408 299454212 290116787
1094B90116787j3073444j5438080j7652283j5067558p028122q07514P219314R823322
$$ 290116787 277043343 261605263 243952980 228885422 221857300 221049786 228269100 238092422
1102B38092422O933442O063003N312672M764557M791012L817100J147976J134624L171216
$$ 238092422 245025864 251088867 256401539 261166096 265957108 269774208 270922184 272056808 275228024
1111B75228024N327224R338131J0189305Q284568P019997N297413M110565L303299
$$ 275228024 280555248 289893379 300082684 308367252 315387249 320684662 324795227 328098526
1119C28098526K505302J841774J181145M48723P1259K0980j9302J43776N1956k96364
$$ 328098526 330603828 332445602 333626747 334075470 334146729 334167709 334148407 334292183 334344139 334047775
1129C34047775m38690n01861m44642j41868j36833m93317m13399K56310J02043r44138
$$ 334047775 333609085 333107224 332662582 332520714 332383881 331890564 331477165 331733475 331835518 330891380
1139C30891380j198082j014709o58722K47726M56086J43280j49956p06902r36279r27925
$$ 330891380 329693298 328678589 328019867 328267593 328723679 328866959 328717003 328010101 327073822 326145897
1149C26145897r14803p84912p55539p58896q51364j238594j042137q5335M5052l23773
$$ 326145897 325231094 324446182 323690643 322931747 322080383 320841789 319799652 319714317 319759369 319435596
1159C19435596r16004k060890k717972l075599l422738m071712l484974j944542J37100
$$ 319435596 318519592 316458702 313740730 310665131 307242393 303170681 299685707 297741165 297878265
1168B97878265L781090N314827N526295M935512K757302J610527J041412K45552p32422
$$ 297878265 301659355 306974182 312500477 317435989 320193291 321803818 322845230 323090782 322358360
1177C22358360j268120j447944j552334j152287j684894k897263m365673p042885p541427
$$ 322358360 321090240 319642296 318089962 316937675 315252781 312355518 307989845 300946960 293405533
1186B93405533p286072l965378L955364Q025170J0948658J0355949M908791K329368
$$ 293405533 286119461 282154083 286109447 294134617 305083275 315439224 320348015 322677383
1194C22677383Q69255k00996n75523p49588l89595l35694l24249n71709j190662j514683
$$ 322677383 323546638 323345642 322770119 322020531 321630936 321295242 320970993 320399284 319208622 317693939
1204C17693939j576175j912365k436638k958756m135132l534088j319656P32670L947506
$$ 317693939 316117764 314205399 311768761 308810005 304674873 301140785 299821129 300553799 304501305
1213C04501305M801025L598938K641182R25064J60465J48297k8382j33266j94798j23729
$$ 304501305 309302330 312901268 315542450 316467514 316627979 316776276 316747894 316614628 316419830 316296101
1223C16296101k50340o17504p26700n56240o91166j084575j342526j733074j579037
$$ 316296101 316045761 315428257 314701557 314145317 313454151 312369576 311027050 309293976 307714939
1232C07714939r36508k59647Q06579J292954J228561J463661K089958J888524Q35666
$$ 307714939 306778431 306518784 307325363 308618317 309846878 311310539 313400497 315289021 316124687
1241C16124687K45094k57034m89464m33445l45478L2921p7019q39233q21114j24206
$$ 316124687 316369781 316112747 315623283 315189838 314844360 314877281 314800262 313961029 313139915 313015709
1251C13015709K25067O52313M79698n48858p32174o1989k73456j408577j566430r08851
$$ 313015709 313240776 313893089 314372787 313823929 313091755 313029766 312756310 311347733 309781303 308872452
1261C08872452o92120o09646o33697r48200q48294j77612k69432r90372j540432k277374
$$ 308872452 308180332 307570686 306936989 305988789 305140495 304962883 304693451 303703079 302162647 299885273
1271B99885273k573490k497444k403260k686252j412144J855354L433476M592647L931542
$$ 299885273 297311783 294814339 292411079 289724827 288312683 290168037 293601513 298194160 302125702
1280C02125702N49774n50499l07312K6455J304874J361599L92914k23408q09421j456261
$$ 302125702 302675476 302124977 301817665 301844120 303148994 304510593 304903507 304680099 303870678 302414417
1290C02414417k297401k710591k554893l019791m960556l767471P20482L247032N700111
$$ 302414417 300117016 297406425 294851532 291831741 286871185 283103714 283824196 287071228 292771339
1299B92771339N781403L145943J469612l50228j580734k559414k670765k147903o74248
$$ 292771339 298552742 301698685 303168297 302818069 301237335 298677921 296007156 293859253 293185005
1308B93185005K902489L654022K048493J138191k38419m88281O74019N10444q04405
$$ 293185005 296087494 299741516 301790009 302928200 302689781 302201500 302875519 303385963 302581558
1317C02581558j232395j158237j083146p49816o87600r34829q09441k79427j56402
$$ 302581558 301349163 300190926 299107780 298357964 297670364 296735535 295926094 295646667 295490265
1326B95490265l44505m17004n36442m79221k28634p7972J1444J77154P99179K18621
$$ 295490265 295145760 294728756 294192314 293713093 293484459 293406487 293417931 293595085 294394264 294612885
1336B94612885j605759k853394m671802m291535r34600m84944k342701l024578l068199
$$ 294612885 293007126 290153732 285481930 281190395 280255795 279770851 277428150 274403572 271335373
1345B71335373l806610n340576n934220o037254n588989m395256l294468k170811o52065
$$ 271335373 267528763 262188187 256253967 250216713 244627724 240232468 236938000 234767189 234115124
1354B34115124J630535K826233L183594L555526M431019L001213k083072k618294M70390
$$ 234115124 235745659 238571892 241755486 245311012 249742031 252743244 250660172 248041878 248512268
1363B48512268K676487O498337O448269J735687J008034L530273L594151K837181M16050
$$ 248512268 251188755 257687092 264135361 265871048 266879082 270409355 274003506 276840687 277256737
1372B77256737o110688o134490K36263K824077M005890M448891L566742L036041K090683
$$ 277256737 271146049 265011559 265247822 268071899 272077789 276526680 280093422 283129463 285220146
1381B85220146K115975M094581K707024k502442m392871m957200l366470J881123L946781
$$ 285220146 287336121 291430702 294137726 291635284 287242413 282285213 278918743 280799866 284746647
1390B84746647N513439K687912p858982q919239n19028K35310m482746o263256p233143
$$ 284746647 290260086 292947998 285089016 276169777 275650749 275886059 271403313 265140057 257906914
1399B57906914p296086n761146n491257q344898m026642R343147J3949395J3457069
$$ 257906914 250610828 244849682 239358425 231013527 226986885 236330032 250279427 263736496
1407B63736496J1018028L486634K90641n98449m94957J559028L044358O615409M171601
$$ 263736496 274754524 278241158 278531799 277933350 277438393 278997421 282041779 288657188 292828789
1416B92828789o149292q798828p243634l165950Q939247Q732338n451699o616344L423939
$$ 292828789 286679497 277880669 270637035 267471085 276410332 285142670 279690971 273074627 276498566
1425B76498566M930248J230240j249314o116390n367756J419545M548797Q957615M591465
$$ 276498566 281428814 282659054 281409740 275293350 269925594 271345139 275893936 284851551 289443016
1434B89443016j3481140j5483131l656884J189480M932652M873027j085758j858711
$$ 289443016 275961876 260478745 256821861 258011341 262943993 267817020 266731262 264872551
1442B64872551J640549J979122Q09917j046428n959988n274544J852284L392219q32805
$$ 264872551 266513100 268492222 269302139 268255711 262295723 257021179 258873463 262265682 261432877
1451B61432877J917839J5821228J1427402j4363994j9704590j0597458m878998L674965
$$ 261432877 263350716 279171944 290599346 276235352 256530762 245933304 241054306 244729271
1459B44729271Q000870J1581173P549038q959523j1622429k997875Q22296M137040
$$ 244729271 252730141 264311314 271860352 262900829 251278400 248280525 249102821 253239861
1467B53239861N840549Q307934L142128j4671326j6681213l718128r12190m432449
$$ 253239861 259080410 267388344 270530472 255859146 239177933 235459805 234547615 230115166
1475B30115166m472962k489814k465249l844261m867553p560959n583535J911412N194912
$$ 230115166 225642204 223152390 220687141 216842880 211975327 204414368 198830833 200742245 205937157
1484B05937157O628494O492863M457225J563321n887032m146099Q288860J1656513
$$ 205937157 212565651 219058514 223515739 225079060 219192028 215045929 223334789 234991302
1492B34991302J0728379O177654o242046j0219574p557621p359505p211933p665863
$$ 234991302 245719681 251897335 245655289 235435715 227878094 220518589 213306656 205640793
1500B05640793r363651r184838q003235n446186m047889N953559L0071259L6487808
$$ 205640793 196277142 187092304 179089069 173642883 169594994 175548553 205619812 242107620
1508B42107620L0391464K2845040M841080J346588J4842510J0436764j4163018j4898529
$$ 242107620 272499084 295344124 300185204 301531792 316374302 326811066 312648048 297749519
1516B97749519Q631935J0762215l003120r018650j6577015j2155037J0845642J2505779
$$ 297749519 306381454 317143669 314140549 305121899 288544884 276389847 287235489 299741268
1524B99741268o689548q763790J462230N295258Q498916O710053j374722o181011j4791717
$$ 299741268 293051720 284287930 285750160 291045418 299544334 306254387 304879665 298698654 283906937
1533B83906937q450508K0135879K3038139N980492o005287k6981812k5733242K180100
$$ 283906937 275456429 295592308 318630447 324610939 318605652 291623840 265890598 268070698
1541B68070698P782936l928661l963948M026413N652676L599624J516839l551484l434906
$$ 268070698 275853634 271924973 267961025 271987438 277640114 281239738 282756577 279205093 275770187
1550B75770187L037682L010292n361557j847267K1289100J2871018l3535709m1019688
$$ 275770187 278807869 281818161 276456604 274609337 295898437 308769455 275233746 234214058
1558B34214058j8656960p056007Q998413R252777j1650085j2029877M486313J0723591
$$ 234214058 215557098 208501091 217499504 226752281 215102196 203072319 207558632 218282223
1566B18282223J4230976J1987190r14802j826287R155274R768257M113426j951218
$$ 218282223 232513199 244500389 243585587 241759300 250914574 260682831 264796257 262845039
1574B62845039j5599479j3997574N450249R523887L121605j30176m880200o161194
$$ 262845039 247245560 233247986 238698235 248222122 251343727 251213551 246333351 240172157
1582B40172157l800888l458977m190197m119167l610363l081798l051758j032353L507862
$$ 240172157 236371269 232912292 228722095 224602928 220992565 217910767 214859009 213826656 217334518
1591B17334518N951882P593155P874717O528130N182037K917061J781693J560936J066436
$$ 217334518 223286400 230879555 238754272 245282402 250464439 253381500 255163193 256724129 257790565
1600B57790565M36059L03993Q18023P50294M89483k94228k164840k539635j973152
$$ 257790565 258226624 258530617 259348640 260098934 260588417 260294189 258129349 255589714 253616562
1609B53616562q31356J404514L022919Q229027J913070k1872291k4230728o979218
$$ 253616562 252785206 254189720 257212639 265441666 267354736 245482445 221251717 214272499
1617B14272499j746178l32603l906708j7960090j9360295j2309074l134012J4760255
$$ 214272499 212526321 212193718 208287010 190326920 170966625 158657551 155523539 170283794
1625A70283794K1316777J8941383J8067131J5255928J3824692J5030632J0524979N57441
$$ 170283794 191600571 210541954 228609085 243865013 257689705 272720337 283245316 283802757
1633B83802757p521629k1237621j7840634P425080J2784957K401124J397361N543232
$$ 283802757 276281128 255043507 237202873 244627953 257412910 259814034 261211395 266754627
1641B66754627O636372R287605L252754j7610321j8488884k851715Q361817L0590057
$$ 266754627 273390999 282678604 285931358 268321037 249832153 246980438 255342255 285932312
1649B85932312K3018341k2561779l2502651j8478165p442703J4296303J8922806P100563
$$ 285932312 308950653 286388874 253886223 235408058 227965355 242261658 261184464 268285027
1657B68285027L989467O080151K246380r815922r763966J814595O925354J1919250
$$ 268285027 272274494 278354645 280601025 270785103 261021137 262835732 269761086 281680336
1665B81680336R384403l129005q410206j3123283p826081J5375595J5461693p997990
$$ 281680336 291064739 287935734 279525528 266402245 258576164 273951759 289413452 281415462
1673B81415462j2264728m152775Q55694R383659J0417939K290020K684345J6607055
$$ 281415462 269150734 264997959 265853653 275237312 285655251 287945271 290629616 307236671
1681C07236671O349087l9164066l7927628J1320114K1527062M477253Q5354k411366
$$ 307236671 313585758 274421692 236494064 247814178 269341240 273818493 273903847 271492481
1689B71492481J20640J2289524J2528172K720604l102303j2544861r223709J5474091
$$ 271492481 271613121 283902645 296430817 299151421 296049118 283504257 274280548 289754639
1697B89754639J0713329l0344257k9511910J2404442K0441513N130310o91185p136345
$$ 289754639 300467968 270123711 240611801 253016243 273457756 278588066 277896881 270760536
1705B70760536o592274L109932N679379L345718L478279N054722M794369M243851M94232
$$ 270760536 264168262 267278194 272957573 276303291 279781570 284836292 289630661 293874512 294368744
1714B94368744q151779j1997223j5668621j0359516R283771J3038635L566037M41303
$$ 294368744 286216965 274219742 258551121 248191605 257475376 270514011 274080048 274521351
1722B74521351j622200j055012M075050M466782K64645J89304L430367M506835Q755684
$$ 274521351 272899151 271844139 275919189 280385971 280650616 280839920 284270287 288777122 297532806
1731B97532806L07789l1765690k7881164J6370544K3765793L011475l499260o486664
$$ 297532806 297840595 266074905 238193741 254564285 278330078 281341553 277842293 271355629
1739B71355629n463600L142834M551410m74701k09312N324116M490146k104053n254746
$$ 271355629 265892029 269034863 273586273 273111572 272902260 278226376 282716522 280612469 275357723
1748B75357723q164406p229805k001285K115974R618035P924804o115684p316590L196488
$$ 275357723 267193317 259963512 257962227 260078201 269696236 277621040 271505356 264188766 267385254
1757B67385254M736175R10759k027740q969307o607056P893315R884357J123428p72953
$$ 267385254 272121429 273032188 271004448 262035141 255428085 263321400 273205757 274329185 273556232
1766B73556232J142979J461258L243942l50246j3373375j2775898J775017N896568
$$ 273556232 274699211 276160469 279404411 279054165 265680790 252904892 254679909 260576477
1774B60576477L509769L310204M211426J860142o082058n909214L508567L943940l968239
$$ 260576477 264086246 267396450 271607876 273468018 267385960 261476746 264985313 268929253 264961014
1783B64961014m542122J27315K730847O373882N941639J976719k579689j2658119j1480332
$$ 264961014 260418892 260546207 263277054 269650936 275592575 277569294 274989605 262331486 250851154
1792B50851154K507458O308785L526687K743721K214909L37600m169712m578342j193752
$$ 250851154 253358612 259667397 263194084 265937805 268152714 268490314 264320602 259742260 258548508
1801B58548508M74682K133617K462616J123199P89395J445770M77543k706986l126869
$$ 258548508 259023190 261156807 263619423 264742622 265532017 266977787 267455330 264748344 261621475
1810B61621475j355896p9860K164840K208710k67029q17776k43187K09580Q44707J691113
$$ 261621475 260265579 260185719 262350559 264559269 264292240 263474464 263231277 263440857 264285564 265976677
1820B65976677M302254K434501o339798o067752L897666N013943k43912l235817q421649
$$ 265976677 270278931 272713432 266373634 260305882 264203548 269217491 268973579 265737762 257316113
1829B57316113o605397M492760O557007J455059L0269J31855m82311k527008r03129
$$ 257316113 250710716 255203476 261760483 263215542 263245811 263377666 262895355 260368347 259465218
1838B59465218O190300O447067J504440k880821j1935463j0510216L680706O341686
$$ 259465218 265655518 272102585 273607025 270726204 258790741 248280525 251961231 258302917
1846B58302917q6288j072178J000881J132965O6281j70708J14441J19915J3123p5570
$$ 258302917 258216629 257144451 258145332 259278297 259344578 259173870 259288311 259408226 259421349 259345779
1856B59345779j86920k89917n44548l42369J47572R93023K916088K959251K072086
$$ 259345779 259158859 258868942 258324394 257982025 258129597 259122620 262038708 264997959 267070045
1865B67070045n88169p558117p848491j787892R47457L173122L302097N97477m07466
$$ 267070045 266481876 258923759 251075268 249287376 250234833 253407955 256710052 257307529 256900063
1874B56900063p02610q62828n85556n08079n12123m36554k46754k43187q29697r3937
$$ 256900063 256197453 255334625 254749069 254240990 253728867 253292313 253045559 252802372 251972675 251878738
1884B51878738L081322K312431k987403m090310k541294q90484L177395K950669k243748
$$ 251878738 254960060 257272491 254285088 250194778 247653484 246763000 249940395 252891064 250647316
1893B50647316l005028l26156L63807J40190J27793R9430j63555q90503r47457l70979
$$ 250647316 247642288 247316132 247679939 247820129 247947922 248047352 247883797 246993294 246045837 245674858
1903B45674858j50452J46866k20527j612435j851806j325112o63528N09033J317482
$$ 245674858 245524406 245671272 245450745 243838310 241986504 240661392 239997864 240506897 241824379
1912B41824379K466202K012253l34015j472950k915383j719474L829708L930339j500377
$$ 241824379 244290581 246302834 245968819 244495869 241580486 239861012 243690720 247621059 246120682
1921B46120682k330532J19686R96818J662255J522064J93138j98135J15165o2713o92368
$$ 246120682 243790150 243909836 244906654 246568909 248090973 248284111 248085976 248201141 248138428 247446060
1931B47446060p36713k26975p6999k88258N8651J161346J306534J064301j34239l669262
$$ 247446060 246709347 246482372 246405373 246117115 246175766 247337112 248643646 249707947 249573708 245904446
1941B45904446l454209Q48522J801491L43819J53999N89142N41687Q1062L6965M62761
$$ 245904446 242450237 243298759 245100250 245444069 245598068 246187210 246728897 246809959 246846924 247309685
1951B47309685L15189n42889n19752M48227N14278j63326l74546m09832l18069k8611
$$ 247309685 247624874 247081985 246562233 247010460 247524738 247361412 246986866 246577034 246258965 246230354
1961B46230354K22206Q28286M49409j315346j521835m69685R2755Q54721Q06332k76814
$$ 246230354 246452560 247280846 247730255 246414909 244893074 244423389 244516144 245370865 246177197 245900383
1971B45900383m87328k7408K384j85242l41663o60191o16302j08948o8207n33332m18664
$$ 245900383 245413055 245385647 245388031 245202789 244861126 244200935 243584633 243475685 243407478 242874146 242455482
1982B42455482L02315M36554j9321J38283J143932Q52814p88918j422157j825829j246452
$$ 242455482 242757797 243194351 243175030 243313313 244457245 245310059 244521141 243098984 241273155 240026703
1992B40026703J081467J340866l91236o06537L19252L80745k38189k68689K57493J97658
$$ 240026703 241108170 242449036 242057800 241451263 241770515 242151260 241913071 241644382 241901875 242099533
2002B42099533m42753n44548k34127j25656j05858j5011J88122J77841j03950j01090
$$ 242099533 241656780 241112232 240878105 240752449 240646591 240631580 240819702 240997543 240893593 240792503
2012B40792503K95411R0122q97885r51995j45207R6321N5313K3842j15394j85261k41509
$$ 240792503 241087914 241178036 240280151 239328156 239182949 239279270 239334583 239358425 239243031 239057770 238816261
2023B38816261k41279k10285q9646K31743K49615m3621j14918n6496l4332M2419k4547
$$ 238816261 238574982 238364697 238275051 238506794 238756409 238712788 238597870 238541374 238507042 238549461 238524914
2034B38524914l28541k98271J68800Q8234n54085p19795o61125m07715L25451M28200
$$ 238524914 238196373 237898102 238066902 238155136 237601051 236881256 236220131 235812416 236137867 236566067
2044B36566067n6515j91917j63308j68094j59016j28517O905r6322n90553n23090J58558
$$ 236566067 236509552 236317635 236154327 235986233 235827217 235698700 235705605 235609283 235018730 234495640 234654198
2055B34654198K91576J3352o2695j53084o676O23475M95910m74701p06176m42276k90871
$$ 234654198 234945774 234959126 234896431 234743347 234736671 235360146 235856056 235381355 234675179 234232903 233942032
2066B33942032n493L3626j38283k84900n79605n67665k93274l5286M28695M84219J12286
$$ 233942032 233936539 233970165 233831882 233546982 232967377 232399712 232106438 232071152 232499847 232984066 233096352
2077B33096352J907K8610%o7215m9839R0847P7000n2929j77860m12236m21276j89781
$$ 233096352 233098259 233126869 233126869 233059654 233009815 233100662 233177662 233124733 232946873 232534637 232113361 231923580
2089B31923580j16348j28746j19209j41621r1324P9403P4387q7738j88580l82671k73953
$$ 231923580 231807232 231678486 231559277 231417656 231326332 231405735 231480122 231392384 231203804 230821133 230547180
2100B30547180K78721L11852j25409k66552l16867k24114J65234J82628j75476k29835
$$ 230547180 230825901 231137753 231012344 230745792 230428925 230204811 230370045 230552673 230377197 230147362
2110B30147362l4561n2700k84901k67277M063M7188m4327j63574m93756m08649K02408
$$ 230147362 230112801 230060101 229775200 229507923 229511986 229559174 229514847 229351273 228857517 228448868 228651276
2121B28651276K67982j61877k18143m96J9074j24932j00841J38035P2479l39508m11492
$$ 228651276 228919258 228757381 228539238 228538742 228557816 228432884 228332043 228470078 228542557 228203049 227791557
2132B27791557k22206j45206r6569l9101J9798O9390J39942J19457m539p2957j17301
$$ 227791557 227569351 227424145 227327576 227288475 227308273 227377663 227517605 227637062 227632523 227559566 227442265
2143B27442265j73817k87762k45342l4332Q0108J98613J81446n0087m3621K61306J68324
$$ 227442265 227268448 226980686 226735344 226701012 226781120 226979733 227161179 227111092 227067471 227328777 227497101
2154B27497101l39508n00679m83990l76453l7918N7945l8643n8174l0270j08471l93162
$$ 227497101 227157593 226656914 226172924 225796471 225758553 225816498 225777855 225719681 225689411 225580940 225187778
2165B25187778l29723J91193J75724l90301m58946j61648k2182J07765J56898J22299
$$ 225187778 224858055 225049248 225224972 224834671 224375725 224214077 224191895 224299660 224456558 224578857
2175B24578857Q6060M3640p2002l44982l74089j53293j09444k08378j59969L5744Q7986
$$ 224578857 224664917 224708557 224636555 224291573 223917484 223764191 223654747 223446369 223286400 223322144 223410130
2186B23410130L8394Q336m7932o9618n6019p3681j45416j16120O0807M2190j70708
$$ 223410130 223448524 223456860 223408928 223339310 223283291 223209610 223064194 222948074 223008881 223051071 222880363
2197B22880363k39372k53906j94798J7415M1961j29471j25408N1499L8147j60923k00520
$$ 222880363 222640991 222387085 222192287 222209702 222251663 222122192 221996784 222048283 222086430 221925507 221724987
2208B21724987j07059j21823k55585k25772k3137L0518l7193j7414J59511N970o68525
$$ 221724987 221617928 221496105 221240520 221014748 220991611 221022129 220984936 220967522 221127033 221133003 220464478
2219B20464478o16570K69661L11127m41552n13534o5575O6986O7959L7441p8926j64508
$$ 220464478 219847908 220117569 220428696 219987144 219473610 219408035 219475021 219542980 219580421 219501495 219336987
2230B19336987k79675l01590k50092j69754l9825R9182L61672L27110o5556j52836
$$ 219336987 219057312 218755722 218505630 218335876 218296051 218395233 218756905 219084015 219018459 218865623
2240B18865623K6246l8147l11623m24614n06897m10309m3640Q0109N3406J8615j11122
$$ 218865623 218891869 218853722 218542099 218117485 217610588 217200279 217156639 217236748 217290154 217308769 217197647
2251B17197647j33972r9907j4782K60830J72138l31173m96139n12600l76702J54248
$$ 217197647 217063675 216963768 216948986 217209816 217381954 217050781 216554642 216042042 215665340 215819588
2261B15819588J03244n95798p03354l45230k60811k88505l36152n76267m13646K39124
$$ 215819588 215922832 215327034 214623680 214278450 214017639 213729134 213392982 212816715 212403069 212642193
2271B12642193M33445L67164J95733l62149l37352L48091M09832j13736r2506M07219
$$ 212642193 213075638 213442802 213638535 213276386 212939034 213287125 213696957 213583221 213490715 213897934
2281B13897934N19047M21276K65369j78089j44501M68502M84715l1014j64032n8174
$$ 213897934 214416981 214838257 215103626 214925537 214781036 215249538 215734253 215703239 215539207 215481033
2291B15481033n5313q5106q9874j47819o218M27494N29041L30219L24955M13895M99496
$$ 215481033 215425720 215340614 215250740 215102921 215096703 215524197 216053238 216383457 216708412 217122307 217621803
2302B17621803O91414O47316L96233J64280j26133l94326q62369p23839Q3676N01632
$$ 217621803 218313217 218960533 219356766 219521046 219394913 219000587 218138218 217414379 217498055 217999687
2312B17999687P10983J044026J715183J534233O70891l66917k311954k742272k101898
$$ 217999687 218710670 219754696 221469879 223004112 223675003 223308086 220996132 218253860 216151962
2321B16151962j038551J487961J962433P40509q6537j194954j974353l069153k512703
$$ 216151962 215113411 216601372 218563805 219304314 219217777 218022823 216048470 212979317 210466614
2330B10466614J38054J143932J443863J020908q09898j294384n40981q71888j669406
$$ 210466614 210604668 211748600 213192463 214213371 213403473 212109089 211568108 210696220 209026814
2339B09026814l082753n690098p033100r447593o051293M045258J0400772J7693748
$$ 209026814 205944061 200253963 193220863 183773270 177721977 181767235 192168007 209861755
2347B09861755J7651558R576073M531631j251945l761292k659549l308296m884720
$$ 209861755 227513313 237089386 241621017 240369072 236607780 233948231 230639935 225755215
2355B25755215n320301m916191m539986m022102l175507j394043j291733l047237l335705
$$ 225755215 220434914 215518723 210978737 206956635 203781128 202387085 201095352 198048115 194712410
2364A94712410k693672k302628j797218j460075j372567r27448j74770M77333J480102
$$ 194712410 192018738 189716110 187918892 186458817 185086250 184158802 183984032 184461365 185941467
2373A85941467J434326m539o0310R43641J521607K198925K357483J946449J787186
$$ 185941467 187375793 187371254 187310944 188254585 189776192 191975117 194332600 196279049 198066235
2382A98066235J775493J506348R16710O60419O75907N55039M17957J89076k55833l44277
$$ 198066235 199841728 201348076 202264786 202925205 203601112 204156151 204574108 204763184 204507351 204163074
2392B04163074j56879N6038N35240N67665J77632j9780k33421k45094K8839L3874j77631
$$ 204163074 204006195 204062233 204597473 205165138 205342770 205322990 205089569 204844475 204873314 204907188 204729557
2403B04729557k61307l46184k63462N7717J64490J70707P3929k35805l19004k51046
$$ 204729557 204468250 204122066 203858604 203916321 204080811 204251518 204325447 204089642 203770638 203519592
2413B03519592j72615j2169Q1292K02903J20163k80609l13053R785N3634j33991j11580
$$ 203519592 203346977 203334808 203416100 203619003 203739166 203458557 203145504 203155289 203208923 203074932 202963352
2424B02963352J37329J04657k60354k46276K14805J37825n22156o00814k38877m0054
$$ 202963352 203100681 203205338 202944984 202698708 202913513 203051338 202529182 201928368 201689491 201649437
2434B01649437K46277K19822j89781l03021j91936k51065n20458m48227R54J33037
$$ 201649437 201895714 202115536 201925755 201622734 201430798 201179733 200659275 200211048 200212002 200345039
2444B00345039R8458j1444m19121l28789L80287M26998j35173k39869l3378L109j202
$$ 200345039 200443497 200432053 200012932 199684143 200064430 200491428 200356255 200116386 200083008 200086117 200084915
2455B00084915q3198l71209l16867J51386J95751j34716j98822o8913r9887k78969
$$ 200084915 200001717 199630508 199313641 199465027 199660778 199526062 199327240 199258327 199158440 198879471
2465A98879471l02315k20528j38511k5997R7522L63808K64416l10192m14849j45187
$$ 198879471 198577156 198356628 198218117 198192120 198289642 198653450 198917866 198607674 198192825 198047638
2475A98047638o3896j2627o3190l30220k84423P1296K15531L13263K24361j47114k77519
$$ 198047638 197983742 197971115 197907925 197577705 197293282 197364578 197580109 197893372 198117733 197970619 197693100
2486A97693100k62966k43893j91231q3923K21024J28746m89712n25723j5258P5340
$$ 197693100 197430134 197186241 196995010 196911087 197132111 197260857 196771145 196245422 196230164 196305504
2496A96305504j29452j63078j14689r4643p3662n9375k5273p0343k18620k74658l05176
$$ 196305504 196176052 196012974 195898285 195803642 195729980 195670605 195645332 195574989 195356369 195081711 194776535
2507A94776535k40326n493K9812r9659j67122k69184k47708n0087m5528k51770k31991
$$ 194776535 194536209 194530716 194560528 194460869 194293747 194024563 193776855 193726768 193681240 193429470 193197479
2518A93197479m8866J10149L97435L89824P3661p5340j77135k30313k32219j95981
$$ 193197479 193148613 193258762 193656197 194046021 194119682 194044342 193867207 193636894 193404675 193208694
2528A93208694j00612j8120J50433P8926l73116l18298L22571L43322j99775l26653
$$ 193208694 193108082 193089962 193240395 193319321 192946205 192627907 192950478 193293800 193094025 192767372
2538A92767372k00729j47820%j04904o53515n37624L80745M41074k84443m26044j77136
$$ 192767372 192566643 192418823 192418823 192313919 191660404 191122780 191503525 191944599 191660156 191234112 191056976
2549A91056976j35669k10514j71204n722M768j39694j59035q1291p4882j43509j05629
$$ 191056976 190921307 190710793 190539589 190533867 190538635 190398941 190239906 190158615 190083733 189940224 189834595
2560A89834595J16119K9068m60129m85191j14212N6038K19345J96457q5354j57356
$$ 189834595 189950714 189979782 189519653 189034462 188920250 188976288 189195633 189392090 189306736 189149380
2570A89149380p6771q5831j66168j51405l0747j3599j24931n5790K58674K50111j04428
$$ 189149380 189072609 188986778 188820610 188669205 188638458 188624859 188499928 188444138 188702812 188952923 188848495
2581A88848495j45912Q3199R3708o0558j06812r1782j01585j72367p4863K64396L20683
$$ 188848495 188702583 188785782 188879490 188818932 188712120 188620338 188518753 188346386 188271523 188535919 188856602
2592A88856602J97658K861m89235m84714O3896J72615k1458q5830j45912j35651m3411
$$ 188856602 189054260 189057121 188567886 188083172 188147068 188319683 188298225 188212395 188066483 187930832 187887421
2603A87887421J6708O9847J26610K43893J81675j11809j89781q5373j15395k96822
$$ 187887421 187904129 187973976 188100586 188344479 188526154 188414345 188224564 188139191 188023796 187726974
2613A87726974k45323M5052J63555K49157J53999j84059l69778n86032m99497q583
$$ 187726974 187481651 187526703 187690258 187939415 188093414 187909355 187539577 186953545 186454048 186445465
2623A86445465J44730Q7013N1994l4332j10874k36263k39869r8457p5340j26362j67599
$$ 186445465 186590195 186677208 186729202 186694870 186583996 186347733 186107864 186009407 185934067 185807705 185640106
2634A85640106k96840k08855J79539K27432m6234p9155Q5582N4837j55678k19116j59741
$$ 185640106 185343266 185134411 185313950 185541382 185495148 185415993 185501575 185556412 185400734 185181618 185021877
2645A85021877k10285m09126l71933q1062O446o6757j4553J80950J59989o7940j83830
$$ 185021877 184811592 184402466 184030533 183949471 183955917 183889160 183874607 184055557 184215546 184147606 183963776
2656A83963776k89441k96840j90239j20659o1035L1719K26269K05040m0550j62125
$$ 183963776 183674335 183377495 183187256 183066597 183005562 183037281 183263550 183468590 183428040 183265915
2666A83265915l14713k27928J94798K96592J59741J09901R4414j907k33155k67982
$$ 183265915 182951202 182723274 182918072 183214664 183374405 183484306 183578720 183576813 183343658 183075676
2676A83075676j15395p2479o1035r8724k47708k44140p0572o3896j99070k39144k73933
$$ 183075676 182960281 182887802 182826767 182728043 182480335 182236195 182165623 182101727 181902657 181663513 181389580
2687A81389580j83106J01319J86691J73569N2452k90871l91960l30219k54879q4153
$$ 181389580 181206474 181307793 181494484 181668053 181720505 181429634 181037674 180707455 180452576 180368423
2697A80368423L815Q4877L1948k17914k86103l01590j30195M58717M08421l41664m93278
$$ 180368423 180372238 180457115 180489063 180271149 179985046 179683456 179553261 180011978 180420399 180078735 179585457
2708A79585457j92871j53790k98252k25067R7504J41620n0544j21594j20392k09102
$$ 179585457 179392586 179238796 178940544 178715477 178812981 178954601 178904057 178782463 178662071 178452969
2718A78452969l90759m92344o69479m75407K54631M14372J23729O924j49479j16844
$$ 178452969 178062210 177569866 176900387 176424980 176679611 177093983 177217712 177224636 177075157 176958313
2728A76958313J09444K79655N36461N58128L11852K48184L67413K16236k37217m14143
$$ 176958313 177067757 177347412 177883873 178442001 178753853 179002037 179369450 179585686 179348469 178934326
2738A78934326m40349l92437j64261j04447j69754j86424k67029j36871L13301L70255
$$ 178934326 178493977 178101540 177937279 177832832 177663078 177476654 177209625 177072754 177386055 177756310
2748A77756310J10149n8174l19958l43094j20621j2645J11580Q7261j47820j82152
$$ 177756310 177866459 177808285 177488327 177145233 177024612 177011967 177123547 177210808 177062988 176880836
2758A76880836l0994m6730k18868k39144j00364j40190m01020l76454n5561Q583j38988
$$ 176880836 176849842 176803112 176584244 176345100 176244736 176104546 175703526 175327072 175271511 175280094 175141106
2769A75141106j25428P401N1498P7248J0261k16732k63690j36605j53789l03746l15895
$$ 175141106 175015678 175023079 175074577 175151825 175162086 174945354 174681664 174545059 174391270 174087524 173771629
2780A73771629k19116j71661j87397n5790K97069L64304J92394R9907K5520j04198
$$ 173771629 173552513 173380852 173193455 173137665 173434734 173799038 173991432 174091339 174116859 174012661
2790A74012661l46661m00066k97298k11010p6046J7871J35422J05152q9645k13871
$$ 174012661 173666000 173265934 172968636 172757626 172681580 172699451 172834873 172940025 172850380 172636509
2800A72636509l71227l84560k14348j97410l44735k77061J1940J16348J77613L4561
$$ 172636509 172265282 171880722 171666374 171468964 171124229 170847168 170859108 170975456 171153069 171187630
2810A71187630m60129n59101l73364k07424J34468J70460j27068j67846J6689l9349
$$ 171187630 170727501 170168400 169795036 169587612 169722080 169892540 169765472 169597626 169614315 169574966
2820A69574966l21388m24843n09262l41911K41280L49769J50204j35670p76749r22698
$$ 169574966 169253578 168828735 168319473 167977562 168218842 168568611 168718815 168583145 167806396 166883698
2830A66883698o65665m89693j75724j17550l25660l65029k86827l24478m22707n69839
$$ 166883698 166218033 165728340 165552616 165435066 165109406 164744377 164457550 164133072 163710365 163140526
2840A63140526q59966r28174p88440p50303o97613p88927j035691j236200j592875
$$ 163140526 162280560 161352386 160563946 159813643 159116030 158327103 157291412 156055212 154462337
2849A54462337j501321r19819o21319m79460k29120J49250L09467K76566K96354L47614
$$ 154462337 152961016 152041197 151419878 150940418 150711298 150860548 151170015 151446581 151742935 152090549
2859A52090549K66552J7167r4176o0320k19345o14881p34329p17164n18083R5606J45197
$$ 152090549 152357101 152374268 152280092 152219772 152000427 151385546 150651217 149934053 149415970 149511576 149656773
2870A49656773l45946m93049n16892m21524j17302L7909M9352K51532O71625Q64983
$$ 149656773 149310827 148817778 148300886 147879362 147762060 147799969 147849321 148100853 148772478 149637461
2880A49637461R10520R33886Q59976Q61168R25779R26971R13143Q16823O49690M32491
$$ 149637461 150547981 151481867 152341843 153203011 154128790 155055761 155968904 156785727 157435417 157867908
2890A57867908L5048m6015K71321J59740l78609n25713l70502l77655m56810n04732
$$ 157867908 157902956 157856941 158128262 158288002 157909393 157383680 157013178 156635523 156178713 155673981
2900A55673981o01530n31435k22445j78099l88860l90530k32696j84536j33753k60353
$$ 155673981 155072451 154541016 154318571 154140472 153751612 153361082 153128386 152943850 152810097 152549744
2910A52549744o89268p42913o29425j95503Q51870J187562R06945R52482J185656J215934
$$ 152549744 151860476 151117563 150488138 150292635 151144505 152332067 153239012 154191494 155377150 156593084
2920A56593084J137972R61304O30855L56913M3869j37329k38895k25306j0252K2411
$$ 156593084 157731056 158692360 159323215 159680128 159723997 159586668 159347773 159122467 159112215 159134626
2930A59134626n5313j49488l38316m06265m05789l45230j92881o8664J04427J36376
$$ 159134626 159079313 158929825 158591509 158185244 157779455 157434225 157241344 157172680 157277107 157413483
2940A57413483J6927k5272q8930q106K22683M14133P25031P08103L12090J87158K57492
$$ 157413483 157430410 157405138 157316208 157308102 157530785 157944918 158669949 159378052 159690142 159877300 160134792
2951A60134792J74771p6790q6060J93596J63803j08013k95639n70297n74589k52724
$$ 160134792 160309563 160232773 160146713 160340309 160504112 160396099 160100460 159530163 158955574 158702850
2961A58702850j85966k98739l12566k78950k71559l13520k41995q5831J06096N24521
$$ 158702850 158516884 158218145 157905579 157626629 157355070 157041550 156799555 156713724 156819820 157344341
2971A57344341M54665j75477l63111k61307k61068l20912k17914J19924J81437l5286
$$ 157344341 157799006 157623529 157260418 156999111 156738043 156417131 156199217 156319141 156500578 156465292
2981A56465292j4305K09093K58446K11477J31130j05858p2956K83242L21149Q5831
$$ 156465292 156450987 156660080 156918526 157130003 157261133 157155275 157082319 157365561 157686710 157772541
2991A57772541L6240N2929J54018M18425N10931M97102M46797L23305K02179L9558
$$ 157772541 157808781 157861710 158015728 158434153 158945084 159442186 159888983 160212288 160414467 160454025
3001A60454025o6986k32220r5367M91390N75772L33080J4305o59485q24919n63860
$$ 160454025 160387039 160154819 160059452 160550842 161126614 161459694 161473999 160814514 159989595 159425735
3011A59425735m15802j51634j50442l92914n77211q29697r50336r64880r72033r98497
$$ 159425735 159009933 158858299 158707857 158314943 157737732 156908035 155957699 154992819 154020786 153022289
3021A53022289q40187m52518k20537r9183J15395M82082N60046L07321L31879N81026
$$ 153022289 152182102 151729584 151509047 151409864 151525259 152007341 152567387 152874708 153206587 153787613
3031A53787613O56605O15120O25372O93559O24657L89814K95878L22342K41518J1921
$$ 153787613 154444218 155059338 155684710 156378269 157002926 157392740 157688618 158010960 158252478 158264399
3041A58264399K7418L45945L38554J24932j46389o92606p93457n38826k92301J50203
$$ 158264399 158291817 158637762 158976316 159101248 158954859 158262253 157468796 156929970 156637669 156787872
3051A56787872L33548K71320L62158N76735O32763O50167M30584j63317l86238l90291
$$ 156787872 157121420 157392740 157754898 158331633 158964396 159614563 160045147 159881830 159495592 159105301
3061A59105301l14951n1260J02282K35557K83957K46048J89781O2704O199N960k4318
$$ 159105301 158790350 158739090 158841372 159076929 159360886 159606934 159796715 159859419 159865618 159871578 159847260
3072A59847260m2439j31607k87294m47751o87360p73192p91311o32763j70946k4080
$$ 159847260 159804821 159673214 159385920 158938169 158250809 157477617 156686306 156053543 155882597 155858517
3082A55858517j56641r3222P1049K37942M81367O01768P10964N57900L8147j82867
$$ 155858517 155701876 155608654 155679703 155917645 156399012 157000780 157711744 158269644 158307791 158124924
3092A58124924k81573k17676J51158K12192K2888l5047r4414p153L03269L82900K65598
$$ 158124924 157843351 157625675 157776833 157989025 158011913 157976866 157882452 157875299 158178568 158561468 158827066
3103A58827066K68460L90053L17335L6478q7023j47820j33276j192O5327R9897J50681
$$ 158827066 159095526 159485579 159802914 159839392 159752369 159604549 159471273 159470081 159535408 159635305 159785986
3114A59785986K67992J99776k6207k69184p57933p20024j04428J09673J65701O8903
$$ 159785986 160053978 160253754 160227547 159958363 159200430 158480406 158375978 158485651 158651352 158720255
3124A58720255l75509l94345L577P9393p7963q5354%K1935j7166K9564K09093J83344
$$ 158720255 158344746 157950401 157953978 158033371 157955408 157870054 157870054 157891989 157874823 157904387 158113480 158296824
3136A58296824m0532j54972j69992l54529r10520p61986K54154M06981j84536k67983
$$ 158296824 158256292 158101320 157931328 157576799 156666279 155904293 156158447 156565428 156380892 156112909
3146A56112909n2929M3393J85012J29462j76192k78711k67744k39849j48058q5592
$$ 156112909 156059980 156103373 156288385 156417847 156241655 155962944 155695200 155455351 155307293 155221701
3156A55221701j2398J669j05620j8835L50714L29495m0532k55584n38826n04256j6212
$$ 155221701 155209303 155210972 155105352 155086517 155437231 155766726 155726194 155470610 154931784 154427528 154411316
3167A54411316n245m63009m93765k18391m8876K20537J76191k77042l45230q4400o7711
$$ 154411316 154406071 153943062 153449297 153230906 153182030 153402567 153578758 153301716 152956486 152872086 152804375
3178A52804375k79427k11477J72615K18630K8610j53303n26667n39541j75238n3644
$$ 152804375 152524948 152313471 152486086 152704716 152733326 152580023 152053356 151513815 151338577 151284933
3188A51284933r4891J431K88725K52962j11818k67744l31402l77894m01258l50237
$$ 151284933 151190042 151191473 151480198 151733160 151621342 151353598 151022196 150644302 150243044 149892807
3198A49892807j86682j16348q1301j07527k25782k86817l73126l04937k8133N8174
$$ 149892807 149706125 149589777 149508476 149400949 149175167 148888350 148515224 148210287 148182154 148240328
3208A48240328J9550q583j31607o3896L03030K46048k28882m25577n51939m74215n1737
$$ 148240328 148259878 148251295 148119688 148055792 148358822 148604870 148375988 147950411 147398472 146924257 146872520
3219A46872520J5974k51293k33411M3392O4134j46389j75237n7221o7234j56402k47479
$$ 146872520 146888494 146637201 146403790 146447182 146511316 146364927 146189690 146132469 146065235 145908833 145661354
3230A45661354m45366m08649j22547J2159J21593J00613j17063j63317j4544j35898
$$ 145661354 145215988 144807339 144684792 144696951 144818544 144919157 144802094 144638777 144624233 144488335
3240A44488335n78642o72817n80550l26872K84195M92812M54425L04699p0572l52382
$$ 144488335 143909693 143236876 142656326 142329454 142613649 143106461 143560886 143865585 143795013 143442631
3250A43442631p58887p38143j90259o9856k50817k83479k80380k42472j56641p7486
$$ 143442631 142683744 141945601 141755342 141685486 141434669 141151190 140870810 140628338 140471697 140394211
3260A40394211K9087Q0347J29223M6015k53439l03746j32322r7752j41859j40905n1260
$$ 140394211 140423298 140503645 140632868 140678883 140425444 140121698 139989376 139891624 139749765 139608860 139557600
3271A39557600j72853n97001o59704m59194k67506O1512K13623L12567J76668l56912
$$ 139557600 139384747 138787746 138128042 137668848 137401342 137462854 137676477 137989044 138165712 137808800
3281A37808800m57287k59638n4836L70979M51803K83957M5776m43935o41823o98090
$$ 137808800 137351513 137091875 137037039 137408018 137859821 138143778 138189554 137745619 137103796 136405706
3291A36405706n58137k2173N5074l06606l34501j44959m5776P7247P1764o7949j68800
$$ 136405706 135847569 135825396 135880470 135573864 135239363 135094404 135048628 135125875 135197639 135129690 134960890
3302A34960890k78473l80755m80651n77927q43763n95570L95775N29766o3896l03746
$$ 134960890 134682417 134301662 133821011 133243084 132399321 131803751 132199526 132729292 132665396 132361650
3312A32361650m88281n07593l37362j85013J32561Q8691l53813n20706o19173m95434
$$ 132361650 131873369 131365776 131028414 130843401 130975962 131064653 130710840 130190134 129570961 129075527
3322A29075527J6689R5606k22683k62022p5340j29461m23193m95196l94582l86238
$$ 129075527 129092216 129187822 128965139 128703117 128627777 128498316 128075123 127579927 127185345 126799107
3332A26799107m02928m49896o35862n23806O438L6716l82423n36919o74248n20229
$$ 126799107 126396179 125946283 125310421 124786615 124793053 124829769 124447346 123910427 123236179 122715950
3342A22715950R7990K11477j09195j80006r8229j61648l32117m66823o87361o52790
$$ 122715950 122813940 123025417 122916222 122736216 122637987 122476339 122144222 121677399 120990038 120337248
3352A20337248k95162k30313m16517m05550j86920k51293o71387o65903k06709j90258
$$ 120337248 120042086 119811773 119395256 118989706 118802786 118551493 117880106 117214203 117007494 116817236
3362A16817236n82218o27041m35591l22342j40667j63078m39167m99487l97921l89576
$$ 116817236 116235018 115607977 115172386 114850044 114709377 114546299 114107132 113607645 113209724 112820148
3372A12820148m21524m50372n48601m73023j84774q2493o9142j36852l44276m65870
$$ 112820148 112398624 111948252 111399651 110926628 110741854 110659361 110590219 110453367 110109091 109643221
3382A09643221o46591n34535p9632J64509M78983K90632n89847q33750o71387n11169
$$ 109643221 108996630 108462095 108382463 108546972 109025955 109316587 108726740 107892990 107221603 106710434
3392A06710434j54018Q821O1274N6743n6982j24454j29462k93016p32660p59125l88622
$$ 106710434 106556416 106565237 106626511 106683254 106626272 106501818 106372356 106079340 105346680 104587555 104198933
3403A04198933k45333j72138j73569m01020k45571M29153M66347n9843k91824m94481
$$ 104198933 103953600 103781462 103607893 103206873 102961302 103390455 103856802 103796959 103505135 103010654
3413A03010654m67300j03474l2186j58072k34842m20332l29733J43051J87636j98603
$$ 103010654 102543354 102439880 102407694 102249622 102014780 101594448 101264715 101407766 101595402 101396799
3423A01396799j96695J74761J68562j25885l19243o40392n63622l5286K02418L56435
$$ 101396799 101200104 101374865 101543427 101417542 101098299 100457907 99894285 99858999 100061417 100417852
3433A00417852L39508P7963m8160j25170j88589k77281k01702J65939J24455l24965
$$ 100417852 100757360 100835323 100787163 100661993 100473404 100196123 99994421 100160360 100284815 99959850
3443I9959850m85658o52314l44991P35521R11236K94685J13487J06097Q7976J36614
$$ 99959850 99474192 98821878 98476887 99212408 100123644 100418329 100531816 100637913 100725889 100862503
3453A00862503J23024N7697K5750O675l814k9803K8849K30312K38896R536N4598L47853
$$ 100862503 100985527 101043224 101068974 101075649 101071835 101042032 101070881 101301193 101540089 101549625 101604223 101952076
3465A01952076M79221O30617M81844j42097k22683J77622K88725K74658K47955K03610
$$ 101952076 102431297 103061914 103543758 103401661 103178978 103356600 103645325 103919983 104167938 104371548
3475A04371548M7683k78234m48704o44922m67539K05040M86374O13213N24282N4598
$$ 104371548 104419231 104140997 103692293 103047371 102579832 102784872 103271246 103884459 104408741 104463339
3485A04463339p5579R1791L577m02928l25680K65122M48227L80993L54051J89781L07084
$$ 104463339 104387760 104479551 104483128 104080200 103754520 104019642 104467869 104848862 105202913 105392694 105699778
3496A05699778R05275P65800p6294n43117j120091r44852K32458N48601L55244J06096
$$ 105699778 106605053 107370853 107294559 106751442 105631351 104686499 104918957 105467558 105822802 105928898
3506A05928898o71148n44072O20842Q53539L53813K90871M48942N18799N76973O25133
$$ 105928898 105257750 104713678 105334520 106188059 106541872 106832743 107281685 107800484 108377457 109002590
3516A09002590P53880N97238J41621j95742o52313o96897k20538j93834n99861n37872
$$ 109002590 109756470 110353708 110495329 110299587 109647274 108950377 108729839 108536005 107936144 107398272
3526A07398272j04428J84059N04017O65188P36475O29902K53677N9843k26259L8386
$$ 107398272 107293844 107477903 107981920 108647108 109383583 110013485 110267162 110327005 110100746 110139132
3536A10139132J068115J360893J309156Q42572l21389r85145j700878j460791n4121
$$ 110139132 111207247 112568140 113877296 114719868 114398479 113413334 111712456 110251665 110197544
3545A10197544O67095J440287J165867o14166r70841l92437J43528J205683J495361
$$ 110197544 110864639 112304926 113470793 112856627 111885786 111493349 111636877 112842560 114337921
3554A14337921J126290R39846N12838O93798J747131J763583J354217j6689l124714
$$ 114337921 115464211 116404057 116916895 117610693 119357824 121121407 122475624 122458935 119334221
3563A19334221m334450m987717l356218J955032L638030K857446K260447O94513J21832
$$ 119334221 114999771 110012054 106655836 108610868 112248898 115106344 117366791 118061304 118183136
3572A18183136K52962K81334N02586N37396J77860O34670K115250K578259K900838
$$ 118183136 118436098 118717432 119220018 119757414 119935274 120569944 122685194 125263453 128164291
3581A28164291J614094j840114l760815o057501m793405J117467L391743M110098L230095
$$ 128164291 129778385 127938271 124177456 118119955 113326550 114444017 117835760 121945858 125175953
3590A25175953p15494j816511r90630m77075P18593Q54731j69039k10047J74523J068115
$$ 125175953 124460459 122643948 121653318 121176243 121894836 122749567 122580528 122370481 122545004 123613119
3600A23613119L404379L361940J272440l69310l063202l306627j049519L338Q90255
$$ 123613119 127017498 130379438 131651878 131282568 128219366 124912739 123863220 123866558 124756813
3609A24756813J162291M10080P17163K715587J790285k371549l904820m776239k985954
$$ 124756813 125919104 126329184 127046347 129761934 131552219 129180670 125275850 120499611 117513657
3618A17513657K649545N395174P403136O797552L587007l88145p737637r863376q715392
$$ 117513657 120163202 125558376 132961512 139759064 143346071 142957926 135220289 125356913 116641521
3627A16641521n092620M633665O747484K187014R13620O43253N47647J141310J192808
$$ 116641521 111548901 116182566 122930050 125117064 126030684 126673937 127221584 128362894 129555702
3636A29555702O06537R94921K177954L262758N289793M989862L561497n22375j0100603
$$ 129555702 130162239 131157160 133335114 136597872 141887665 146877527 150439024 149916649 139816046
3645A39816046j2291670r174585n316496K723217N745649N724669L963232k127409
$$ 139816046 127524376 118349791 113033295 115756512 121502161 127226830 131190062 129062653
3653A29062653l495694j328468O7949K533436L014088J265287J317024K638102L322125
$$ 129062653 125566959 124238491 124306440 126839876 129853964 131119251 132436275 135074377 138396502
3662A38396502M761457L293037j730442m059314o055117m523754K683401L777027Q81434
$$ 138396502 143157959 146450996 144720554 140661240 134606123 130082369 132765770 136542797 137424231
3671A37424231k714873j1759043j0553836K139330N668640K969980K949715L623724
$$ 137424231 134709358 122950315 112396479 114535809 120204449 123174429 126124144 129747868
3679A29747868M021883M795551M308700L327609M22716n980254q156538p941484n721569
$$ 129747868 133769751 138565302 142874002 146201611 146624327 140644073 132487535 124546051 118824482
3688A18824482N42641L078222L192663L426075L018856K467871J619816N87701q19444
$$ 118824482 119367123 122445345 125638008 129064083 132082939 134550810 136170626 136758327 135938883
3697A35938883j951933l877640k975464J171589L271342N148649M793882K308369p06911
$$ 135938883 133986950 130109310 127133846 128305435 131576777 136725426 141519308 143827677 143120766
3706A43120766o229163p953643p339478m856109J378774M303932N753994N450726K408028
$$ 143120766 136891603 128937960 121598482 116742373 118121147 122425079 128179073 133629799 136037827
3715A36037827Q45909k31505j060962j618147j766920j408816j074076q63790J53303
$$ 136037827 136883736 136652231 135591269 133973122 132206202 130797386 129723310 128859520 129012823
3724A29012823K174616L478289N538463M180193j175880m040480o256342o942034o654501
$$ 129012823 131187439 134665728 140204191 144384384 143208504 139168024 132911682 125969648 119315147
3733A19315147m048109J859904N790949J0827779R917975K434492k063990p460117
$$ 119315147 115267038 117126942 122917891 133745670 143663645 146098137 144034147 136574030
3741A36574030p782459k926112P15971Q126498N765199r307861j1793613m893303j102209
$$ 136574030 128791571 125865459 126581430 134707928 140473127 131165266 119371653 114478350 113376141
3750A13376141L708839N516052N092621L367901j612425k960682j837015m91619K706528
$$ 113376141 117084980 122601032 127693653 131061554 129449129 126488447 124651432 124159813 126866341
3759A26866341L482580K477169J401186q59261j559972n68152j161575l854275l315210
$$ 126866341 130348921 132826090 134227276 133368015 131808043 131239891 130078316 126224041 122908831
3768A22908831L07798K271891M376650M166126J264810l69548j933337k599954k676964
$$ 122908831 123216629 125488520 129865170 134031296 135296106 134926558 132993221 130393267 127716303
3777A27716303j761437J182557J605272k52962q06809j085043n59330J365424J779079
$$ 127716303 125954866 127137423 128742695 128489733 127682924 126597881 126038551 127403975 129183054
3786A29183054P41005R23395K352715K250194O78539J64748K36988K55108R52959L2186
$$ 129183054 129924059 130847454 133200169 135450363 136128902 136293650 136530638 136785746 137738705 137770891
3796A37770891k658844m218340o591320m899740K757072L895045l94583j993179l999234
$$ 137770891 135112047 130893707 124302387 119402647 122159719 126054764 125660181 123667002 119667768
3805A19667768k137899N292893P208824N490303L699541P6532j901865l465175l173113
$$ 119667768 117529869 122822762 130031586 135521889 139221430 139297962 137396097 133930922 130757809
3814A30757809L13759J95741l138542m447460o037474l926277L702641N600929L021240
$$ 130757809 131071568 131267309 128128767 123681307 117643833 113717556 117420197 123021126 126042366
3823A26042366K198219J507044J210213J612663J229763j86205j62124J791954J239776
$$ 126042366 128240585 129747629 130957842 132570505 133800268 133614063 133451939 135243893 136483669
3832A36483669j439333l327846o210089n866051j935482q2016J118899J630068O98804
$$ 136483669 135044336 131716490 125506401 119640350 117704868 117622852 118741751 120371819 121070623
3841A21070623J372338L322601M813433P164716O829978N033254M24862r565830j3308287
$$ 121070623 122442961 125765562 130578995 137743711 144573689 149606943 150031805 140465975 127157688
3850A27157688j4341831j0142326K902984P816553P723570P099629L990411J734734
$$ 127157688 112815857 102673531 105576515 113393068 121116638 128216267 132206678 133941412
3858A33941412r74178k251625k658606j838684J446962J883507L56436j361609n286216
$$ 133941412 132967234 130715609 128057003 126218319 127665281 129548788 129905224 128543615 123257399
3867A23257399n127430q28505J091242K191543K751589K419949K321482K745628J409054
$$ 123257399 118129969 117301464 118392706 120584249 123335838 125755787 128077269 130822897 132231951
3876A32231951k637387l313779j007319k48909K90394j75715k911806k073526L095627
$$ 132231951 129594564 126280785 125273466 125024557 125314951 125139236 122227430 120153904 123249531
3885A23249531L723621R26733q90493m275084l443718K276898M409313N142689M195690
$$ 123249531 126973152 127899885 127009392 122734308 119290590 121567488 125976801 131119490 135315180
3894A35315180O19411j512050l378868m335404m428625m119158l342867j897335P09296
$$ 135315180 135934591 134422541 131043673 126708269 122279644 118160486 114817619 112920284 113629580
3903A13629580K305984L787279L744602J639843J030445J448632J207828Q46386j05858
$$ 113629580 115935564 119722843 123467445 125107288 126137733 127586365 128794193 129640579 129534721
3912A29534721k193451k768755k387046j476765P84159J533508J316547Q14438o97374
$$ 129534721 127341270 124572515 122185469 120708704 121492863 123026371 124342918 125157356 124459982
3921A24459982j001597n01632J97410K042532J848936m25100j427889k149105j982212
$$ 124459982 123458385 122956753 123154163 125196695 127045631 126620531 125192642 123043537 121061325
3930A21061325p55310K35081J716852K073526J400948R31263K87771k56300r65595
$$ 121061325 120306015 120541096 122257948 124331474 125732422 126663685 126951456 126695156 125729561
3939A25729561j056910n83410j18256R56059P40528j066923j359940n12123j38283
$$ 125729561 124672651 124089241 123970985 124927044 125667572 124600649 123240709 122728586 122590303
3948A22590303J90974L71933L48806M48704P84874N77211k93970n70059l99589m48227
$$ 122590303 122781277 123153210 123502016 123950720 124735594 125312805 125018835 124448776 124049187 123600960
3958A23600960p48635n05924L76940P14064Q38041O02722k70367n21659l68834k00748
$$ 123600960 122852325 122346401 122723341 123437405 124275446 124878168 124607801 124086142 123717308 123516560
3968A23516560K86579K63929l16858m36783k45333j67131j28031m77K68221L37601
$$ 123516560 123803139 124067068 123750210 123313427 123068094 122900963 122772932 122772455 123040676 123378277
3978A23378277K52962J71661M77m6015N3168k146k60353k27690J57595J51634k17438
$$ 123378277 123631239 123802900 123803377 123757362 123810530 123808384 123548031 123320341 123477936 123629570 123412132
3989A23412132l18289k72512k27213j05619o8188j22070p9632O1273J02997L3856R5606
$$ 123412132 123093843 122821331 122594118 122488499 122420311 122298241 122218609 122279882 122382879 122416735 122512341
4000A22512341
$$ 122512341
##END=$$ End of the data block
