##TITLE=$$ Begin of the data block
##JCAMP-DX=5.00 $$ ACD/SpecManager v 10.08
##SPECTROMETER/DATA SYSTEM=16PC
##DATE=Mon Sep 30 10:45:33 2013
##DATA TYPE=INFRARED SPECTRUM
##DATA CLASS=XYDATA
##ORIGIN=
##OWNER=
##NPOINTS=3601
##FIRSTX=400.00000000
##LASTX=4000.00000000
##MAXX=4000.00000000
##MINX=400.00000000
##MAXY=40.28470612
##MINY=19.14834976
##XFACTOR=1.0000000000
##YFACTOR=0.000000100000000
##FIRSTY=34.05516052
##DELTAX=1.00000000
##XUNITS=1/CM
##YUNITS=TRANSMITTANCE
##XYDATA=(X++(Y..Y))
400 340551605 337929230 344780197 353503456 358145943 344233513 329727402 332848778 338343124
408 338343124 334146042 328906288 327912827 329178314 332432747 337810059 347449799 355064850 353623390
417 353623390 347498169 337353935 327281494 323053818 320288887 314167500 311771622 323902130
425 323902130 334580193 326804657 314442406 306554317 300554047 295198441 295518646 309380054
433 309380054 327033043 344166031 352327118 333178749 312065353 313888779 321637650 325641861
441 325641861 328777771 330329666 331402283 334385643 334706802 325071564 316033363 319332600 324113846
450 324113846 321230164 317292938 316253185 316945076 322004547 323976517 312143555 298927078 294325829
459 294325829 294887543 301740875 311138153 319938431 327448616 332233429 333378296 326831818 320568085
468 320568085 323106537 328758469 335722427 340855103 338136902 334393997 335382462 338292122 343085060
477 343085060 347199211 346886406 345667343 345911026 347324600 351527214 355151901 354156494 352183113
486 352183113 352202911 352186203 350345383 348924637 350620995 352288742 350493927 348795395 350836258
495 350836258 352926979 351618767 349829445 350031357 350111008 348361740 346032867 343345871 341674347
504 341674347 343687057 345716934 343847046 341494331 341681976 341673126 338598709 335879097 337151527
513 337151527 338896027 339371185 336876144 326005707 316128006 316543808 322049866 332211494 342020264
522 342020264 345457535 345118027 340373535 334872246 332249146 331913719 335884819 339966049 340782890
531 340782890 337885628 328528900 316222668 303245068 290543079 279373398 271082153 266578197
539 266578197 268427124 282122612 299787521 315647850 328887482 335820923 339282036 340558777
547 340558777 340601425 341090927 341121902 340120316 338772278 337064018 336520424 339852104 343486061 344189148
557 344189148 343649635 342100868 340671082 341286430 341783524 339731445 337856750 338773956 340385666
566 340385666 341811180 342013359 338660011 334753990 332727890 331959953 333327293 334764252 333788376
575 333788376 332524300 332759399 333022346 332159271 331005096 330300827 329172592 326232681 323760986
584 323760986 323955994 325670967 329152603 332417488 332798004 332593689 333603363 334657898 335057755
593 335057755 335191269 335194817 335124741 334717751 335066566 338036308 341043930 341539383 341286430 341504097
603 341504097 341276627 339677086 337957840 337336540 336987991 335894356 335849304 339350700 343265762
612 343265762 345047951 345434418 343969803 341685066 339121094 337291489 337551575 339413147 343719254
621 343719254 347831497 348684540 348402023 348125916 347734680 347448578 347382050 348153610 348470459 346410522
631 346410522 344478836 344972610 346590500 349170685 351592064 352526436 352430344 350959549 349188309
640 349188309 348117599 347619781 347892761 348960152 351667633 353746872 352366219 350059967 348388443
649 348388443 347440720 348160019 349544525 351175766 352245102 351296196 349851608 349105835 348585358
658 348585358 348145981 347990990 348437805 348999023 347500076 349318733 365067482 376864662 363938828
667 363938828 345571747 334416161 329586983 338339806 348903198 349500656 347402115 346206665
675 346206665 345149536 344606628 344753494 346525192 348019104 347277641 345399857 342917442 339573860
684 339573860 335590591 330062141 321876526 311872959 299754868 287814617 278322697 271046162
692 271046162 266597748 264709473 265330315 268420696 274396896 281840096 288955460 297286758 309288750
701 309288750 320432205 326606979 329009056 326936951 321971436 314983597 307399025 299838066 295584908
710 295584908 298756599 307472706 323558350 340012550 349039803 354847183 359521141 361627579
718 361627579 359136810 355921974 355818748 356907845 359153023 360740891 359064560 356464844 354299088
727 354299088 352909546 353595734 354843369 355361938 355776558 356442223 356876373 356487999 355954170 356051674
737 356051674 355889320 354422340 352887383 352703552 352278938 350093384 347349167 344588280 342270622
746 342270622 341395874 340884705 339886894 338713875 337598343 335922470 333451767 329268456 322126160
755 322126160 312775841 301889420 288456688 269107819 251591682 243892670 241933098 244805813
763 244805813 250980606 257563114 267736664 286084652 305510292 319791069 330886841 338222733
771 338222733 343178253 346843948 349510651 351931572 353809357 354893913 355793228 357309341 358609924
780 358609924 359120598 358868370 357273331 355579376 355135422 355044861 354705811 354580650 355139732 355755577
790 355755577 355903854 355743866 355133514 354452591 353965988 353874664 354629517 355744591 357151489 358047714
800 358047714 357112885 355830421 355310211 355350037 356695900 357611160 356199265 353684425 350803604
809 350803604 347121239 341953735 336781006 333716888 330175858 323714485 316019783 307674637 299547195
818 299547195 293105602 287129173 280497780 274374485 270164967 266017437 260092735 253758202 246791115
827 246791115 242120018 242767105 248228302 260654678 275099983 287218094 297358742 303486099
835 303486099 308408260 314555397 321023216 328224907 334635963 338362923 340924759 343262444 345213394
844 345213394 346966972 348405380 349436760 350169411 350510597 350971451 352339516 353692780 354350319
853 354350319 354374657 353412857 352027168 350286713 349314194 351123810 353107452 352847595 351787109
862 351787109 350635300 349173317 347366333 345368614 343582382 341226349 337590714 332863083 326708565
871 326708565 319983482 313157558 307052612 302246323 299940109 301811943 307006607 316081524 326473465
880 326473465 336074104 344074974 348292122 350740204 352624893 354186058 356311569 358262558 359486809
889 359486809 360308876 360801697 361167908 361702690 362198601 362596970 362744827 362293015 361769905 361869583
899 361869583 361745110 360595474 358974228 357267380 355174065 352760773 349308243 343348503 337191582
908 337191582 332188377 329745064 332563629 338107338 345566521 352461815 354867210 356312027 359569092
917 359569092 362979660 365788956 368057022 369549026 370392303 370309372 370276680 371711006 373014450
926 373014450 372667542 371848106 371216774 370804558 370941391 371391068 372115631 372849960 373342285 373512268
936 373512268 373110275 372392426 371461868 370524406 369978180 369346848 367979050 366796265 366711845 367098312
946 367098312 367577057 368313065 369431725 370671043 371972313 372849464 372541428 371812096 371207237 370616913
956 370616913 370318413 369692574 367817154 365876694 365045776 364428520 363704681 362319946 359429359
965 359429359 355583191 350283623 345828285 344789734 345843315 349405060 352822304 352684479 351681709
974 351681709 351405869 351739883 353444595 355476608 356764069 358152847 360501518 362698784 363770485
983 363770485 364160995 363624573 363255730 364566803 366056213 366658440 366575241 365260353 363891373 363815765
993 363815765 363975296 363709679 363171806 362184525 361074219 360083809 359285812 359029312 358724136 357891541
1003 357891541 356544037 354733963 351860504 347898483 341170082 328470459 314354897 300787926
1011 300787926 292333126 296068420 306415081 321594963 337280731 348196983 355408440 357715836
1019 357715836 356634598 352255096 347651711 346330872 347083817 350489120 354690094 357925415 360484619
1028 360484619 362002373 362679482 362203369 361748695 362889519 364114990 364199409 363861313 363367538 362847824
1038 362847824 362517586 362383118 362661819 362932663 362826576 362403412 361413498 360414963 360001793 359817047
1048 359817047 359741669 359652290 359267006 358940849 359124908 359247665 358787079 358045120 356978188 356097946
1058 356097946 356086502 356386185 356808891 356924515 356090546 354754219 353113632 351273766 349450111
1067 349450111 347507248 345597267 343073120 338605652 334389687 332475891 331967125 332997551 334522705
1076 334522705 335870743 336057434 334025612 329321365 321225166 309473267 292865276 273488522
1084 273488522 251413574 231489906 217731247 212712288 222292423 240628719 266055336 291898003
1092 291898003 310239792 323142052 329127312 330894241 329887619 328390579 329332352 332218895
1100 332218895 338520279 345269928 349602203 352681656 354633102 355707893 355988998 356103172 356887817
1109 356887817 357792625 358629456 359146118 358880043 358273277 357500076 356897583 357103806 357387314 357115021
1119 357115021 356629601 356028061 355410576 354921341 354524612 354122391 354043732 354730835 355743179 356776237
1129 356776237 357861290 359018097 359975090 360313873 360494385 360897789 361341476 361699333 362183342 363205185
1139 363205185 364036560 363939514 363353271 362204323 361292610 361826897 362504959 362287064 361591797 360432396
1149 360432396 358982811 357227325 355746040 355298996 355328789 355643044 355903625 355612259 355055580 354523888
1159 354523888 353505363 351752052 348762512 343736877 337322235 329068680 321466446 316832542 315235138
1168 315235138 318371048 323667984 328940887 334722748 341057549 347227325 352828255 356959839 357955704
1177 357955704 357706070 357805977 357473831 356488724 354763756 352388382 348611374 342186928 334685555
1186 334685555 326645622 319915295 316561928 316465607 320915451 327749252 335582962 343369713 349518280
1195 349518280 354276657 357032547 358774910 360441437 361570358 361808319 361763954 361936111 362299690
1204 362299690 363101730 364024391 364878426 365524292 365652809 365582237 365491638 365486603 365770340 366227875 366860161
1215 366860161 367522469 368157158 368501434 368080368 367470741 367159348 366938591 366842041 366629829 365872154
1225 365872154 365169983 365121117 365302582 365557175 365685463 365272064 364806671 364729652 364770889 364858627 364837875
1236 364837875 364448776 363933105 363311996 362984161 363769073 364424210 363500366 362436066 362421989 362751465
1246 362751465 363186607 363508682 363192558 362919312 363430748 364017715 364137421 364032516 363683243 363331299
1256 363331299 363435516 363322487 362249832 360882263 359630585 358513107 357687950 357144127 356945496
1265 356945496 357024918 357502937 357878189 357552032 356934052 356318245 355449448 354081650 352481613 350529900
1275 350529900 349137535 349462280 350642700 352393150 354141464 355034332 355629425 356253128 356744041
1284 356744041 357132187 357166519 356386909 355448952 354986649 354601364 354128113 353497009 352549324 351385345
1294 351385345 349878082 348551025 347946892 347878952 348471146 349334488 350093613 350830307 351531525 352103729
1304 352103729 352478752 352565041 351945648 351526718 352586975 353589287 352947464 352085571 351875076 352387199
1314 352387199 354644318 356661301 356152306 355039825 354456902 354483109 356004486 357732544 358488808
1323 358488808 358826408 358831635 358724823 358784180 358921051 359137764 359437714 359784851 360298157 361087799
1333 361087799 362144012 364014626 365135193 363834610 360980263 355893135 351538162 351795425 353238831
1342 353238831 353278160 353285789 354144096 354732742 353964806 352622528 350935707 349474678 349174500 349168777
1352 349168777 348826637 348374596 347549210 347185860 348333130 350086670 352748642 353745689 348918190
1361 348918190 343324890 340807686 340854874 345923195 350948105 349619637 348127365 351960411 356909523
1370 356909523 361208687 363015900 357686272 351860275 352035980 353993912 355680695 357094269 357222061
1379 357222061 357038956 356815567 357650528 362312546 366059074 363880882 359346161 353130798 348899612
1388 348899612 351945648 358058472 366966019 372144699 362610588 351471672 351371765 352717896 349077225
1397 349077225 343609810 336288681 330241203 331068039 331319580 322235336 313348770 312032223 316006432
1406 316006432 327761154 340359459 346228104 349765053 352741013 355461578 358668823 362821350
1414 362821350 371186256 376080284 367773514 355672379 344441643 338575134 349613647 361078491
1422 361078491 355006218 347388496 351519356 357527008 359468002 358850021 353103180 348514786 351930618
1431 351930618 359104156 371824722 378828506 362666130 343683472 339195023 340845833 347847710
1439 347847710 354813805 353793869 351686935 354455948 356956024 356440544 351677666 336448441 322965851
1448 322965851 324544678 331660042 337316055 347240219 372427444 390079269 371769180 345375290
1456 345375290 330507278 323540192 329759827 342043648 358103027 368721962 358063698 343699455
1464 343699455 339631081 340728989 347662697 357035141 368900757 373573761 354158173 332336884
1472 332336884 328724365 329629440 326879044 324531326 324681282 325042496 324648857 321631432 311720123
1481 311720123 301149597 297011375 292462578 282133827 268694401 252502213 235121498 214303741
1489 214303741 201843262 212950478 235128174 264059544 290413132 300251236 303074360 303357353
1497 303357353 302238464 301208725 303682556 315028915 330872307 355112801 368290405 340011826
1505 340011826 306976795 300904503 306340694 321645966 337093124 337510834 337589722 353254776
1513 353254776 365630379 353102455 339808693 349413643 361720085 363044510 357507248 338792572
1521 338792572 324524879 339173546 355885277 348971138 339404106 342269669 349539032 359973907
1529 359973907 368286858 367638359 361446152 344889412 335843086 360929260 389082413 396049500
1537 396049500 388014297 353555222 321232071 325452080 337249527 334200630 331084747 337806244
1545 337806244 346562881 353025208 356677780 353081703 349674454 355481644 361298332 355530739 354370117
1554 354370117 383886795 402847061 361861229 311466217 289691696 284668694 305531273 327298164
1562 327298164 320575485 307733307 304404259 301406631 293709030 284489861 270983925 265988350
1570 265988350 289122353 317152252 334310760 337818146 309620380 279769669 279395580 287208328
1578 287208328 291857243 294653416 291792641 287268639 284851303 281406174 274148216 265795708 257576714
1587 257576714 251174450 248564720 250096798 258387337 268607864 276371231 282970200 288247833
1595 288247833 292163124 294478893 295624256 295665970 295450935 295539131 296855450 301268349 306506634
1604 306506634 311217537 314514160 314279556 312849522 311422825 311292419 314486980 319996357 332235107
1613 332235107 336956253 312577477 285518169 279578686 281031380 286808968 288730621 272995472
1621 272995472 253396034 238822708 230180511 234915962 242293587 240282059 240214119 251618862
1629 251618862 267873764 287693748 304595222 311494102 308904419 287823906 269716988 280674458
1637 280674458 297811737 303506126 308060169 317037582 327031364 340124130 345410576 324187775
1645 324187775 301931381 299921989 312041054 351768723 381589165 353514442 312441101 288108826
1653 288108826 277998695 297194004 322627563 332410355 338091125 346563797 349900475 337204208
1661 337204208 324273605 325947762 334208260 349339714 361271858 356790543 345610123 328885803
1669 328885803 319081078 338722000 358775635 350142250 335546494 328438759 327542305 339972496
1677 339972496 354000549 356149216 358778954 380395889 389085045 339037399 290439129 304668427
1685 304668427 332338104 339591980 341214676 338325958 338061562 352858315 367930908 371179123
1693 371179123 366982956 349886665 337294807 357708702 372381210 334295044 296761513 311232090
1701 311232090 336266747 344323158 345156441 335726013 326874733 331766586 340396156 346194992 352015495
1710 352015495 359264603 365708122 370866051 370880127 359490623 343418121 323633652 311123123
1718 311123123 324116936 341851234 346680412 347478638 346352348 345957031 351571083 357431870 357920418
1727 357920418 357881546 360872726 365134010 375669937 375742912 334987183 299290657 319958210 350372772
1736 350372772 355285187 351894836 343603134 336551895 341364632 347997208 347478638 347211113 354484329
1745 354484329 360661736 357970734 351106873 340518951 331171494 328496933 331539612 345377426
1753 345377426 357339134 350970993 342695465 347060204 353235016 355121384 353069305 341176529
1761 341176529 332099457 341904144 354459763 356193085 355496902 356757164 358417969 363034477 362658005
1770 362658005 343809357 325634460 327509384 335263977 340294609 345277061 351447105 354520340
1778 354520340 347119331 339756966 344261627 349307556 344355812 338870773 339915276 344152451 352105637
1787 352105637 359253387 361569633 358089447 341617355 326816559 330432663 339020500 343858948
1795 343858948 347519646 350101471 350301514 345275879 339742661 338012238 338463058 341627846 345351944
1804 345351944 347286682 348543892 349994659 350008965 346056938 341708412 339903831 339999924 343424301
1813 343424301 346902618 346742401 345622559 344917297 344847450 346132507 348646889 354470024 357702980
1822 357702980 349162331 340778809 345089188 351091156 351182938 347697754 337414742 329393158 335476646
1831 335476646 344087830 346001129 346003036 345942993 345404129 343409767 343487511 351470222 359462967 361445427
1841 361445427 357625237 341478806 327176323 331732979 340088615 340631943 340027809 341931572 343759766
1850 343759766 343595047 343092690 343514214 344123611 344700317 344955902 344281921 343416443 342838287 342713585
1860 342713585 343276024 344801903 348304977 351806412 354571838 353880157 343776932 333225479 330601921
1869 330601921 331713181 336274376 340935707 341152916 340223541 340211143 340270271 340266457 340130577 339541931
1879 339541931 339118958 339717636 340302238 339300613 339175453 343695641 347369423 344307175 339469910
1888 339469910 335391998 333462944 338099976 342752686 340366364 336869469 336604118 337274323 338043938
1897 338043938 338873863 339504471 339758148 339070816 338338623 338468552 338862648 339434853 339553375 338177452
1907 338177452 336445084 334936867 334281197 335599670 337993164 341635933 344429741 343857040 341349602
1916 341349602 336064568 332307358 336693535 341447601 338979950 335346947 334661713 335162888 336960297
1925 336960297 338551521 337818871 336717834 336869469 337158928 336878052 336424599 335891495 335482368 335346222
1935 335346222 335737228 337316742 339009514 340499153 340168228 334298859 328875771 330522308 333602448
1944 333602448 333899994 333777199 334461937 335139046 335115891 335250397 336703796 337872505 336951027 335703850
1954 335703850 335595627 335717430 335490456 335387955 335847626 336395035 336577644 336765747 337612610 337815285
1964 337815285 335466614 333031883 332728882 333392372 334907990 336339493 336351852 336026917 336133003
1973 336133003 336274147 336347122 336241226 335688362 335057487 334615707 334398727 334564209 335011711 335905075
1983 335905075 336609344 336209526 335708618 336135139 336494904 336193542 335059662 331803093 329183807
1992 329183807 330601196 332846642 333408585 333591919 333982697 334224472 334013939 333776245 334038239 334189415
2002 334189415 333517532 332851868 333020439 333312035 333224068 332955589 332376251 331969490 332299461 332992325
2012 332992325 334232788 334907074 333347778 331398964 330457458 330195656 331047287 332125168 332629433
2021 332629433 332730522 332123528 331433067 331257820 331368942 331874123 332361450 332373848 332153778 331740150
2031 331740150 331283798 330956688 330731163 330646515 330671310 330937881 330992928 330168724 329238892 328806381
2041 328806381 328712463 329166412 329665909 329652061 329501648 329437485 329360733 329230537 329093933 329003334 328899155
2052 328899155 328691025 328520775 328510284 328626633 328970680 329259872 329123001 328926544 329111824 329081764
2062 329081764 328068733 327025642 326746445 326939354 327816238 328659286 328602066 328299026 328108063 328051071
2072 328051071 328394890 328761101 328839798 328691025 328121643 327578773 327593803 327717056 327627182 327470779
2082 327470779 327199478 327077141 327515602 328020325 328162689 328154335 328070412 327888489 327583084 327235718
2092 327235718 326837997 326630821 327045441 327502251 327471504 327231407 326828232 326425095 326219101 326151123
2102 326151123 326275826 326448669 326561203 326560249 326220016 325949898 326223602 326618652 326874237 326977005
2112 326977005 326716423 326421280 326366653 326501389 327024231 327457886 327278137 326821327 326146126 325561295
2122 325561295 325448761 325645905 326289177 326861382 326773415 326375732 325741043 325110435 324771652 324653854
2132 324653854 324859619 325153809 325326920 325404663 325251350 325138550 325359802 325711746 326215744 326487770
2142 326487770 325969467 325203896 324461708 323998680 324371338 324945679 325247993 325351257 325046310 324702759
2152 324702759 324689636 324796677 324954262 325106125 325216293 325150719 324650764 324054489 323633652 323328247
2162 323328247 323143959 323154678 323548317 323985596 324139824 324160080 324043274 323916664 323970566 324012032 323883286
2173 323883286 323668480 323324928 323074570 323216667 323474884 323724747 323807220 323360901 322866669 322747726
2183 322747726 322815399 323105087 323365440 323262444 323077202 323004494 322965851 322955132 322947006 322970619 322856445
2194 322856445 322277069 321734200 321703682 321935425 322429657 322910080 323073616 322998505 322529564 322060585
2204 322060585 322029572 322145920 322254410 322386017 322595596 322653770 322200050 321680794 321497192 321421127
2214 321421127 321383247 321307907 321019402 320746193 320729752 320755005 320613861 320526123 320733299 320959320 320958366
2225 320958366 320878525 320735703 320680389 320991287 321297874 321241608 321062546 320911407 320694695 320286751
2235 320286751 319933167 319878578 319998970 320384750 320635567 320190887 319619904 319315186 319244385 319661140
2245 319661140 320097198 320076714 319874763 319575539 319273472 319121361 319028378 318965187 318896523 318773499 318606606
2256 318606606 318322659 318122139 318262825 318497658 318658829 318765163 318799744 318699837 318312645 317888260
2266 317888260 317680130 317523479 317299118 317121029 317125549 317126274 316930046 316693077 316497326 316370010 316400757
2277 316400757 316484222 316458225 316580544 317151794 317880630 318592072 319236031 319730988 319994698 319761505
2287 319761505 319498787 319692383 320020218 320327759 320597649 320770988 320817719 320605507 320379982 320358734
2297 320358734 320489883 320751190 321270943 322322121 323447227 324231873 324818382 325270653 325409660 324970474
2307 324970474 324272385 323393326 322792282 323024750 323877563 325335732 327359695 330448608 332970390
2316 332970390 333108673 331914444 329682350 326864243 323762169 321120033 319847107 319748878 321588745
2325 321588745 323399773 323363800 321795464 317191353 313184509 313982010 316356659 318710804 320361137
2334 320361137 319407463 317900429 318365574 317474594 311692715 304162254 297458878 289746056 276937962
2343 276937962 268358002 273464928 287766685 313626766 339935760 355571022 362934113 358035316
2351 358035316 348925591 343784561 338234673 329766273 320952644 313621998 307497253 303248882 299861183
2360 299861183 296380272 293288708 290929317 288764477 285922527 283745041 283932915 284535408 283882370
2369 283882370 282829514 281492958 280418396 280289650 280805111 281875839 283545017 286013832 288717747
2378 288717747 290994415 293338299 296118507 299046040 302089920 304845085 306794891 308242321 309336662
2387 309336662 310020924 310140610 310135841 310497055 310916672 311311245 311497211 311087608 310606728 310507774
2397 310507774 310613861 310981026 311361313 311494102 311473122 311267128 310987701 310755005 310509205 310166836
2407 310166836 309917221 310005913 310178032 310230255 310250282 310294380 310251961 309942474 309629440 309583435 309599400
2418 309599400 309526920 309470406 309539070 309565315 309405327 309095154 308471203 307987690 308212757 308640251 308882484
2429 308882484 309148560 309620380 309988499 309923401 309664497 309303513 308952332 308807144 308704147 308502922
2439 308502922 308326950 308310280 308278084 308010101 307775974 307851067 307996273 308110714 308052788 307446251 306892395
2450 306892395 307070503 307370186 307367554 307181835 306672325 306192398 306110153 306238403 306614647 306932449
2460 306932449 306794395 306508064 306252956 306012878 305805435 305706978 305895576 306080093 305956612 305740585
2470 305740585 305521240 305371284 305453777 305584908 305635223 305603752 305406094 305163155 304921875 304819107
2480 304819107 305157433 305485725 305378437 305060158 304573784 304035912 303508530 303198586 303502083 303912888
2490 303912888 303970108 303932190 303911438 303883781 303841591 303846130 304020405 304170837 304123650 303938866 303545723
2501 303545723 303162804 303063622 303011417 302757492 302608013 302943001 303289413 303235283 302974472 302455425
2511 302455425 302000999 302040329 302199593 302214851 302184334 302104473 302016983 301972866 301939011 301913033 301851044
2522 301851044 301633606 301484585 301688671 301942596 302011719 301973343 301785946 301569462 301482925 301365376
2532 301365376 301061401 300712357 300348053 300146332 300449600 300791512 300663223 300531864 300895462 301151752
2542 301151752 300620804 300030479 300046196 300173283 300091515 299942245 299742928 299543381 299421310 299308777
2552 299308777 299147129 298985252 298812389 298746586 299010506 299276352 299226532 299051762 298832169 298581123
2562 298581123 298300266 298104763 298211327 298316231 298152695 297823906 297213554 296710243 296805382 297071457
2572 297071457 297220001 297325363 297380447 297337761 297058830 296806564 296858559 297029266 297247410 297445526
2582 297445526 297512779 297505608 297457218 297324657 296950340 296711197 297152748 297610054 297446480 297121773 296909103
2593 296909103 296729565 296576729 296504021 296559811 296752205 297202110 297616482 297653427 297579041 297566185 297549725
2604 297549725 297504902 297482014 297567139 297627678 297558556 297360420 296872864 296471367 296613693 296890488 297011147
2615 297011147 297075748 297091255 297046185 296925316 296747208 296518803 296256294 295900345 295684586 295948257
2625 295948257 296313515 296505451 296551476 296283493 296010742 296112537 296209564 295907974 295629978 295794964
2635 295794964 296015263 296018600 295875072 295463333 295083523 295079956 295196762 295294533 295367012 295332680 295276165
2646 295276165 295292130 295269012 295052528 294864883 294978142 295086384 294894695 294639359 294479599 294349670
2656 294349670 294223557 294140091 294120064 294190636 294431915 294704208 294947624 295002460 294534912 294007530 293774605
2667 293774605 293824673 294462204 295090675 295111179 294835320 294250965 293730736 293769360 293985844 294153442
2677 294153442 294301758 294362068 294399261 294495106 294526577 294318428 294107437 294133186 294211864 294260254 294213524
2688 294213524 293902874 293554535 293359280 293252945 293282032 293303013 293117294 292935600 292928696 293015003 293213120
2699 293213120 293391228 293381920 293310642 293284187 293190956 292926559 292576313 292138577 291766644 291633377 291674843
2710 291674843 291986237 292261600 292089462 291881790 292030106 292181740 292039146 291828156 291687965 291577568
2720 291577568 291528225 291460762 291209698 291063786 291392097 291785240 291935196 291904926 291524162 291181335
2730 291181335 291340351 291604519 291713715 291719437 291520119 291312218 291342735 291355362 291084061 290803680 290766716
2741 290766716 290772915 290678501 290564308 290451279 290373573 290415764 290445557 290287971 290154457 290252914 290418625
2752 290418625 290538063 290662537 290797234 290966034 291294575 291480541 291095257 290642014 290606270 290611992
2762 290611992 290373325 290104141 289966583 289828072 289575577 289312363 289093246 288949242 288927307 289033413
2772 289033413 289412498 289692402 289399147 288980255 288722038 288632393 288917313 289267311 289423218 289438725
2782 289438725 289231071 288946629 288702965 288501740 288377762 288348198 288519630 288658619 288480530 288243294
2792 288243294 288122177 288078079 288182983 288277397 288142929 288026810 288177261 288371811 288473854 288472176 288222542
2803 288222542 287986279 288085709 288190365 287972679 287742844 287810326 287848701 287550201 287165413 286868324
2813 286868324 286580086 286206722 285967350 286143303 286453724 286756744 286916008 286647797 286251793 285950661
2823 285950661 285691032 285487175 285358429 285363426 285398483 285396805 285305977 284992695 284631500 284373512 284153461
2834 284153461 284018993 283779373 283140182 282458534 282050362 281744232 281583786 281239281 280150185 279049873
2844 279049873 278608093 278454056 278529892 278564682 278161049 277640572 277177334 276815414 276721230 276698837 276571751
2855 276571751 276447525 276393890 276350975 276292801 276184559 276005020 275684357 275087128 274387131 273682594
2865 273682594 273063431 272718906 272448540 272118568 271717072 271187782 270530224 269575119 268771648 268545628
2875 268545628 268797646 269725800 270861397 271815071 272546768 272702694 272831688 273502121 274299850 274989128
2885 274989128 275603523 276059380 276472569 276970634 277435074 277709961 278033028 278765202 279379616 279268990
2895 279268990 279033184 279156685 279375305 279627323 279788494 279612770 279401779 279465199 279529343 279318810
2905 279318810 279147148 279336205 279582024 279630432 279654026 279804955 279889107 279703865 279424896 279135933
2915 279135933 278908958 278901329 278938065 278866768 278774033 278740883 278629074 278207054 277834167 277912617 278079510
2926 278079510 278087387 277991066 277612915 277400970 277979622 278638840 278744469 278691769 278676987 278660049 278630733
2937 278630733 278694153 278999329 279402256 279745331 280216942 281175137 281950474 281753311 281300545 281057835
2947 281057835 280986557 281335354 281706581 281699181 281571159 281477699 281324863 281027069 280712128 280508518 280328751
2958 280328751 280090103 279903641 279973259 279937267 279311180 278666019 278537273 278546104 278396378 278375149 278829346
2969 278829346 279281387 279271126 279092312 278834572 278649807 278819561 279043922 279045830 279036999 279213428 279343376
2980 279343376 279236794 278962860 278418541 277929535 277880669 277991524 278083324 278234711 278602123 278773308
2990 278773308 278190384 277445068 276994476 276682854 276537418 276465893 276370277 276293278 276230335 276223660 276363602
3001 276363602 276501179 276495934 276410103 276221275 276040077 276061058 276006699 275580406 275032768 274517784 274026146
3012 274026146 273643723 273236046 272607079 272025833 271757851 271617165 271525154 271422157 271229973 270923386
3022 270923386 270333061 269809246 269822350 269840240 269350529 268761635 268229008 267996788 268557072 269318104
3032 269318104 269752979 270156860 270683765 271228313 271835804 272206306 271876812 271378288 271229019 271003723
3042 271003723 270377636 269565105 268682251 267696152 266373634 265431404 265804768 266603241 267334461 267735958
3052 267735958 267153511 266269684 265547752 264991035 264843941 264843712 264749527 264739265 265001774 265263329 265197029
3063 265197029 265150795 265383492 265832901 266618729 267454376 268044701 268534660 269002438 269352684 269581795
3073 269581795 269490719 268733749 267745972 266805420 266036034 265690804 265658150 265965691 266448021 266921768
3083 266921768 267465820 268116722 268818130 269580364 270240059 270599365 270770550 270737419 270687103 270779610
3093 270779610 271079292 271894455 272651901 272754898 272579670 272209892 271924973 272158623 272531738 272749901
3103 272749901 272990227 273417950 273771515 273716202 273636589 273948441 274222374 274059772 273781776 273545265
3113 273545265 273441086 273785114 274057865 273677101 273143768 272791862 272537460 272370567 272403240 272930870
3123 272930870 273391247 273133507 272717476 272511959 272439003 272698174 272823334 272174358 271470299 271384716
3133 271384716 271411171 271134148 270951500 271292210 271646500 271548500 271293411 270964851 270730019 270905018
3143 270905018 271122932 271051884 270902405 270756245 270665646 270765781 270889053 270898342 270834694 270681152 270474205
3154 270474205 270275345 269991398 269385815 268947124 269298782 269797096 269986382 269922485 269359818 268743515
3164 268743515 268507957 268437157 268545876 268574486 268126717 267627239 267383099 267347565 267742157 268068314
3174 268068314 267777672 267238617 266519775 265969048 266191959 266481171 266221046 265739212 265083313 264476547
3184 264476547 264224281 264126778 264061203 264100304 264335861 264584541 264675865 264661789 264566898 264302979 263674259
3195 263674259 263025055 262627373 262502193 262968063 263401985 263043175 262622604 262841949 263025284 262600670
3205 262600670 261955261 261197090 260590553 260570526 260731926 260774612 260816574 260906448 260950089 260954380 260662556
3216 260662556 259541283 258425484 258195648 258181095 257995834 257664452 256952515 256250858 255893707 255813370
3226 255813370 256154785 256613731 256939659 257115364 257006168 256711731 256267319 255729198 255156040 254572392
3236 254572392 253939152 253504982 253665695 253939857 253954411 253777275 253224602 252676964 252517223 252552757
3246 252552757 252800713 253014336 252888451 252612591 252281418 251873741 251361847 250858307 250428200 250185738
3256 250185738 250347366 250668049 250984917 251265526 251466522 251454582 250954399 250345707 249914894 249663830
3266 249663830 249810696 249989738 249881516 249564171 248896122 248214722 247886181 247681847 247509727 247325172
3276 247325172 247001419 246693134 246537209 246460686 246451855 246461143 246420860 246372948 246338615 246310959 246347198 246274719
3288 246274719 245829582 245341072 245103359 244957199 244867554 244753609 244465351 244172821 244026909 243934860
3298 243934860 243880997 243783951 243529091 243199577 242858410 242451191 241930237 241337547 240639210 240012894
3308 240012894 239708176 239474297 239130249 238714695 238145828 237602234 237225304 237042198 237285137 237480164
3318 237480164 237133503 236534348 235730171 234950790 234546185 234201431 233680496 233096600 232462883 231843472
3328 231843472 231277695 230852356 230798721 230722904 230205059 229551792 228885174 228336105 228198051 228102913
3338 228102913 227720490 227229843 226732731 226127396 225158920 224387894 224541893 224861145 224801292 224443436
3348 224443436 223559608 222531796 221683273 220960617 220395813 220052948 220180035 220255623 219742050 218934536
3358 218934536 217823257 216783295 216345787 216030598 215528488 214854469 213789940 212725163 212023010
3367 212023010 211544991 211361656 211208820 210759392 210271358 209906349 209625969 209523678 209364166 208907356
3377 208907356 208260307 207389603 206474781 205691566 205017567 204503536 204104900 203779449 203569641 203577271
3387 203577271 203579426 203358421 202999115 202478886 201902618 201378345 200872192 200340500 199917564 199805031
3397 199805031 199755669 199628601 199303627 198411713 197557926 197399864 197408199 197190762 196992397 196967354 196993351
3408 196993351 197048664 196982861 196554184 196012268 195493927 195094585 195144882 195073853 194153557 193184853 192815781
3419 192815781 192776451 193105927 193523884 193706512 193823090 193955898 194039822 194003105 193945160 194004784 193991890
3430 193991890 193678856 193316231 193063011 192964325 193186035 193521271 193830490 194077263 194075584 194131374 194699516
3441 194699516 195144882 194913635 194214344 192726612 191483498 191694260 192509651 193646908 194612980
3450 194612980 194573879 194267502 194129944 194232941 195001125 195811749 196070900 196116676 196061134 195985565 196005096
3461 196005096 196130276 196514359 196842918 196671257 196540604 197083950 197579155 197326660 196889153 196535587
3471 196535587 196444511 196949730 197852612 199315071 200587044 200856934 200469742 199112415 197944412
3480 197944412 198397160 199340591 200212250 200739632 200093746 199378738 199588051 200224400 201254368 202277660
3490 202277660 202865601 203067303 202499619 202028503 202562103 203587532 205262661 206482162 205793610
3499 205793610 204395065 202727795 201608429 202497959 203901768 204822311 205228806 204304218 203407288
3508 203407288 203930626 204954147 206083298 207131863 207617035 208031178 208794117 209636917 210498085
3517 210498085 211174011 211452484 211297035 210367203 209362984 209127903 208887329 207922935 206908703 206092606
3527 206092606 206031322 207896004 210088730 211266994 211832771 211456070 210989723 211089859 212016830 214797745
3537 214797745 217786560 219660282 220475197 219695816 217771301 214363098 211298218 210596085 211340904
3546 211340904 213961372 216441879 216247787 215362072 214791298 214929352 217053185 219520092 220899105
3555 220899105 221830845 222048283 222840080 226067314 229743004 233357658 234338531 228510132 220168343
3564 220168343 210984459 204655876 207352638 213327408 219115486 224039307 225597610 225793839 225806713
3573 225806713 225605736 225433826 225647449 226590633 228542557 232249031 236651421 242011547 245110989
3582 245110989 241781464 235131035 225000381 217023125 218698273 224269867 231550941 237334023
3590 237334023 235987434 232595921 230505714 229298820 230287075 231624603 231345901 231120834 231743336
3599 231743336 233872414 239617348 245418320 248418331 248617649 243673553 237756729 234512100 233172188
3608 233172188 234910488 237546444 238571396 240142593 245435944 248883724 244168758 236711731 228548527
3617 228548527 223515282 227395535 236382713 250693092 264039993 270330658 269196739 255413532
3625 255413532 237455845 220052719 209216118 217375755 230006943 234990349 237538338 238286972
3633 238286972 238845348 241837273 244853497 245322456 246352425 250661125 256846199 265410900 273355255
3642 273355255 279518356 278882504 261906147 240999222 224847069 215080738 218842030 228281250
3650 228281250 239457607 247784615 244578133 238190174 233869553 232238541 237501621 244160423
3658 244160423 246816635 249372959 254340649 260494232 269020557 275192986 273319721 267479897 258178940
3667 258178940 250443935 251780739 255255470 258133659 255321732 234360218 214611053 216021061
3675 216021061 224373093 231630325 239196548 245101929 251429081 260932693 269624710 274998436 275362244
3684 275362244 266682625 253478775 236411324 223022232 224152336 230561733 236173630 242337456
3692 242337456 248868465 254289150 256677151 257180939 256562233 254058609 247345924 241869926 243315468
3701 243315468 248641014 258367767 267490616 271194229 269428024 258376598 244517097 232082367
3709 232082367 223987350 226226082 233792305 245035400 255879631 260756493 262490501 261688004
3717 261688004 259433746 257252693 254428864 249960423 246228695 245578041 247114410 250516891 256408920
3726 256408920 268055191 277209282 274910927 266562939 253196716 238964081 227705727 221384773
3734 221384773 223870049 233284225 252895355 271134148 275374641 272051811 261584511 249391556
3742 249391556 239891777 236500740 250947952 262707939 247970104 228318214 218576431 215211868
3750 215211868 221546402 231837749 242605438 250385284 248220215 243107071 239511719 238070488
3758 238070488 242175827 248022556 253434181 256915321 255089760 251423607 248872528 245589027 239384651
3767 239384651 234235287 233821640 236840477 244778156 252946377 256570091 257394314 255155087 251101265
3776 251101265 245486259 241031418 241811523 244018784 245160103 245365868 242854118 240867138 243107567
3785 243107567 246412506 248213768 250428677 255078316 259279976 259976616 259709835 260462532 260853539
3794 260853539 260150909 258389244 255748272 251060257 240770340 232219467 234229813 238801956 240837822
3803 240837822 240455627 232798805 227690468 236770401 249728928 260500679 267990837 267781982 263775597
3812 263775597 257623196 251654854 250018349 248910904 245966187 241021633 230200539 222276688
3820 222276688 228101501 237563610 243608952 247913589 248751163 249272823 253219604 257092247 257798672
3829 257798672 257858276 259778976 260501633 257355213 251682510 242693176 234114170 229991684 228577137
3838 228577137 229965935 232670555 234431496 237660179 244127274 253493080 268089771 281672249
3846 281672249 289948463 289391289 271715164 246903191 218457699 197532177 201263905 215202103
3854 215202103 231728325 247479668 255587349 258949280 257281075 253260612 249037971 245912075
3862 245912075 246930122 248996735 250704765 250036011 242452621 234106064 229919662 229039192 233441124
3871 233441124 239556541 243870964 248196373 254669189 258798122 254873753 248684158 244133472 241163979
3880 241163979 242520809 243696938 238746166 234729290 239016304 244730225 247407684 247174492 239850521
3889 239850521 233888855 238735199 247230301 255999794 263131866 265224686 263370991 256469727 247698059
3898 247698059 239929199 232973824 227361908 223809013 223251114 225553284 232112160 239268074 243021240
3907 243021240 245784760 249073753 251582375 252414703 251853943 249666939 246504784 242275467 238974571
3916 238974571 239338646 241050491 242856979 244301071 244181862 243475437 242295265 242025375 245324135
3925 245324135 248478889 248095512 245874176 241575470 237620583 236728191 237765541 241153717 244949112
3934 244949112 247171631 248351097 248245964 247189293 245058060 242978573 242098083 242228508 244363308
3943 244363308 246102810 244595051 242187977 240149269 238865128 239569893 240987301 242283592 243362904
3952 243362904 243678570 243746281 244059792 244136333 243440151 242623806 242246151 242052078 241882553 242006302
3962 242006302 242872238 243777504 244051704 244046211 243865242 243578682 243261566 243002167 242974052 242994537 242841721
3973 242841721 242804527 243261337 243721485 243782272 243555298 242770424 242167473 242622375 243453255 244391441
3983 244391441 245073090 244856606 244305134 243745327 243242493 243012428 242927322 243009796 243022919 242648125
3993 242648125 242151260 241577377 241267929 241795769 242508163 242861023 243101120
4000 243101120
##END=$$ End of the data block
