##TITLE=$$ Begin of the data block
##JCAMP-DX=5.00 $$ ACD/SpecManager v 10.08
##SPECTROMETER/DATA SYSTEM=Varian
##DATE=20 Nov 2012 14:08:32
##DATA TYPE=INFRARED SPECTRUM
##DATA CLASS=XYDATA
##ORIGIN=
##OWNER=
##NPOINTS=3735
##FIRSTX=399.26403809
##LASTX=4000.35498047
##MAXX=4000.35498047
##MINX=399.26403809
##MAXY=77.49081421
##MINY=30.12842369
##XFACTOR=1.0000000000
##YFACTOR=0.000000100000000
##FIRSTY=58.38668060
##DELTAX=0.96440572
##XUNITS=1/CM
##YUNITS=TRANSMITTANCE
##XYDATA=(X++(Y..Y))
399.3E83866806n037689k0403061o415291J740227N837860k245827L71933N335732
$$ 583866806 578829117 558426056 552010765 553750992 559588852 557343025 557714958 563050690
407E63050690m246521n419579k972145o945534k343788L274307o37512K226372Q604927
$$ 563050690 558804169 553384590 550412445 543466911 541123123 544397430 543759918 545986290 554591217
415.7E54591217Q662796M600067R62258j1761475j5895233N289955J0959663l663253
$$ 554591217 563254013 567854080 568816338 557054863 541159630 546449585 557409248 553745995
423.4E53745995o098938k95182K973366J742935k742653l892173q077164n443382K472343
$$ 553745995 547647057 547351875 550325241 552068176 549325523 545433350 537356186 531912804 534385147
432.1E34385147m07066P69424M328842J04027l396110K196273M798661J524925J35002
$$ 534385147 533978081 534747505 539076347 539180374 535784264 537980537 542779198 544304123 544439125
440.7E44439125p61490K189980K32925L09258M906501j173553m628716j12686K168961
$$ 544439125 543677635 545867615 546100540 546409798 551316299 550142746 545514030 545401344 547570305
449.4E47570305Q03375J623612N995178N49049j327209K140274J926117K529907k854500
$$ 547570305 548373680 549997292 555992470 556541519 555214310 557354584 559280701 561810608 558956108
458.1E58956108o831741k474976N466194M972077n380783k783356k035523p423629
$$ 558956108 552124367 549649391 555115585 560087662 554706879 551923523 549888000 542464371
465.8E42464371m54979L877754l870888l659897K390061L183479j73187j945686m953080
$$ 542464371 542009392 545887146 542016258 538356361 540746422 543929901 543756714 541811028 536857948
474.5E36857948k314872J554451p173806n074272K7695p29294K657013L283119K356835
$$ 536857948 534543076 536097527 528923721 523849449 523877144 523147850 525804863 529087982 531444817
483.2E31444817j652031n17884O91185n41877k056199l026695J604119O71615M07868
$$ 531444817 529792786 529274902 529966087 529424210 527368011 524341316 525945435 526617050 527024918
491.8E27024918l313942l822213M909554L814316p37343j791878j503677l593331k824401
$$ 527024918 523710976 519888763 524798317 528612633 527875290 526083412 524579735 520986404 518162003
500.5E18162003P45849M69475q71811k497139j79024m31747n00679j471481m005928
$$ 518162003 518907852 519377327 518505516 516008377 515829353 515397606 514896927 513425446 509419518
509.2E09419518j633988k700272j175842k82211M25186J887665j354485l605003m127083
$$ 509419518 507785530 505085258 503909416 503627205 504052391 505940056 504585571 500980568 496853485
517.9D96853485L3798K15264j942787l059388m094696l600883k375298J966744J420212
$$ 496853485 496887283 497102547 495159760 492100372 488005676 484404793 482029495 483996239 485416451
526.6D85416451M97817R48525O47583m58756L71056L187485p09686j493226o9122R98421
$$ 485416451 485914268 486862793 487510376 487051620 487422676 490610161 489900475 488407249 488338127 489336548
536.2D89336548J841316J526413K930222P92274K691116M779015K586784J822548P34520
$$ 489336548 491177864 492704277 495634499 496426773 499117889 503896904 506483688 508306236 509040756
544.9E09040756p86972p81936N16586m99954N37834J588058n29670p80983n66216N08537
$$ 509040756 508253784 507471848 507988434 507488480 508026314 509614372 509084702 508303719 507737503 508246040
554.5E08246040m75006k026291l022384l134499p52487m67415r14154k564201k538987
$$ 508246040 507771034 505744743 502722359 499587860 498835373 498367958 497453804 494889603 492350616
563.2D92350616j436500k194138k538337l100167l800010m326096k411728j614036
$$ 492350616 490914116 488719978 486181641 483081474 479281464 474955368 472543640 470929604
570.9D70929604n62821j112022j009102J352501l38669O35185J251717O52656J533699
$$ 470929604 470366783 469254761 468245659 469598160 469259491 469894676 471146393 471799049 473332748
579.6D73332748K605324J312409J434097M007835L003998L952713L627815K080422
$$ 473332748 475938072 477250481 478684578 482692413 485696411 489649124 493276939 495357361
587.3D95357361J562614R59320J531754J760101J420822K1859K51236k61574j08223
$$ 495357361 496919975 497879295 499411049 501171150 502591972 502613831 502865067 502603493 502495270
596E02495270L88832L24249Q24165k28691J6327j852493r70459K62527j675491P94487
$$ 502495270 502884102 503208351 504032516 503803825 503820152 501967659 500997200 501259727 499584236 500378723
605.6E00378723J406441J129341m53491k95906J535644K68364R36737j84517L10517
$$ 500378723 501785164 502914505 502461014 502165108 503700752 503969116 504905853 504721336 505031853
614.3E05031853J53389r10492J845321J913681J841355K140198K052116J778717J130829
$$ 505031853 505185242 504274750 506120071 508033752 509875107 512015305 514067421 515846138 516976967
623E16976967J203079J360970O70089L84941J071816P92351J929550J816482J71662
$$ 516976967 518180046 519541016 520211105 520596046 521667862 522460213 524389763 526206245 526377907
631.7E26377907K025757K877006P82738J78184j50184j457825l99551J512451J766205
$$ 526377907 528403664 531280670 532063408 532241592 532091408 530633583 530234032 531746483 533512688
640.4E33512688K78396M53682K954293P76863j380844O39572J612510R58405M72946
$$ 533512688 533791084 534244766 537199059 537975922 536595078 537234650 538847160 539805565 540278511
649E40278511Q08258O56586k93770Q05855L435516J003037j492653K54669N92956K01951
$$ 540278511 541086769 541743355 541449585 542255440 545690956 546693993 545201340 545456009 546048965 546250916
658.7E46250916j529923j571541J047058J071701J035080J594506J259155J427994
$$ 546250916 544720993 543149452 544196510 545268211 546303291 547897797 549156952 550584946
666.4E50584946P85560m365577J915550J166916k59323O81343Q05435J147804Q05435
$$ 550584946 551370506 547004929 548920479 550087395 549828072 550509415 551314850 552462654 553268089
675.1E53268089Q76808J756325J861954M93126q22792J087875J530342J42823m60053
$$ 553268089 554144897 555901222 557763176 558256302 557433510 558521385 560051727 560194550 559734497
683.8E59734497k93388r2049N87120J794701M38156L94478Q47168N34401K10189j510810
$$ 559734497 559441109 559349060 559936180 561730881 562169037 562563515 563410683 563945084 564155273 562644463
693.4E62644463j312523j238747j330109r28268l34168P07284n09263j309356j841774
$$ 562644463 561331940 560093193 558763084 557834816 557500648 558207932 557698669 556389313 554547539
702.1E54547539j657944k41737q23250j863022j661186p32384K22893J362495J308937
$$ 554547539 552889595 552647858 551824608 549961586 548300400 547568016 547790909 549153404 550462341
710.8E50462341R61037R09767Q39081J729240J900864J898270J275520R62601J840973
$$ 550462341 551423378 552333145 553172226 554901466 556802330 558700600 559976120 560938721 562779694
719.5E62779694K276840K762489K748871K385254K370109K710724K329789J253967
$$ 562779694 565056534 567819023 570567894 572953148 575323257 578033981 580363770 581617737
727.2E81617737J295738J843147J546097J902847J957856J224746J939545K161484
$$ 581617737 582913475 584756622 586302719 588205566 590163422 591388168 593327713 595489197
734.9E95489197K062530K349282J377868K27204l52250q17260K4566J168442L67394
$$ 595489197 597551727 599901009 601278877 601506081 601153831 600336571 600361137 601529579 601896973
743.6F01896973p706K21100J50757j94741j356811j672936k360458l632965k504654
$$ 601896973 601889267 602110367 602261124 602066383 600709572 599036636 596676178 593043213 590538559
752.2E90538559r25789j751785k019730n71861J6556j720581l297158j547126m21029
$$ 590538559 589612770 587860985 585841255 585269394 585285950 583565369 580268211 578721085 578300056
760.9E78300056k005233k431679j599464j174317k78397J089592J728631K251091K172164
$$ 578300056 576294823 573863144 572263680 571089363 570810966 571900558 573629189 575880280 578052444
769.6E78052444J006623J334266J874352J980896K621612L005219L158874K727891
$$ 578052444 579059067 580393333 582267685 584248581 586870193 589875412 593034286 595762177
777.3E95762177K417945K901383M277572M294281L616410L206024J939392J309280
$$ 595762177 598180122 601081505 605359077 609653358 613269768 616475792 618415184 619724464
785F19724464R68857J219292J584587J812744J566353K124405L128433K202034J789780
$$ 619724464 620693321 621912613 623497200 625309944 626876297 629000702 632129135 634331169 636120949
793.7F36120949J290321J064148J147881R15336R57718J077652J221619J613922K891769
$$ 636120949 637411270 638475418 639623299 640538635 641496353 642574005 643795624 645409546 648301315
802.4F48301315K388077J985169J365203L74375N09109l18298m99344o83975k25525
$$ 648301315 650689392 652674561 654039764 654414139 654923248 654604950 654105606 653421631 653196106
811.1F53196106o70700m1275J160583O71387J453247j56250m07791K82135j8311m46624
$$ 653196106 652525406 652484131 653644714 654316101 655769348 655613098 655205307 655487442 655469131 655022507
820.7F55022507k197876j137772J14212N71518m03213o34919P08771K58942n53208
$$ 655022507 652824631 651686859 651801071 652372589 651969376 651334457 652043228 652302170 651748962
829.4F51748962j944656j590347k358094l030090j206665q61359j595611k178497l07579
$$ 651748962 649804306 648213959 645855865 642825775 641619110 640757751 639162140 636983643 636676064
838.1F36676064p0954k323608k883339k003441j106224j913261j976243j806068j563759
$$ 636676064 636605110 634281502 631398163 629394722 628288498 626375237 624398994 622592926 621029167
846.8F21029167l72391o91032j207695q80508r46465k042732k955704k873993k413673
$$ 621029167 620656776 619965744 618758049 617877541 616931076 614888344 611932640 609058647 606644974
855.4F06644974k661553k727203j841888j124993k74277m87251o60820J291886L369941
$$ 606644974 603983421 601256218 599414330 598289337 598015060 597527809 596866989 598158875 601528816
864.1F01528816L965912K656632K261161L134156M557876M909516M017601M456405
$$ 601528816 605494728 608151360 610412521 613546677 618104553 623014069 627031670 631488075
871.8F31488075M541130M021988K457428K484894K205505P60880J488647L92762j137162
$$ 631488075 636029205 640051193 642508621 644993515 647199020 647959900 649448547 649841309 648704147
880.5F48704147n45730k6322l34549j020202j943817j541520j019973k664757m021149
$$ 648704147 648158417 648132095 647797546 646777344 644833527 643292007 642272034 639607277 635586128
889.2F35586128l462639k601051k950020k410126j638526j129952o17256j560745j542168
$$ 635586128 632123489 629522438 626572418 624162292 622523766 621393814 620776558 619215813 617673645
897.9F17673645j854858k866593k084884j348839k107468l212051k736740j798478
$$ 617673645 615818787 612952194 610867310 609518471 607411003 604198952 601462212 599663734
905.6E99663734j434974j781388k738418l079682l466644l651619m030838m179153
$$ 599663734 598228760 596447372 593708954 590629272 587162628 583511009 579480171 575301018
913.3E75301018l906365n108299m247360k787972l435211l074875l492622k631188
$$ 575301018 571394653 566286354 562038994 559251022 555815811 552740936 549248314 546617126
921E46617126j390571k030831j756439j365776r16710o74934k49748J76124K28272
$$ 546617126 545226555 543195724 541439285 540073509 539156799 538481865 538232117 538408241 538636513
929.7E38636513P29942J440964P80296K12479R37271K62566L01017Q67043Q96644J385117
$$ 538636513 539366455 540807419 541587715 541800194 542737465 543000031 543301048 544168091 545064735 546449852
939.3E46449852J936722K344055K004700J771774J173820J293526J45569k509727k960053
$$ 546449852 548386574 550730629 552735329 554507103 555680923 556974449 557120018 554610291 551650238
948E51650238l156738l471337l653373l845940l946686m095497n110512p029838o354027
$$ 551650238 548493500 545022163 541368790 537522850 533576164 529480667 524370155 517340317 510986290
956.7E10986290o408806o936264o726074o914711o359863o930695o342888o394348
$$ 510986290 504577484 497641220 490915146 484000435 477640572 470709877 464366989 457972641
964.4D57972641n950623o222610p415848p031708q229293p999955q292122p361907
$$ 457972641 452022018 445799408 438383560 431351852 423122559 415122604 406830482 399468575
972.1C99468575p610817q445626p501487p817955n533906o845207p075042n993653
$$ 399468575 391857758 383412132 375910645 368092690 362558784 355713577 348638535 342644882
979.8C42644882o121292n680427o072693m051743l996620k845345l072185k463417
$$ 342644882 336523590 330843163 324770470 320718727 316722107 313876762 310804577 308341160
987.6C08341160j517315j988525n71270j267415O19908j88904n97153m18873k2125
$$ 308341160 306823845 304835320 304264050 302996635 303616543 303427639 302830486 302411613 302389488
996.2C02389488J459809p11651O72836k53735K72828Q85524m39052N17502K77748P83786
$$ 302389488 303849297 303137646 303810482 303556747 303829575 304715099 304276047 304793549 305071297 305855083
1005.9C05855083q95023K52400k92473q02708J86997j209088j00632p03716J98441
$$ 305855083 304960060 305212460 304919987 304117279 304304276 303095188 302994556 302290840 302489281
1014.6C02489281p77951m27093N37128P8164R48543q15678P14398N37319J865883K088051
$$ 302489281 301711330 301284237 301821365 301899529 302848072 302032394 302746792 303284111 305149994 307238045
1024.2C07238045P25784J693935M19026J443119M75368J373845J538829J385861J839103
$$ 307238045 307963829 309657764 310076790 311519909 311995277 313369122 314907951 316293812 318132915
1032.9C18132915P46594K075691J048241K219086N36651p24830k60125k51922J075554
$$ 318132915 318879509 320955200 322003441 324222527 324759178 324034348 323774223 323522301 324597855
1041.6C24597855l48206J269989o18591j89209O25381l09219R27162o28395J165619
$$ 324597855 324249649 325519638 324901047 324711838 325337219 325028000 325955162 325326767 326492386
1050.2C26492386O42509K149315K100868J659813K524872J017037M251861L353996
$$ 326492386 327134895 329284210 331385078 333044891 335569763 336586800 340838661 344192657
1058C44192657M047661L371392K567749L854179K727699M313088L042640M074974L102494
$$ 344192657 348240318 351611710 354179459 358033638 360761337 365074425 368117065 372192039 375294533
1066.6C75294533J231880J261635n84336j335067l277436m164543n326996m019165
$$ 375294533 376526413 377788048 377203712 375868645 372591209 368426666 363099670 359080505
1074.4C59080505m551963m154892j772614j827774M48074q90503R22585L67012L78418
$$ 359080505 354528542 350373650 348601036 346773262 347221336 346330833 347253418 347620430 347998848
1083C47998848K614059J561470L169060J424179K001457J366692J979332L144188K842140
$$ 347998848 350612907 352174377 355343437 356767616 358769073 360135765 362115097 365259285 368101425
1091.7C68101425M610481K105599K162323J494255K177620J694565M53987J570053
$$ 368101425 372711906 374817505 376979828 378474083 380651703 382346268 382800255 384370308
1099.4C84370308l05557P40966m6157Q88748Q66318k50664Q94012N54581J644134M24309
$$ 384370308 384064751 384805717 384759560 385648308 386514626 386263962 387157974 387712555 389356689 389780998
1109.1C89780998K028198J939011J486740K302819J569366K947426J916771K725601
$$ 389780998 391809196 393748207 395234947 397537766 399107132 402054558 403971329 406696930
1116.8D06696930J842956J520653J897888K79656Q76999N34897J007156M78401J490593
$$ 406696930 408539886 410060539 411958427 412238083 413115082 413649979 414657135 415135536 416626129
1125.5D16626129J618080J609917K475929J288986K849923K184105J920547J913910
$$ 416626129 418244209 419854126 422330055 423619041 426468964 428653069 430573616 432487526
1133.2D32487526J292190J043053j0986P8087q60520n5618r31625j982804k224464
$$ 432487526 433779716 434822769 434811783 434889870 434029350 433973732 433042107 431059303 428834839
1141.9D28834839k944527l753052o346321l529091j929016k793617l121300k568702
$$ 428834839 425890312 422137260 415790939 412261848 410332832 407539215 404417915 401849213
1149.6D01849213j167984k314072r06296r75494q55522r87549j053810P6k23389O46744
$$ 401849213 400681229 398367157 397460861 396485367 395629845 394642296 393588486 393588562 393365173 394011917
1159.2C94011917J09177J586914J258735J619568K769776K973251M058304K420769
$$ 394011917 394121094 395708008 396966743 398586311 401356087 404329338 408387642 410808411
1166.9D10808411L725013L604088M007263N273323M889603N324059N462417O947708
$$ 410808411 414533424 418137512 422144775 427418098 432307701 437631760 443094177 450041885
1174.6D50041885N794602N389366N619278N374794N414581M959374N060119M244767
$$ 450041885 455836487 461225853 466845131 472219925 477634506 482593880 487653999 491898766
1182.4D91898766M658546M554367M678955M630661M552994M788895K748794K581482
$$ 491898766 496557312 501111679 505790634 510421295 514974289 519763184 522511978 525093460
1190.1E25093460K843247K033958J536674J165123R30253P26585J254349P66029O49300
$$ 525093460 527936707 529970665 531507339 532672462 533602715 534329300 535583649 536349678 536998978
1198.8E36998978R96360L25242K02178N36232O44799K03132M540M09927J199570J164703
$$ 536998978 537995338 538320580 538522758 539058990 539703789 539906921 539911461 540321388 541520958 542685661
1208.4E42685661J513596K441749J630974J375428J491241J254654J164093Q27026
$$ 542685661 544199257 546641006 548271980 549647408 551138649 552393303 553557396 554384422
1216.1E54384422J104698J495247J434594J174850J148987J250534P70378O0501n95093
$$ 554384422 555489120 556984367 558418961 559593811 560742798 561993332 562763710 562824211 562229118
1224.8E62229118r38606p12128r08126p27120n35393p29370l81k327o34308m53453
$$ 562229118 561290512 560578384 559670258 558943138 558407745 557678375 557677994 557675667 557041359 556587906
1234.4E56587906m28200n57594q29811j219483j427421q94242j05056j24054J92222
$$ 556587906 556159706 555602112 554772301 553552818 552125397 551231155 551126099 551002045 551194267
1243.1E51194267L28522M77867Q97904M86908J96609O6872l4294N16357Q82378J84936
$$ 551194267 551522789 552000656 552898560 553385468 553582077 553648949 553614655 554131012 555013390 555198326
1252.8E55198326J86691Q45299J010628J147652J153450J305465N81665j00708L02582
$$ 555198326 555385017 556230316 557240944 558388596 559542046 560847511 561429176 561328468 561631050
1261.4E61631050K34718l91578j52245O70204M59786Q05855J908073K026711J408844
$$ 561631050 561865768 561474190 561321945 561992149 562451935 563257790 565165863 567192574 568601418
1270.1E68601418R98382R33113M63333J06621l90167k31247O46858P60384L51181L31268
$$ 568601418 569599800 570532913 570996246 571102867 570712700 570481453 571128311 571888695 572239876 572571144
1279.8E72571144M25720L20130K04963l24401m73061m95682l10478j56975n65491k19039
$$ 572571144 572996864 573316994 573521957 573197556 572724495 572228813 571918335 571761360 571195869 570976830
1289.4E70976830P4348J55754M09737J29852p41196p66182o14814j515198j344414
$$ 570976830 571051178 571206932 571616669 571746521 571005325 570239143 569624329 568109131 566764717
1298.1E66764717p48749o44951q46862m26026L5477p13005n55153n88722q55103q51021
$$ 566764717 566015968 565371017 564524155 564098129 564133606 563420601 562865448 562276726 561421623 560570602
1307.7E60570602j509208j462364j140786n50995j96189l99552k18124p8659k96822
$$ 560570602 559061394 557599030 556458244 555907249 555711060 555311508 555093384 555014725 554717903
1316.4E54717903j008339r73205j104432j045646m04854q66661r12209q61930r18770
$$ 554717903 553709564 552736359 551631927 550586281 550181427 549314766 548402557 547540627 546621857
1325.1E46621857p49970j249542j626091j835785k240906k476539j908417j786919
$$ 546621857 545871887 544622345 542996254 541160469 538919563 536443024 534534607 532747688
1332.8E32747688k091331j294441r89113q89168q96454k94495O11l44162k27280n93262
$$ 532747688 530656357 529361916 528372803 527483635 526587181 526292686 526293297 525949135 525721855 525128593
1342.4E25128593q0795j43089J17073K71110J11504M91600J21956J34582K18087O03103
$$ 525128593 525047798 524904709 525021782 525292892 525404396 525895996 526017952 526152534 526370621 526973724
1352.1E26973724k75879o86187m59214r10835q7738l78189o81610p64885m90112K12784
$$ 526973724 526697845 526011658 525552444 524641609 524553871 524175682 523494072 522729187 522239075 522451859
1361.7E22451859q9417n32074q07915k17857r88503q11271m85153m17023J50146k71682
$$ 522451859 522362442 521830368 521022453 520804596 519816093 519004822 518519669 518102646 518252792 517981110
1371.4E17981110R72213P96090Q09783N70603L4447Q58230K02294P23381K00119Q7242
$$ 517981110 518953323 519749413 520559196 521129799 521164246 522022476 522224770 522948151 523148270 523235512
1381E23235512M64706N02014J157837J241188K190438J903267J299018J085167J344223
$$ 523235512 523700218 524202232 525360069 526601257 528791695 530694962 531993980 533079147 534423370
1389.7E34423370J086655Q27560Q32253O00281J339531j49346J41030L15628L9024
$$ 534423370 535510025 536337585 537169838 537770119 539109650 538960304 539101334 539416962 539455986
1398.4E39455986j054573j222038L16810p87925q40760n95588r16596q88252p00913
$$ 539455986 538401413 537179375 537496185 536708260 535867500 535271912 534355316 533467064 532766151
1407.1E32766151K518m41666n36384j231690r94110r52301r81598l36036p21474j76468
$$ 532766151 532768669 532327003 531790619 530558929 529564819 528612518 527630920 527294884 526573410 526396942
1416.7E26396942o35681J90735j308365o92635Q92220m48570R7618r45702K55432M56772
$$ 526396942 525761261 525951996 524643631 523950996 524843216 524394646 524492264 523546562 523801994 524258766
1426.3E24258766l30276Q95843N45807N98869J56517J431466R62715L28483J223564
$$ 524258766 523928490 524824333 525370140 525969009 526125526 527556992 528519707 528848190 530071754
1435E30071754N93186o16570j076584J581269R21593Q21456J190949P21474J427765
$$ 530071754 530664940 530048370 528971786 530553055 531474648 532296104 533487053 534208527 535636292
1443.7E35636292J60369K55013j9302L65142j080513n56450O91605q74214J0681q99200
$$ 535636292 535796661 536051674 536032372 536397514 535317001 534760551 535452156 534577942 534588623 533689423
1453.3E33689423M81338N20744k42805q51250m815407K496224m89464J082649J20011
$$ 533689423 534170761 534691505 534448700 533597450 528782043 531278267 530788803 531871452 531991463
1462E31991463N28030J878624k33154K718963J094284L008423K444840L477669M011611
$$ 531991463 532519493 534398117 534164963 536883926 537978210 540986633 543431473 546909142 550920753
1470.7E50920753J895066N937729J850204M689255L334350M372521L857307L228798
$$ 550920753 552815819 558753548 560603752 565293007 568627357 572999878 576857185 580085983
1478.4E80085983M317818K799263L762855J902009K939300K328186K084122L462601
$$ 580085983 584403801 587203064 590965919 592867928 595807228 598135414 600219536 603682137
1486.1F03682137J561050K978134J647873L179855J705017J903229K400933R78279
$$ 603682137 605243187 608221321 609869194 613049049 614754066 616657295 619058228 620036507
1493.8F20036507K206611J184082O37245J239625J914100Q14171J058083J829681K41890
$$ 620036507 622243118 623427200 624064445 625304070 627218170 628032341 629090424 630920105 631161995
1502.5F31161995J601791J682320K714577l299866n434074O307029J128884J682243
$$ 631161995 632763786 634446106 637160683 633860817 628426743 634733772 635862656 637544899
1510.2F37544899J274033J908760O4010J171036J348038K75802K171326k912445K557907
$$ 637544899 638818932 640727692 640791702 641962738 643310776 643586578 645757904 642845459 645403366
1518.9F45403366K094574o27975j66092N90820M133377J650009K29645l09067J083603
$$ 645403366 647497940 646869965 646703873 647294693 651428070 653078079 653307724 652998657 654082260
1527.6F54082260K07291m99649J128616K24075J452713M73023p74307J314544Q40302
$$ 654082260 654289551 653789902 654918518 655142593 656595306 657068329 656294022 657608566 658448868
1536.3F58448868J830292K678680K725372p677002J947937q316m85382K809067N19562
$$ 658448868 660279160 662957840 665683212 658006210 659954147 659945831 659460449 662269516 662789078
1545F62789078q29315Q89434J297379R93423N60532p37991O31485Q79364K66723r34143
$$ 662789078 661959763 662849197 664146576 665139999 665700531 664962540 665594025 666473389 666740112 665805969
1554.6F65805969r27658K678681L245086j725311k425690k306823L515090J081696
$$ 665805969 664878311 667556992 670802078 669076767 666651077 664344254 667859344 668941040
1562.3F68941040P0114l93829j880951k19803N59692N30777Q2169k664413N12084O08292
$$ 668941040 669011154 668617325 666736374 666516571 667076263 667607040 667689209 665024796 665536880 666145172
1572F66145172o91299j05667N66864q75397o357193N5313N60532o65284r28802q19626
$$ 666145172 665453873 665348206 665915070 665039673 658682480 658737793 659298325 658633041 657704239 656884613
1581.6F56884613l23486j134491j168747j601105k062988j842652k108001j635590
$$ 656884613 656561127 655426636 654257889 652656784 650593796 648751144 646643143 645007553
1589.3F45007553k178726j527023j431008j113777j143150j722145j775856k836037
$$ 645007553 642828827 641301804 639870796 638757019 637613869 635891724 634115868 631279831
1597F31279831j935768k624588k533760k127381j816787j656609k409058j243667j689606
$$ 631279831 629344063 626719475 624185715 622058334 620241547 618584938 616175880 614932213 613242607
1605.7F13242607j058311k142029j921654k227936l309707j362572k583580j710510
$$ 613242607 612184296 610042267 608120613 605892677 602582970 601220398 598636818 596926308
1613.4E96926308k230645m23507N97267o880722p1182m38309p15752k115021n08766
$$ 596926308 594695663 594272156 594869423 587988701 587917519 587479210 586763458 584648437 584139671
1622.1E84139671q10623n203819m02107l26653K28539k021180p31849J07193o51970
$$ 584139671 583329048 578125229 577723122 577396469 577625008 575603828 574871979 574979172 574327202
1630.8E74327202j65215n78651O12335O45752k251625k850342J284447J06430J36261
$$ 574327202 574161987 573583336 574195671 574841423 572589798 569739456 571023903 571130333 571266594
1639.5E71266594R38034l02849J101418J40037R65538J020813r81827J396828j58882
$$ 571266594 572204628 571901779 573003197 573143234 574108772 575129585 574147758 575544586 575385704
1648.1E75385704J501656O28814J986504K796669J557312j518135J330490K950973
$$ 575385704 576887360 577516174 579502678 582299347 583856659 582338524 583669014 586619987
1655.9E86619987J651574J743164J120567J165047J579551K274857K373467J061325
$$ 586619987 588271561 590014725 591135292 592300339 593879890 596154747 598528214 599589539
1663.6E99589539K767868K317161K275620K250137K738457O14586J062965L855782
$$ 599589539 602357407 604674568 606950188 609200325 611938782 612553368 613616333 617472115
1671.3F17472115J509399K401352L315887K366410J15852K736893L030052K400284
$$ 617472115 618981514 621382866 624698753 627065163 627181015 629917908 632947960 635348244
1679F35348244K936516N66825J906853M164810O000672j417160r54209L145905K642746
$$ 635348244 638284760 638851585 640758438 644923248 650923920 649506760 648552551 651698456 654341202
1687.7F54341202J705169K143174J832962J301803J447373J104736K411423L514862
$$ 654341202 656046371 658189545 660022507 661324310 662771683 663876419 666287842 669802704
1695.4F69802704j923676J594773L048248L927841K962113m866944K373657K446671
$$ 669802704 667879028 669473801 672522049 676449890 679412003 674545059 676918716 679365387
1703.1F79365387J329880j028977N9052k60010O10809J863785J241760O39801P88956
$$ 679365387 680695267 679666290 679725342 679465332 680076141 681939926 683181686 683821487 684610443
1711.8F84610443J189652J235580j7090j006622J355820J048812m277038J110916K147598
$$ 684610443 685800095 687035675 687018585 686011963 687367783 688416595 684139557 685250473 687398071
1720.5F87398071J514283J038513R05075J95236M49524M77142o6528L77579P57370
$$ 687398071 688912354 689950867 690855942 691051178 691500702 691977844 691911316 692288895 693046265
1729.1F93046265o07148r66720K050705K691650l90320j453933J709671K416610J227417
$$ 693046265 692439117 691472397 693523102 696214752 695824432 694370499 696080170 698496780 699724197
1737.8F99724197J305695m04434k490311K009277J694031L83148J211319K475968K052994
$$ 699724197 701029892 700625458 698135147 700144424 701838455 702221603 703432922 705908890 707961884
1746.5G07961884J227951J536254K46506J970597L37982k55585K655411J468734J315842
$$ 707961884 709189835 710726089 710972595 712943192 713281174 713025589 715681000 717149734 718465576
1755.2G18465576K238236Q64334J008987K223969J478119J921768N00412o10657J223221
$$ 718465576 720703812 721568146 722577133 724801102 726279221 728200989 728701401 728090744 729313965
1763.9G29313965N47180O27060J242599J909028j66626J072006K772751N67398p69043
$$ 729313965 729861145 730488205 731730804 733639832 733473206 734545212 737317963 737885361 737116318
1772.5G37116318j581421J909180J100463r10186R48715L23715J328430J280060r7351
$$ 737116318 735534897 737444077 738544540 737634354 738583069 738906784 740235214 741515274 741417923
1781.2G41417923O15845J176758J073760o00967n04303N28641M40063J56556J136703
$$ 741417923 742033768 743210526 744284286 743683319 743179016 743707657 744147720 744304276 745440979
1789.9G45440979P50275N03387J04599m37546K219544P36694n99823L96195Q40454
$$ 745440979 746191254 746694641 746799240 746361694 748581238 749317932 748718109 749114304 749954758
1798.6G49954758J09558j222992J283188O00967O32858J273728P79190O59180l4028
$$ 749954758 750064316 748841324 750124512 750725479 751358337 752632065 753411255 754070435 754036407
1807.3G54036407p934L1280P50809o58188n83420N32837K77100J058731O87485J205368
$$ 754036407 754028473 754059753 754810562 754152374 753568954 754101791 754378891 755437622 756125107 757330475
1816.9G57330475K46429j56784P10297k10266L6010m13665K44446R35134o33316k54211
$$ 757330475 757576904 757420120 758130417 757920151 757956161 757542496 757786942 758722076 758088760 757834549
1826.5G57834549J256943J866607R74121j945114o18896J244201R16l80936k50549
$$ 757834549 759091492 760958099 761932220 759987106 759368210 760612411 760613327 760232391 759981842
1835.2G59981842j87836K76490p2327J050644O89926Q38776N89447M95529P32727m152145
$$ 759981842 759794006 760070496 759998169 761048813 761738739 762577515 763166962 763662491 764395218 760243073
1844.9G60243073q8807R20487K8839r5062L57666J191711N33218M60129k51922P1182
$$ 760243073 760154266 761074753 761103592 761008530 761366196 762557907 763091125 763551254 763299332 763370514
1854.5G63370514J64642j98135p7438p28379j05972K57645N27343j61132O13708Q68378
$$ 763370514 763535156 763337021 763259583 762531204 762425232 762682877 763210220 763049088 763662796 764531174
1864.2G64531174l29438M28772k96859R308n75333j313858M7455K86789P53097L81622
$$ 764531174 764201736 764630508 764333649 764342957 763767624 762453766 762501221 762788010 763541107 763922729
1873.8G63922729Q13065N84259O4621k37427J55869J73263r24072M8142P9879K94876
$$ 763922729 764735794 765320053 765384674 765147247 765303116 765476379 764552307 764600449 764680328 764975204
1883.4G64975204K30637j70746L76129L89481J140060N3025j524201m35486M49524
$$ 764975204 765205841 765035095 765411224 765800705 766940765 766993790 765469589 765034103 765483627
1892.1G65483627K64435J4115K14920j71509O74438L08762K67868K75040m07486J25885
$$ 765483627 765748062 765762177 765977097 765805588 766480026 766788788 767056656 767331696 766924210 767050095
1901.8G67050095r9488j67007m31976p3395K09427Q1405L86811K49176m4709m49447
$$ 767050095 766950607 766783600 766351624 766278229 766487656 766569061 766955872 767205048 767160339 766710892
1911.4G66710892O39114L12729k57416j88751l78342M09623j095276j88370J293564
$$ 766710892 767350006 767662735 767405319 767216568 766838226 767247849 766152573 765964203 767257767
1920.1G67257767P20520O86569k61841q38013n4931O4163l07999j60675l26461o0425
$$ 767257767 767978287 768664856 768403015 767565002 767510071 767574234 767266235 767105560 766779099 766718674
1929.7G66718674L13873K65121L89328j04522K38952l1051l2273k7084n95627M807
$$ 766718674 767032547 767297668 767686996 767582474 767821426 767790375 767758102 767731018 767135391 767140198
1939.4G67140198M2419O76422J50910r77173K92358Q42209L55454n75180j46485j67160
$$ 767140198 767182617 767859039 768009949 767032776 767325134 768167343 768522797 767947617 767801132 767633972
1949G67633972k24380R613k18430j20239L02124O34918L17383O30798P1335l70636
$$ 767633972 767409592 767419205 767200775 767080536 767382660 768017578 768334961 768965759 769037094 768666458
1958.7G68666458j83182l62472k38724o25839r3002J79519O86798J325074L23486o62460
$$ 768666458 768483276 768120804 767882080 767256241 767163239 767342758 768029556 769354630 769678116 769015656
1968.3G69015656m41514M21525j51444n46265m45022k57416K57034J29090M14276K43988
$$ 769015656 768574142 768995667 768844223 768297958 767852936 767595520 767852554 767981644 768395920 768639908
1978G68639908L18146K95105K62146J00479m15192j61667o40945n59311k27585R7580
$$ 768639908 768958054 769253159 769515305 769615784 769200592 769038925 768397980 767838669 767611084 767708664
1987.6G67708664K93503J14746O23855N31540L32795j92643k69088l26157l83987r7657
$$ 767708664 768002167 768116913 768740768 769272308 769605103 769412460 769143372 768817215 768433228 768335571
1997.2G68335571j28860J3199l47214J40304L37601J23596O64215M33732o4469l74985
$$ 768335571 768206711 768219910 767872696 768013000 768350601 768474197 769138412 769572144 769507675 769132690
2006.9G69132690o08139r63287l26614r7275j75858L67966M03595K96326l31726J14898
$$ 769132690 768524551 767561264 767234650 767137375 766961517 767329483 767733078 768029404 767697678 767812576
2016.5G67812576k07061p74079k75726o19812l77197j70670K51465J34582J91574L81089
$$ 767812576 767605515 766831436 766555710 765935898 765558701 765388031 765639496 765774078 765965652 766346741
2026.2G66346741J93252L85742p34634p09381l18375n9051l30277q39996K09351J10626
$$ 766346741 766539993 766925735 766191101 765481720 765163345 765104294 764774017 763934021 764143372 764253998
2035.8G64253998J97143J12229r4605K747q3542k29950q01163k28729l56293J90354
$$ 764253998 764451141 764563370 764468765 764471512 764387970 764158020 763356857 763128128 762771835 762962189
2045.5G62962189M58374r4376J24130o9885L42331l43475j52664J41754n79377k28424
$$ 762962189 763420563 763326187 763450317 763380432 763722763 763379288 763226624 763368378 762789001 762560577
2055.1G62560577j61972K85950J04904Q7052P0648J34582L08152l31726L26309J59225
$$ 762560577 762398605 762684555 762789459 762876511 762947159 763081741 763389893 763058167 763384476 763543701
2064.7G63543701n31540k66418K0599k59247m19540K62680M13971M72412J24359L11127
$$ 763543701 763012161 762745743 762766342 762507095 762087555 762350235 762764206 763236618 763360977 763672104
2074.4G63672104K07825n15061l85284l04108n6534k87094o6604L49807L35846K58332
$$ 763672104 763879929 763364868 762979584 762675476 762618942 762331848 762265244 762615051 762950897 763209229
2084G63209229L35006N44281k52914l07999k13928k08054j87912k75116K05841J51825
$$ 763209229 763544235 764088516 763835602 763527603 763313675 763105621 762917709 762642593 762848434 763000259
2093.7G63000259L93067L76968K98538J32370k06909k89459j78680J86080n36575l82385
$$ 763000259 763393326 763770294 764068832 764201202 763994293 763704834 763526154 763712234 763175659 762793274
2103.3G62793274J87225M38156L05252J21613Q33282J40076J1368K6398n03159n60989
$$ 762793274 762980499 763418655 763723907 763845520 764678802 764818878 764830246 764856644 764353485 763792496
2113G63792496m19236J64490p0572J41068J70898L37372N54886J14670Q2168l66287
$$ 763792496 763373260 763537750 763467178 763608246 763779144 764116516 764671402 764786072 764868240 764501953
2122.6G64501953j92413l25775l72162J63193N5084k25754l4561N39932K72598J94931
$$ 764501953 764309540 763983765 763611603 763774796 763829880 763604126 763569565 764109497 764382095 764577026
2132.3G64577026M0589K23465R6817q02155m99344j59912J90125j02234K58026O86722
$$ 764577026 764617615 764841080 764937897 764135742 763636398 763476486 763666611 763564377 763822403 764509125
2141.9G64509125J3275L43552R9639j88598k73590l25775m50898o42852N6533K60086
$$ 764509125 764522400 764865952 764965591 764776993 764503403 764177628 763726730 763083878 763140411 763400497
2151.5G63400497M15955O18210N04150K41928J16959n3558k96708r1323j12458k83508
$$ 763400497 763816452 764434662 764938812 765180740 765297699 765244141 764947433 764856110 764743652 764460144
2161.2G64460144m97894M3640J01547K40860R76410L97949L62473M78210j2436n83954
$$ 764460144 763962250 764005890 764107437 764348297 765324707 765722656 766085129 766563339 766550903 765966949
2170.8G65966949m42886k41241j78528P00455M07791L75671M57993L21579O26525K90070
$$ 765966949 765524063 765282822 765104294 765804749 766212540 766588211 767046204 767367783 767994308 768284378
2180.5G68284378k43759o17066J65329J30463m08096l80249o7139N55649L64380M23126
$$ 768284378 768040619 767423553 767588882 767719345 767311249 766931000 766863861 767419510 767783890 768207016
2190.1G68207016K64282L56140L8910j55258J93100j92337J71890p3471R8877O1417
$$ 768207016 768471298 768827438 768866348 768711090 768904190 768711853 768883743 768810272 768909149 768970566
2199.8G68970566L3340Q28629L77579K83737q2474l0518O0654j45492r2164k35824
$$ 768970566 769003906 769832535 770210114 770493851 770411377 770380859 770441513 770296021 770203857 769968033
2209.4G69968033J63803N6839L93143J49688P6142L10745q2245K96707N5008j20621
$$ 769968033 770131836 770188675 770581818 770731506 770807648 771118393 771036148 771332855 771387863 771267242
2219G71267242m65393J79520N68390j92719L24097J62201R7198O9504K442R7961l7613
$$ 771267242 770801849 770981369 771549759 771357040 771681137 771843338 771940536 772010040 772012482 772110443 772072830
2229.7G72072830m4479j62125L49884Q5221O3705M03061K91214K07825J16272L9901
$$ 772072830 772028351 771866226 772216110 772301331 772365036 772768097 773059311 773267136 773383408 773423309
2239.3G73423309n51071k63214k41928k61459J53732K49405K03399Q6670O15845o5994
$$ 773423309 772872238 772609024 772367096 772105637 772259369 772508774 772712173 772798843 773414688 773348694
2248.9G73348694k88239J89514o4544l61939k70996L94440l34473k53219L19748L54614
$$ 773348694 773060455 773249969 773185425 772823486 772552490 772946930 772612457 772359238 772678986 773033600
2258.6G73033600M98504K45209K41776m81568k09121n6534k46430M6082j30844J68991
$$ 773033600 773532104 773777313 774019089 773537521 773328400 773271866 773025436 773071518 772940674 773109665
2268.2G73109665J4954K23999L34777M29230L27759j53809q3389k81372L1815j95923
$$ 773109665 773124619 773348618 773683395 774112625 774440384 774286575 774203186 773921814 773953629 773757706
2277.9G73757706l54004j93329L17917O59485N6915J14441Q5373M63638l128m08783
$$ 773757706 773403702 773210373 773528290 774187775 774244690 774359131 774444504 774908142 774905014 774496231
2287.5G74496231m23431o37436L45001o1722j63498j09558O0196M40979k3422J93024
$$ 774496231 774072800 773435364 773780365 773718643 773555145 773445587 773505783 773946762 773923340 774116364
2297.2G74116364j45951l37143n34057N0277m3945k59857N09720k90680L16391J73874
$$ 774116364 773970413 773633270 773099213 773149490 773105545 772845688 773355408 773064728 773381119 773554993
2306.8G73554993R0332J50528o61698K30942M3564L41568k50931l42941K51465m83933
$$ 773554993 773645325 773795853 773134155 773365097 773408661 773750229 773499298 773156357 773407822 772923889
2316.4G72923889J82114L5095l07159p74155k53449j08642o16837O92368N03464n23835
$$ 772923889 773106003 773141098 772833939 772059784 771806335 771697693 771080856 771773224 772276688 771752853
2326.1G71752853j331100l74909L4791L85513N10025n91049K11334j38855L40271J47095
$$ 771752853 770421753 770046844 770081635 770467148 770977173 770386124 770597458 770458603 770798874 770945969
2335.7G70945969q45414k53219O50329Q55332k93503j04446l70255m01840j164398
$$ 770945969 770100555 769847336 770497665 771352997 771059494 770955048 770584793 770182953 769018555
2344.4G69018555n77774R14154j61591M81873J107406R22013l79715r92813j2970N6610
$$ 769018555 768440781 769354935 769193344 769675217 770782623 771704636 771324921 770332108 770319138 770375748
2354.1G70375748l70941j574784q80432O16455P33109k285691j879577N78918L27835
$$ 770375748 770004807 768430023 767549591 768166046 768899155 766613464 764733887 765312805 765640640
2362.7G65640640K234421N43213n56030j86005J98822j49536n39246J234207m21676
$$ 765640640 767875061 768418274 767862244 767676239 767875061 767725525 767186279 768420486 767998810
2371.4G67998810m71802M8981l16162J36032K16903R10264L71475j15128k76108k83584
$$ 767998810 767527008 767575989 767259827 767395859 767612762 768523026 768894501 768779373 768503265 768219681
2381.1G68219681m33808m73785j26724r9106O29196M53644J92947K55051j58005k68936
$$ 768219681 767785873 767312088 767185364 767086258 767715454 768169098 768362045 768617096 768459091 768190155
2390.7G68190155l19443l58886o64826j53122j23138j19248J4801m84695K52304M16794
$$ 768190155 767870712 767511826 766847000 766693878 766570740 766451492 766466293 765981598 766233902 766650696
2400.3G66650696L89023K51388m37774o84205n82885k46964j31454L38363j82418n77164
$$ 766650696 767039719 767291107 766853333 766169128 765586243 765339279 765207825 765546188 765363770 764786606
2410G64786606r8953R8037J43662k77329k04544m27398m03977j36948k78167k38114
$$ 764786606 764687653 764785690 764929352 764652023 764447479 764020081 763616104 763479156 763200989 762962875
2419.6G62962875r2620K96783p5760k84195m01687l83072k11335l88107j76926l73153
$$ 762962875 762870255 763167038 763091278 762807083 762405396 762022324 761810989 761422882 761245956 760872803
2429.3G60872803k34452j08490l6010N2337Q7815K15225l83835m76532p36999o11649
$$ 760872803 760638351 760529861 760493851 760546188 760634003 760849228 760465393 759988861 759251862 758640213
2438.9G58640213l13873n80521j90964J5488J89972R1400n9051j80359k93579j95313
$$ 758640213 758326340 757745819 757554855 757570343 757760315 757851715 757792664 757612305 757318726 757123413
2448.6G57123413j15127j90354q53882p66678l96881p0266j4267k1286K80685j20468
$$ 757123413 757008286 756817932 755964050 755197372 754800491 754730225 754715958 754694672 754975357 754854889
2458.2G54854889l7918l98407p16553l85895l55453l05786m85077n9738P7438j92108
$$ 754854889 754816971 754418564 753702011 753316116 752960663 752654877 752169800 752110062 752187500 751995392
2467.8G51995392m9362L73535J19324o35987n34134l11889M4021n58929r32083k79541
$$ 751995392 751946030 752319565 752438889 751802902 751268768 750956879 751000900 750441971 749509888 749230347
2477.5G49230347r3003K19422P7820K00882L14712j06430n60608m53720J9150m37165
$$ 749230347 749137344 749356766 749434586 749635468 749950180 749843750 749283142 748829422 748848572 748411407
2487.1G48411407n87768o31638l96499Q1176J69526L32946J42136k4185j45722l4408
$$ 748411407 747823639 747192001 746795502 746876678 747046204 747379150 747521286 747497101 747351379 747316971
2496.8G47316971m08325q37098o45294k57568K75268R9183J13220K01111K26059N6839
$$ 747316971 746908646 746071548 745426254 745168686 745443954 745543137 745656357 745857468 746083527 746140366
2506.4G46140366k82822j07422l53241o14242n69611q2169r3612l69034j51291N4779
$$ 746140366 745857544 745750122 745396881 744782639 744213028 744130859 744037247 743668213 743516922 743571701
2516.1G43571701L53851j34582j84479q9264k01797j3352l63464m46549m28085l68118
$$ 743571701 743925552 743790970 743606491 743517227 743315430 743302078 742938614 742492065 742063980 741695862
2525.7G41695862j15433L90625J01395k83280m0893n95932o43921m57153n6839l0518
$$ 741695862 741580429 741971054 742072449 741789169 741748276 741152344 740508423 740051270 739994431 739963913
2535.4G39963913m48151k63519j90964J76621k15912k98233K6092j13525k23999o16226
$$ 739963913 739515762 739252243 739061279 739237900 739021988 738723755 738749847 738636322 738412323 737796097
2545G37796097l05634j77231j51138l16315k00882J72806m56466l02201j10702l88489
$$ 737796097 737490463 737313232 737162094 736845779 736644897 736817703 736361237 736059036 735948334 735559845
2554.6G35559845n10330l88489j83029l59421k59094R1476J87302k40021j76468q9798
$$ 735559845 735049515 734661026 734477997 734118576 733859482 733950958 734138260 733898239 733721771 733631973
2564.3G33631973K6017j2208q10852p32574m57993k12707j14670k71759m46472k10190
$$ 733631973 733657990 733645782 732834930 732102356 731644363 731431656 731316986 731045227 730598755 730388565
2573.9G30388565L58734N5618n9356m50897k50321j88293r21860n03540m40369r9487
$$ 730388565 730747299 730802917 730743561 730292664 730042343 729854050 728932190 728428650 727988281 727888794
2583.6G27888794R2392O8130L16544J25961j7242o28128m07334r9563m91409o06843
$$ 727888794 727981186 728049316 728365860 728491821 728474579 727846451 727439117 727339554 726848145 726241302
2593.2G26241302k88085k11792n10788j14212K91442O91834O7215n36652k95639m78210
$$ 726241302 725953217 725741425 725230637 725116425 725407867 726099701 726166916 725630264 725334625 724856415
2602.9G24856415m50287o23245p8202j67617n53742M654l5324J14975k40784m98047
$$ 724856415 724406128 723782883 723704681 723537064 722983322 722987976 722952652 723067627 722826843 722328796
2612.5G22328796p8659R9259l18909o99310m54102n00793m08707m83627l25470k50702
$$ 722328796 722250137 722349396 722030487 721331177 720877075 720376282 719967575 719483948 719158478 718907776
2622.1G18907776k77786R4604j66855n86090j020813m80881j96609n30014l12576o22940
$$ 718907776 718629990 718724594 718557739 717971649 716950836 716469955 716273346 715743332 715430756 714807816
2631.8G14807816o44837m87518o3629K49252k75040p19757n04379l12195q56552o41861
$$ 714807816 714162979 713675461 713611832 713861084 713586044 712866287 712361908 712049713 711193161 710551300
2641.4G10551300k66266l54767m49142m03061r1019j43203l66364o44226k75803m97131
$$ 710551300 710285034 709930267 709481125 709078064 708987045 708843842 708477478 707833252 707557449 707060318
2651.1G07060318j191940o06385r0866j11618k19574l63388n92041l76968n31082p61490
$$ 707060318 705868378 705261993 705171127 705059509 704839935 704476547 703884506 703507538 702976456 702214966
2660.7G02214966k54212k38189n0125k25525n19257k36359j67617k63367l05634m02984
$$ 702214966 701960754 701722565 701672440 701446915 700927658 700691299 700523682 700260315 699954681 699551697
2670.4F99551697o12183j43280n34439p50885k62375n43823j63956k47879l04184j11389
$$ 699551697 698939514 698796234 698261795 697510910 697248535 696704712 696540756 696292877 695988693 695877304
2680F95877304l43475l97415k98996k54136q62121l55988j42440n67856j38092k19193
$$ 695877304 695533829 695136414 694837418 694583282 693721161 693365173 693222733 692654877 692516785 692297592
2689.6F92297592l98865l67508k03247n44357k90527J98745l67584n82885o44761k56576
$$ 692297592 691898727 691531219 691327972 690783615 690493088 690691833 690324249 689741364 689096603 688840027
2699.3F88840027k92816p17163n20630j39389K38342m272m50593q03833m00695j00098
$$ 688840027 688547211 687830048 687309418 687170029 687408371 687404099 686953506 686149673 685748978 685648880
2708.9F85648880n72968o66656m43039k62299o16989m87899j40381m50516m21372l59725
$$ 685648880 685075912 684409256 683966217 683703918 683086929 682599030 682458649 682008133 681586761 681227036
2718.6F81227036o48499l03116Q8196l78037m72488l49655m6616q3389m14963k99682
$$ 681227036 680578537 680275421 680363617 679985580 679513092 679163437 679116821 679033432 678618469 678318787
2728.2F78318787o70319m36554l92685m34341K8381k48489o11725p55768j77383M5013
$$ 678318787 677648468 677211914 676819229 676384888 676413269 676164780 675553055 674797287 674619904 674664917
2737.9F74664917j41678k51465j99814J5412n75714m09851j34583k15759o9733M3488
$$ 674664917 674523239 674271774 674071960 674087372 673511658 673101807 672967224 672751465 672681732 672725220
2747.5F72725220P2174l49579n31921n40696k07138o09893p04804l46985n23910K88620
$$ 672725220 672797394 672447815 671915894 671375198 671168060 670558167 669853363 669506378 668982468 669271088
2757.2F69271088j73416m90037O4240k47269j56250k212P6752l76053l29514j51367
$$ 669271088 669097672 668607635 668671875 668424606 668268356 668266144 668342896 667966843 667637329 667485962
2766.8F67485962m14810l88184o29959l24173L5095K40174j3352m59137m31671n71670
$$ 667485962 667071152 666682968 666053009 665728836 665763931 666004105 665990753 665531616 665099945 664528275
2776.4F64528275m96140l97110l96347m57382j15738M0588k42920l19671n96619o23932
$$ 664528275 664032135 663635025 663238678 662781296 662665558 662706146 662463226 662143555 661546936 660923004
2786.1F60923004m88510l66058m25415l11432n16739q51746l32489k00042l72849j073990
$$ 660923004 660434494 660068436 659643021 659331589 658814850 657963104 657630615 657430573 657057724 655983734
2795.7F55983734q29925K37503l08228p69043o02112p07702j124726j044464o59485
$$ 655983734 655153809 655391312 655083084 654314041 653711929 653004227 651879501 650835037 650175552
2804.4F50175552m56619k52685k69928m70200j158218j314011j097336n03464l69491
$$ 650175552 649718933 649466248 649196320 648726120 647567902 646253891 645156555 644653091 644283600
2813.1F44283600j183396q79058q08030p56073o43463q89854n01442o62842q59108
$$ 644283600 643100204 642221146 641413116 640657043 640013580 639123726 638622284 637959442 637100334
2821.8F37100334p39174j160621j604042j137925q95156m59214M2038j253395j602974
$$ 637100334 636361160 635200539 633596497 632458572 631563416 631104202 631146240 629892845 628289871
2830.4F28289871r69543r36966j094170j156463r01299j035843j057739j243134j452369
$$ 628289871 627320328 626383362 625289192 624132729 623231430 622195587 621137848 619894714 618442345
2839.1F18442345j833763j769829j079369j579704j656647j555900j964951k181511
$$ 618442345 616608582 614838753 613759384 612179680 610523033 608967133 607002182 604820671
2846.8F04820671k328644k032242j804237j595726j655502j387100q57583p55767o20957
$$ 604820671 602492027 600459785 598655548 597059822 595404320 594017220 593159637 592403870 591782913
2855.5E91782913q06770r06029q98247o37321m50745r06257j245652j333961j249046
$$ 591782913 590976143 590070114 589171867 588534546 588083801 587177544 585931892 584597931 583348885
2864.2E83348885q82340p01980j511765k231789j892624j589965j866684j819420j406555
$$ 583348885 582466545 581764565 580252800 578021011 576128387 574538422 572671738 570852318 569445763
2872.9E69445763j604958j974907k247734k019768j256675j253434j965103k019119
$$ 569445763 567840805 565865898 563618164 561598396 560341721 559088287 557123184 555104065
2880.6E55104065j382294j327438j356049j243515j288032j053009l96195k48489r44061
$$ 555104065 553721771 552394333 551038284 549794769 548506737 547453728 547057533 546809044 545864983
2889.3E45864983m81377r4452j96457j24588p54127o50597o95915l84140K34642k29149
$$ 545864983 545383606 545289154 545092697 544968109 544213982 543563385 542867470 542483330 542717972 542488823
2898.9E42488823n04379q89511n20974j34163l84674l52363r73358j195679n82428
$$ 542488823 541984444 541094933 540573959 540439796 540055122 539702759 538729401 537533722 536951294
2907.6E36951294m51851j096916j190376p96166j434669j859856j517792j343231j179619
$$ 536951294 536499443 535402527 534212151 533415985 531981316 530121460 528603668 527260437 526080818
2916.3E26080818j839104k666893k203674j860199j704025j514244j219177m57001
$$ 526080818 524241714 521574821 519371147 517510948 515806923 514292679 513073502 512616501
2924E12616501o77567n60569P3318j92795k76298j08490n1766l8147L91159J017762
$$ 512616501 511938934 511378365 511451683 511258888 510982590 510874100 510822334 510784187 511175346 512193108
2933.6E12193108J159935J196060J553268J626625J531983J886482J905098K125511
$$ 512193108 513353043 514549103 516102371 517728996 519260979 521147461 523052559 525178070
2941.3E25178070K405853K324105K251854K065963K047844J771546K015838K268448
$$ 525178070 527583923 529908028 532159882 534225845 536273689 538045235 540061073 542329521
2949.1E42329521K033043K460556K574272K015953J771241J803970J743584J881408
$$ 542329521 544362564 546823120 549397392 551413345 553184586 554988556 556732140 558613548
2956.8E58613548J827164K236137K200699J568833K083702K048874J781349J499595
$$ 558613548 560440712 562676849 564877548 566446381 568530083 570578957 572360306 573859901
2964.5E73859901J818619K281723J411743J441918J648254J771698J729584J578751
$$ 573859901 575678520 577960243 579371986 580813904 582462158 584233856 585963440 587542191
2972.2E87542191J722374J428337J272049J058654J564255J584015J177750J376495
$$ 587542191 589264565 590692902 591964951 593023605 594587860 596171875 597349625 598726120
2979.9E98726120J567764J705170R29337P19108R56497J052780J062851Q47245Q02536
$$ 598726120 600293884 601999054 602928391 603647499 604603996 605656776 606719627 607566872 608369408
2988.6F08369408P77130J058922P56034P34330N95588N12200N24215j61094L80974
$$ 608369408 609146538 610205460 610961494 611695824 612291412 612803612 613327827 613166733 613547707
2997.3F13547707N13763M25873J53580m12598q4000j98211Q6746J34620k43682j87493
$$ 613547707 614061470 614487343 614640923 614228325 614144325 613946114 614032860 614167480 613923798 613736305
3006.9F13736305q7394j46409q9988O942n57174o97823m94156l31497n95207m91562
$$ 613736305 613648911 613502502 613412514 613419456 612862282 612164459 611670303 611338806 610743599 610252037
3016.6F10252037l70865p70149k44675o78520q51288n06134q11729q75778j045418
$$ 610252037 609881172 609111023 608866348 608187828 607336540 606830406 606018677 605142899 604097481
3025.2F04097481p71523q10661o06003o51626p38297n14450j096878q39386n95741
$$ 604097481 603325958 602515297 601909294 601257668 600519371 600004921 598908043 598068657 597472916
3033.9E97472916o47660j080169j383438j035119q91304p84721r47380o01654q05016
$$ 597472916 596825256 595745087 594361649 593326530 592435226 591650505 590703125 590101471 589296455
3042.6E89296455j057510j217804j667747j027718o17638p12623j302033j042938p91969
$$ 589296455 588238945 587021141 585353394 584325676 583708038 582995415 581693382 580650444 579858475
3051.3E79858475j329384j007996r90638o93703p27043j326752j389046j093826j106987
$$ 579858475 578529091 577521095 576530457 575836754 575109711 573782959 572393913 571300087 570193100
3060E70193100j471634q27980p97806j357040j172486k98957k93846j615334j662674
$$ 570193100 568721466 567893486 567095680 565738640 564566154 564267197 563973351 562358017 560695343
3068.6E60695343j246223r02138o29616j023178j277123j015739q88977p63550n37262
$$ 560695343 559449120 558546982 557917366 556894188 555617065 554601326 553712349 552948799 552411537
3077.3E52411537j276893j225701j219101j346245r24339j506195r90753p76940r06906
$$ 552411537 551134644 549908943 548689842 547343597 546419258 544913063 543922310 543145370 542238464
3086E42238464n89180j018600n31769n38406j594315j654892q56399r33686j422271
$$ 542238464 541649284 540630684 540098915 539560509 537966194 536311302 535454903 534521217 533098946
3094.7E33098946j498948j351928q47473o77452o58265r91974p19718p98073j537705
$$ 533098946 531599998 530248070 529400597 528723145 528064880 527072906 526353188 525555115 524017410
3103.4E24017410j216583j312561j178169j012459j039467r24148j009522o98624p09800
$$ 524017410 522800827 521488266 520310097 519297638 518258171 517334023 516324501 515625877 514916077
3112E14916077n56908r53445j417771j337509j195106o67344j146736j490631r40094
$$ 514916077 514359169 513405724 511987953 510650444 509455338 508787994 507641258 506150627 505210533
3120.7E05210533o72760j094818j212730n18876o96678j232528j027794p40853j177559
$$ 505210533 504537773 503442955 502230225 501711349 501014671 499782143 498754349 498013496 496835937
3129.4D96835937j143646q39157j168823j216049j155968o91986o07681r58481r28192
$$ 496835937 495692291 494853134 493684311 492468262 491312294 490620308 490012627 489054146 488125954
3138.1D88125954r82819j031380p89146o68335j530991j354179n36728p63588q54187
$$ 488125954 487143135 486111755 485322609 484654274 483123283 481769104 481232376 480468788 479614601
3146.8D79614601j036453j060524r66721p84416q93478j243019j018296j058311p68089
$$ 479614601 478578148 477517624 476550903 475766487 474873009 473629990 472611694 471553383 470785294
3155.4D70785294n88036j140823j167031p17621m14924n61752r72176j190262j248169
$$ 470785294 470197258 469056435 467889404 467171783 466756859 466195107 465222931 464032669 462784500
3164.1D62784500q72040m86869r43490r58099o88896q71925r22585r36584q92106p23571
$$ 462784500 461912460 461425591 460482101 459524002 458835106 457963181 457040596 456104012 455211906 454488335
3173.8D54488335k20604o78063j194458r18846j063309p28607o36177o70128q38165
$$ 454488335 454267731 453589668 452395210 451476364 450413055 449684448 449048271 448378143 447539978
3182.4D47539978r12781o92978r48257o31485o24771n06363o21491j130256q78678
$$ 447539978 446627197 445934219 444985962 444354477 443729706 443223343 442601852 441471596 440592918
3191.1D40592918p92083r17817j052703m31595m36516p57294q18824j169701o66046
$$ 440592918 439800835 438883018 437830315 437398720 436962204 436204910 435386086 434216385 433550339
3199.8D33550339o12870k82859n93415j202468o09398l83301m63333j053315o49795
$$ 433550339 432937469 432654610 432061195 430858727 430249329 429866028 429402695 428349380 427699585
3208.5D27699585m06799o47354l14446n63240o46439j278610j003609m08210n45769
$$ 427699585 427292786 426645432 426330986 425767746 425121307 423842697 422839088 422430878 421885109
3217.2D21885109l55034o82182n52674p60154j044197o77948o65665l91312k05803
$$ 421885109 421530075 420847893 420295219 419535065 418490868 417812920 417147255 416755943 416550140
3225.8D16550140o28128q98857l74756J6251n27153r20792n81779n05753o41899j138458
$$ 416550140 415922012 415023155 414648399 414664650 414137497 413216705 412634926 412129173 411487274 410348816
3235.5D10348816j110573j39923k01263m31138q51478n86548j08795l12958M06418
$$ 410348816 409238243 409098320 408897057 408465919 407614441 407027893 406919098 406606140 407012558
3244.2D07012558m61922j226616p60688o01654n50652j112633p59811l88146j17340
$$ 407012558 406550636 405324020 404563332 403961678 403411026 402298393 401538582 401150436 401033096
3252.8D01033096k72331n46493l92991p17659n18264o10123l47061m67148l20129J27563
$$ 401033096 400760765 400214272 399821281 399103622 398585358 397975235 397628174 397161026 396840897 396968460
3262.5C96968460p02095m13361l50532l38554l98293p37381l07617o38695o79855k80762
$$ 396968460 396266365 395853004 395502472 395163918 394765625 394028244 393720627 393081932 392402077 392121315
3272.1C92121315p6370m71840m92668j97258n08080k58293k45895l23449l88298n52482
$$ 392121315 392044945 391573105 391080437 390883179 390375099 390116806 389870911 389547462 389159164 388606682
3281.8C88606682o81076j63956K49329n11475o47774q70704p26586N493J49155k57149
$$ 388606682 387925606 387761650 388010979 387499504 386851730 385981026 385254440 385259933 385409088 385151939
3291.4C85151939o04934k15912l39546l90473n73349l30887N6839j34773m1580j034279
$$ 385151939 384547005 384331093 383991547 383601074 383027725 382696838 382753677 382618904 382577324 381543045
3301C81543045p92313J2207n22651n00832l853K17972m90723q58154n67131k58522
$$ 381543045 380750732 380762939 380240288 379739456 379735603 379953575 379462852 378604698 378037567 377779045
3310.7C77779045n72J61400n39971j295356m44374j88561j3618l32566j154861l16849
$$ 377779045 377778473 377939873 377399902 376104546 375660172 375471611 375457993 375125427 373970566 373653717
3320.3C73653717J67275j86615n31846o42204o64673k46963l10707p88117m48494p09953
$$ 373653717 373820992 373634377 373102531 372460327 371795654 371548691 371237984 370449867 370001373 369291420
3330C69291420n33180j78871j85700m54254n55992J36375n57289r83314k90108J25503
$$ 369291420 368758240 368579369 368393669 367939415 367383423 367519798 366962509 365979195 365689087 365814590
3339.6C65814590m22210j059990l54576j26343k35939n36957n59654k13890o31027
$$ 365814590 365392380 364332390 363977814 363851471 363615532 363078575 362518921 362305031 361674004
3348.3C61674004o91147m75807m02146l47671m01001o99196o75507o19468o19584J526
$$ 361674004 360982857 360507050 360104904 359757233 359356232 358657036 357981529 357362061 356742477 356744003
3357.9C56744003J4038m42619p12280n32952k97088j94931j97182l57399m59442j198921
$$ 356744003 356758041 356315422 355603142 355070190 354773102 354578171 354380989 354023590 353564148 352365227
3367.6C52365227p72782j99966l65753O8626k04582l73344o42243p89261n36995m49867
$$ 352365227 351592445 351392479 351026726 351095352 350890770 350517426 349875183 349085922 348548927 348099060
3377.2C48099060K01836j16577o48690k44598l36456p15676n45959k95677j15853J9913
$$ 348099060 348300896 348184319 347535629 347291031 346954575 346238899 345692940 345397263 345281410 345301323
3386.9C45301323j95770k91138m45557n15556j17989o027n18417n54619j48582R1514
$$ 345301323 345105553 344814415 344368858 343853302 343735313 343729286 343210869 342656250 342507668 342599182
3396.5C42599182M7188l61404J11808M43039l64456j126518n42641M15955j68419k84348
$$ 342599182 342646370 342284966 342396774 342839813 342475357 341348839 340806198 341222153 341053734 340769386
3406.2C40769386j58157l04298l17040j01051M90188P668j35460k59361O1149K09084
$$ 340769386 340611229 340306931 339989891 339888840 340379028 340386696 340251236 339991875 340053024 340262108
3415.8C40262108p00760j70021O0425K23922K48833O4964K83089j30386O218j01700
$$ 340262108 339561348 339391327 339451752 339675674 339924507 339989471 340272560 340142174 340148392 340046692
3425.5C40046692k7390M2878J49917J96152m33350k51960K6359N28870Q65135K12326
$$ 340046692 340019302 340062180 340212097 340408249 339974899 339722939 339749298 340278168 341143303 341355629
3435.1C41355629q07152o93741J74599L73802M47502L66516N02243J07651M30107L86620
$$ 341355629 340548477 339854736 340029335 340403137 340850639 341217155 341719398 341827049 342257156 342643776
3444.7C42643776J32217J158524m94728o97975M43306M38728O13327M39339J017303
$$ 342643776 342775993 343934517 343439789 342741814 343185120 343623848 344237175 344676514 345693817
3453.4C45693817N04456j42327q4800L60908O16684K47383N55001J69448M26903M15611
$$ 345693817 346198273 346055946 345971146 346332054 346948738 347196121 347751122 347920570 348347473 348763084
3463.1C48763084K21291R68742J033364M99115j05934N28411N12543K99645L53889
$$ 348763084 348984375 349953117 350986481 351485596 351379662 351908073 352420616 352720261 353074150
3471.7C53074150K96593O57997M16298N83496L76282M79545O73256Q93021J302147
$$ 353074150 353370743 354028740 354445038 355028534 355404816 355884361 356557617 357450638 358752785
3480.4C58752785O04820j92604o40450P25289R39293N39131Q61320k20680j29242P76596
$$ 358752785 359357605 359165001 358524551 359249840 360189133 360728264 361589584 361368904 361239662 362016258
3490.1C62016258J243477O70242N20287P12280L67127O46209N6229K01531N21354P47833
$$ 362016258 363259735 363929977 364450264 365162544 365529671 366175880 366232109 366433640 366954994 367702827
3499.7C67702827J311379J490707O85654n80101Q19283J417579Q68836L08036J150856
$$ 367702827 369014206 370504913 371190567 370610466 371429749 372847328 373716164 374024200 375175056
3508.4C75175056R42841j135254O84853J045227Q98132Q80356L51028J076203O55555
$$ 375175056 376117897 374982643 375667496 376712723 377610855 378491211 378842239 379918442 380573997
3517.1C80573997R06563M32968r6473J049194J789665R96018l70636J96075N99404
$$ 380573997 381480560 381913528 381817055 382866249 384655914 385651932 385281296 385477371 386076775
3525.7C86076775J192970Q64754N53245O22406Q98056J403771Q04329P76100J45454
$$ 386076775 387269745 388134499 388687744 389310150 390208206 391611977 392416306 393192406 393337860
3534.4C93337860J362991J221505k17476J204262Q29849J089782O50330O32439J035843
$$ 393337860 394700851 395922356 395704880 396909142 397738991 398828773 399479103 400111542 401147385
3543.1D01147385J147422J269112P6065J443176n9585R47342J667328J101837K208328
$$ 401147385 402294807 403563919 403639984 405083160 405023575 405970917 407638245 408740082 410948410
3551.8D10948410m26140J129761Q53844O79435J734887L87420K108612J274796J032257
$$ 410948410 410522270 411652031 412505875 413185310 414920197 415307617 417416229 418691025 419723282
3560.5D19723282J025772J594696J531105K80228L926658M78669r97963Q08944r0103
$$ 419723282 420749054 422343750 423874855 424155083 428081741 428560410 427562447 428371391 428281288
3569.1D28281288L259506J132279J466560K182541J337853J195220J357461K148895
$$ 428281288 431540794 432673073 434139633 436322174 437660027 438855247 440212708 442361603
3576.9D42361603Q81538K578583K292175N49774J248093J556778K222786J581612L514251
$$ 442361603 443243141 445821724 448113899 448663673 449911766 451468544 453691330 455272942 458787193
3585.5D58787193K260590j78948K157174r70154J799965K757148K771950P97730P75566
$$ 458787193 461047783 460868835 463026009 462055855 463855820 466612968 469384918 470182648 470958214
3594.2D70958214M494972p36046J932183M015884Q16841L143806J032029L1814J409378
$$ 470958214 475453186 474717140 476649323 480665207 481482048 484625854 485657883 485689697 487099075
3602.9D87099075J928864K999039L725814K864647r76295L451042m04434o68068P431030
$$ 487099075 489027939 492026978 495752792 498617439 497641144 501092186 500687752 500019684 507450714
3611.6E07450714J219597j127701M299278r26933L388977M595757M63028J994133q7929
$$ 507450714 508670311 507542610 511841888 510914955 514303932 518899689 519362717 521356850 521268921
3620.3E21268921N86204K999649K091370J365090K667465L166809K857895O719055
$$ 521268921 521855125 524854774 526946144 528311234 530978699 534145508 537003403 543722458
3628E43722458J037407j2141686L580590M996719N423851J967735j881599J974296
$$ 543722458 544759865 532618179 536198769 541195488 546619339 548587074 546705475 548679771
3635.7E48679771L232460K265091R01871J937218K324371K308350Q19626K29339K841645
$$ 548679771 551912231 554177322 555079193 557016411 559340782 561649132 562468758 562698097 565539742
3644.4E65539742M212188O443405j543388l923454O658287j258469l645401m34151
$$ 565539742 569751930 576195335 574651947 570728493 577386780 576128311 572482910 572048759
3652.1E72048759N457116M739112M136658M743157q792382J225548N626373J752091
$$ 572048759 577505875 582244987 586381645 591124802 582332420 583557968 589184341 590936432
3659.8E90936432J294937J93748J769867J281243J784668J871376J100006M839859
$$ 590936432 592231369 592425117 594194984 595476227 597260895 599132271 600232277 605072136
3667.5F05072136L049927p93648m85268p052421J939659Q296509R668808O20346j9065361
$$ 605072136 608122063 607328415 606843147 599790726 601730385 610026894 619695702 620316048 601250687
3676.2F01250687K970161P792816M430237j921806M48494L505211J834945J132202
$$ 601250687 604220848 612013664 616443901 614522095 614970589 618475800 620310745 621442947
3683.9F21442947N74532L90243M774323O943474r910927k761345R771080o509972j271820
$$ 621442947 622017479 622407722 627182045 634125519 624214592 621453247 631224327 624714355 623442535
3692.6F23442535O084938J623726K254181O08330m89044J034164k08931K027550L262138
$$ 623442535 629527473 631151199 633405380 634013710 633524666 634558830 634349899 636377449 639639587
3701.3F39639587l851699j956673M399261J555214O3744R8076K736358M820404p257232
$$ 639639587 635787888 633831215 638230476 639785690 639849434 639947510 642683868 647504272 640247040
3709.9F40247040M768753P098617j4474334K817459L737335M35486J145248K854462
$$ 640247040 645015793 652114410 637640076 640457535 644194870 644630356 645775604 648630066
3717.7F48630066J780548l999481J170425O416626k976379m637146O028366K044754
$$ 648630066 650410614 646411133 647581558 653998184 651021805 646384659 652413025 654457779
3725.4F54457779k182083l352432M21066L435898R44519N985183k645950p344894R826355
$$ 654457779 652275696 648923264 649344330 652780228 653724747 659709930 657063980 649719086 659545441
3734F59545441R19799j0253448O78864L437652N95474K437973L806610m162216K798462
$$ 659545441 660465240 650211792 650890656 654328308 654923782 657361755 661168365 657006149 659804611
3742.7F59804611J2099457j1141663j6568985J0244446O698075P187271l233948j0557175
$$ 659804611 671904068 660762405 644193420 654437866 661135941 668323212 665089264 654532089
3750.4F54532089J1324463n577392o831818O443787N522155L392411o399079K848664
$$ 654532089 665856552 660279160 653447342 659891129 665413284 668805695 662406616 665255280
3758.2F65255280P357406p881012l143310L805847J607590N96466L911819l180313
$$ 665255280 672612686 664731674 661588364 665394211 667001801 667598267 671510086 668329773
3765.9F68329773n484314M334412O220016J574326q879395O87790K857285N75637R27964
$$ 668329773 662845459 667179871 673399887 674974213 666094818 666782608 669639893 670215530 671143494
3774.5F71143494p79953J064148J073303L772201J134415r448013J833572L059845
$$ 671143494 670363541 671427689 672500992 676273193 677407608 667959595 669793167 672853012
3782.3F72853012J576691K467346m013977j827774J902847J372605Q52355K6322J20010
$$ 672853012 674429703 676897049 672883072 671055298 672958145 674330750 675183105 675209427 675329437
3790.9F75329437j97830P09381J37177J987381M606628l508377n100555J847152N111313
$$ 675329437 675131607 675840988 675978165 677965546 682572174 679063797 673963242 675810394 680921707
3799.6F80921707P405167n488510j1925965J816407L103561N729141O040573r996948
$$ 680921707 688326874 682838364 670912399 672728806 675832367 681561508 687602081 677605133
3807.3F77605133n089340N485840K553024l72314K03552N76172J786651N886307o54907
$$ 677605133 672515793 678001633 680554657 680182343 680385895 680962067 682748718 688635025 687980118
3816F87980118j3785172L971787N593872N376816L160782j7475663P09305N123291
$$ 687980118 674194946 678166733 683760605 689137421 692298203 674822540 675531845 680655136
3823.7F80655136K066803K731476L738m141769M13971K062683L934021K140579r275284
$$ 680655136 682721939 685453415 685457153 681315384 681729355 683792038 687726059 689866638 680591354
3832.4F80591354K704697Q106308n511475n55648Q734512r267120l875809R014358
$$ 680591354 683296051 691402359 685890884 685335236 694069748 684802628 680926819 689941177
3840.1F89941177o773376r42917P048340k314911m530029K382507K101975M18930K173690
$$ 689941177 683167801 682224884 689273224 686958313 682428284 684810791 686912766 687331696 689505386
3848.8F89505386p08084K128601P188721n177078j01624j6373138J159286J0596161
$$ 689505386 688797302 690925903 698114624 692937546 692835922 676462784 677622070 688218231
3856.5F88218231j300735j739884K757874L034439K643967o758042k08206Q405533
$$ 688218231 686917496 685177612 687935486 690969925 693613892 686855850 686647644 695053177
3864.2F95053177n148163o456146M236679O300888P440643q432922j0412827L436966
$$ 695053177 689905014 683448868 687685547 693986435 701427078 692994156 682581329 686018295
3871.9F86018295O339798M088211r839477N18036L762893K49482K461395N306854n073395
$$ 686018295 692358093 696446304 686606827 687124863 690887756 691137238 693598633 698905487 693832092
3880.6F93832092q957901O558228J990127J725388N070038j3713989P64236M369125
$$ 693832092 684874191 691432419 693422546 695147934 700217972 686503983 687268219 691637344
3888.3F91637344J565552M417572n48935q068619J148301L588867j779099J133805
$$ 691637344 693202896 697620468 697071533 689002914 690151215 693740082 691960983 693094788
3896.1F93094788J735687K741470J840134j0344849N532990K881012n965271M682922
$$ 693094788 694830475 697571945 699412079 689067230 694600220 697481232 691515961 696198883
3903.8F96198883l263702j559372O11114r1629J782227J45187P92771p1564m42581
$$ 696198883 692935181 691375809 691986923 691895294 693677521 693822708 694615479 694543915 694101334
3912.5F94101334L19976J20469J771850K694168l165054m112473M361344R02786m395065
$$ 694101334 694421310 694541779 696313629 699007797 695842743 691730270 696091614 696994400 692599335
3921.1F92599335J552276J688004J832352j405640m548874J583328K528229J591721
$$ 692599335 694151611 695839615 697671967 696266327 691717453 693300781 695829010 697420731
3928.8F97420731p12433p59964K273941k708206k482148J275025M98810O19506K89307
$$ 697420731 696708298 695948334 698222275 695514069 693031921 694306946 694805756 695425262 695714569
3937.5F95714569K84577M43038j77688J702957J734390l961410j267777J087189M85382
$$ 695714569 695999146 696442184 696264496 697967453 699701843 695740433 694472656 695559845 696045227
3946.2F96045227J853027j550674N19943K95563l240509K361450K019272m21219p23953
$$ 696045227 697898254 696347580 696867523 697163086 693922577 696284027 698303299 697882080 697158127
3954.9F97158127l81165P90329o103Q11691m44946l47367K04316j372071q6822J38855
$$ 697158127 696776962 697567291 697561188 698372879 697927933 697580566 697784882 696412811 696325989 696464844
3964.5F96464844L22723Q16422Q43506L20968p45697m79355K44293L09754m50287k32849
$$ 696464844 696787567 697603989 698447495 698768463 698022766 697543411 697787704 698097458 697647171 697414322
3974.2F97414322K92969j08033n37490O72531J044235m33350j7242K28882J5335J78604
$$ 697414322 697707291 697599258 697061768 697734299 698778534 698345184 698327942 698556824 698572159 698750763
3983.8F98750763J34277j53045m32892J96152L12728M54636m88358m66156O45524m3717
$$ 698750763 698885040 698731995 698299103 698495255 698807983 699262619 698774261 698308105 698953629 698909912
3993.5F98909912j47705j126404p77359J211472J209945J95923p18002
$$ 698909912 698762207 697635803 696858444 698069916 699279861 699475784 698757782
4000.2F98757782
$$ 698757782
##END=$$ End of the data block
