##TITLE=$$ Begin of the data block
##JCAMP-DX=5.00 $$ ACD/SpecManager v 10.08
##SPECTROMETER/DATA SYSTEM=Varian
##DATE=20 Nov 2012 14:08:16
##DATA TYPE=INFRARED SPECTRUM
##DATA CLASS=XYDATA
##ORIGIN=
##OWNER=
##NPOINTS=3735
##FIRSTX=399.26403809
##LASTX=4000.35498047
##MAXX=4000.35498047
##MINX=399.26403809
##MAXY=77.53472900
##MINY=30.06160545
##XFACTOR=1.0000000000
##YFACTOR=0.000000100000000
##FIRSTY=54.80473709
##DELTAX=0.96440572
##XUNITS=1/CM
##YUNITS=TRANSMITTANCE
##XYDATA=(X++(Y..Y))
$$ plain form
399.3 548047371 569741745 560187721 531394844 534529076 549081764 551985016 549865036 551623917
407 551623917 551767387 546768074 545709724 541515503 541271706 542583504 538652534 542805061 549860764
415.7 549860764 554343185 553134041 528803406 523978348 548955536 552531357 547828560 544516296
423.4 544516296 541682816 541558609 543581123 543749046 543328896 539298210 536278419 538363075 539778214
432.1 539778214 539045563 537238998 533779259 531830444 530536118 531298065 535684700 539150772 536035385
440.7 536035385 527005157 530118828 541688461 547359428 549563370 546418037 542187538 544379349
448.4 544379349 547175179 547943649 551708832 555228195 552116280 549172249 550269051 551524887 550966797
457.1 550966797 550343399 546613312 548026543 552034492 549687958 549116898 546280823 541662102 538224106
$$ packed form
399.3E48047371K1694374r554024k8792877L134232J4552688K903252k119980J758881
407E51623917J43470m999313j058350m194221k43797J311798l930970M152527P055703
415.7E49860764M482421j209144k4330635m825058K4977188L575821m702797l312264
423.4E44516296k833480j24207K022514J67923m20150m030686l019791K084656J415139
432.1E39778214p32651j806565l459739j948815j294326P61947M386635L466072l115387
440.7E36035385r030228L113671J1569633N670967K203942l145333m230499K191811
448.4E44379349K795830P68470L765183L519363l111915k944031J096802J255836n58090
457.1E50966797o23398l730087J413231M007949k346534n71060k836075m618721l437996
$$ plain form
465.8 538224106 534316635 535911331 535875359 530919075 529370842 535015831 539100685 535379181 529981308
474.5 529981308 524741135 527461624 528925896 531827164 531867638 522954407 520375748 523976784 528303947
483.2 528303947 525625916 521998940 524021912 526601410 526093559 523734093 524097290 520428505 520170593
491.8 520170593 524106827 523828201 524148445 522292900 519735641 519938774 523362846 521690102 516840858
500.5 516840858 515397339 515184517 517358742 517377357 516694984 513999557 513509598 513419533 507207527
509.2 507207527 503905792 502437630 501024780 498461761 496873779 498705025 498887787 499139900 499537354
517.9 499537354 497841949 491111450 488940506 490003777 487519913 485548134 483675537 483748741 483459740
526.6 483459740 484936142 486857224 486149063 486113853 486850204 488726616 487196541 484389114 484824638
$$ packed form
465.8E38224106l907471J594696l5972m956284j548233N644989M084854l721504n397873
474.5E29981308n240173K720489J464272K901268M0474q913231k578659L601036M327163
483.2E28303947k678031l626976K022972K579498n07851k359466L63197l668785k57912
491.8E20170593L936234k78626L20244j855545k557259K03133L424072j672744m849244
500.5E16840858j443519k12822K174225J8615o82373k695427m89959r0065o212006
509.2E07207527l301735j468162j412850k563019j587982J831246J82762K52113L97454
517.9D99537354j695405o730499k170944J063271k483864j971779j872597P3204k89001
526.6D83459740J476402J921082p08161l5210P36351J876412j530075k807427M35524
$$ plain form
535.2 484824638 486792221 489099998 492355728 497000771 499455719 500243225 501730919 505217514 507805977
543.9 507805977 508417244 509459839 508251801 506497345 505984535 505939980 506798859 506891174 505794945
552.6 505794945 505674400 506524162 505100250 502201195 499194832 497459564 496569290 495809669 494935951
561.3 494935951 491614685 489114456 487303963 487034035 486496315 482972145 480317345 477253342 475565147
570 475565147 472288284 468861389 468364754 467470093 467918282 468058777 469230881 469917564 470357513 472353516
579.6 472353516 474081535 476417313 479234352 481680374 483998413 487725677 490470505 492722206
587.3 492722206 495306358 496802711 497417221 498590012 500948639 501331673 500891762 500476303 500870667
596 500870667 501230736 501239815 502624779 503013039 503506050 503243256 502068596 500545959 498007011 497968330
$$ packed form
535.2D84824638J967583K307777L255730M645043K454948P87506J487694L486595K588463
543.9E07805977O11267J042595j208038j754456n12810m4555Q58879R2315j096229
552.6E05794945j20545Q49762j423912k899055l006363j735268q90274p59621q73718
561.3D94935951l321266k500229j810493k69928n37720l524170k654800l064003j688195
570D75565147l276863l426895m96635q94661M48189J40495J172104O86683M39949J996003
579.6D72353516J728019K335778K817039K446022K318039L727264K744828K251701
587.3D92722206K584152J496353O14510J172791K358627L83034m39911m15459L94364
596E00870667L60069R079J384964L88260M93011k62794j174660j522637k538948l8681
$$ plain form
605.6 497968330 499741020 501878777 502618408 502652893 503256149 503492775 503856888 503374252 503089600 503602180
615.3 503602180 505063095 506034546 507486229 510070763 511620255 513804741 514956474 515766182 516724281
624 516724281 517044563 518365860 519569550 520912971 522525215 524856491 527119179 528146210 529255638
632.7 529255638 530633316 530632248 530209007 531227951 530844078 530380363 531920662 533303986 533765526
641.3 533765526 534637756 536505394 536393166 535800400 536876717 538096504 538964844 539363022 540314178
650 540314178 541620789 542440758 542768364 543740120 544989853 545744019 546146049 545297089 544327240 544370842
659.7 544370842 544284630 543968468 544959183 546114883 546028328 547270279 550658340 554391556 550935898
668.3 550935898 549901428 550543785 549894180 549810257 550379066 551858635 552689514 554046707 556108475
$$ packed form
605.6D97968330J772690K137757P39631L4485O03256K36626L64113m82636k84652N12580
615.3E03602180J460915R71451J451683K584534J549492K184486J151733Q09708R58099
624E16724281L20282J321297J203690J343421J612244K331276K262688J027031J109428
632.7E29255638J377678j068m23241J018944l83873m63715J540299J383324M61540
641.3E33765526Q72230J867638j12228n92766J076317J219787Q68340L98178R51156
650E40314178J306611Q19969L27606R71756J249733P54166M02030q48960r69849M3602
659.7E44370842q6212l16162R90715J155700q6555J241951L388061L733216l455658
668.3E50935898j034470O42357o49605q3923N68809J479569Q30879J357193K061768
$$ plain form
677 556108475 557725601 559024849 558726730 559039268 559782982 559377632 558733864 558978310 559934464 560702858
686.7 560702858 561588364 561903534 563078232 564793015 564734268 563066063 561376305 560552483 559506302
695.3 559506302 559100647 558645439 557426796 557277718 557434502 556840286 555586472 554547462 553267555
704 553267555 550581512 548222160 547627029 547395859 548003578 549817696 551135178 552971115 553796883
712.7 553796883 553664970 555300064 557568245 559239044 560092545 560868797 561898766 564940758 568414268
721.4 568414268 570501289 572982216 575166397 578299561 581075249 582429771 584057579 585237045
729.1 585237045 586032791 587827148 590475655 591968079 593345871 595347595 597568626 599696198 600662193
737.8 600662193 601309319 601335526 600804176 601009293 601719704 601466370 600771294 601757126 602613487 601156120
$$ packed form
677E56108475J617126J299248k98119L12538P43714m05350o43768K44446R56154P68394
686.7E60702858Q85506L15170J174698J714783n8747j668205j689758q23822j046181
695.3E59506302m05655m55208j218643j49078J56784n94216j253814j039010j279907
704E53267555k686043k359352n95131k31170O07719J814118J317482J835937Q25768
712.7E53796883j31913J635094K268181J670799Q53501P76252J029969L041992L473510
721.4E68414268K087021K480927K184181L133164K775688J354522J627808J179466
729.1E85237045P95746J794357K648507J492424J377792K001724K221031K127572R65995
737.8F00662193O47126K6207n31350K05117P10411k53334o95076R85832Q56361j457367
$$ plain form
747.4 601156120 599457817 598534088 596737061 594644623 592659111 590744705 589267502 587323380 584952011
756.1 584952011 582659378 582243309 582157173 579816360 578338699 576562271 573093529 570980949 571065102
764.8 571065102 572100334 572384491 573375893 575756798 578157082 579678307 580961037 583411789 586087799
773.5 586087799 587881737 589220047 591495781 595092506 599415016 603121185 606020432 609418983
781.2 609418983 613105965 615609703 617634163 620485649 621948280 622434692 623524742 624935379 626339684
789.9 626339684 628429451 632526512 635565147 636663284 637839508 638813324 639678688 640443039 641669998
798.5 641669998 643142319 643673172 645390625 648339996 649980240 651073990 651834488 653423920 655170059
807.2 655170059 654902573 654196091 653160858 652327271 652113571 652656708 652885132 653457260 655381775
$$ packed form
747.4F01156120j698303r23729j797027k092438j985512j914406j477203j944122k371369
756.1E84952011k292633m16069q6136k340813j477661j776428l468742k112580Q4153
764.8E71065102J035232K84157R91402K380905K400284J521225J282730K450752K676010
773.5E86087799J793938J338310K275734L596725M322510L706169K899247L398551
781.2F09418983L686982K503738K024460K851486J462631M86412J090050J410637J404305
789.9F26339684K089767M097061L038635J098137J176224R73816Q65364P64351J226959
798.5F41669998J472321N30853J717453K949371J640244J093750P60498J589432J746139
807.2F55170059k67486p06482j035233q33587k13700N43137K28424N72128J924515
$$ plain form
815.9 655381775 655523071 655413361 655676727 655264664 654104843 653012314 652867889 651866989 651690826
824.6 651690826 652203903 652892990 653584061 653227921 652022018 649854050 648371735 646297913 643585510
833.3 643585510 640756073 638488121 637431297 636660728 637010765 635751228 633562546 631668091 629506493
841.9 629506493 628706551 626842613 624175262 622158203 620667038 620179787 620047913 619853249 618503265
850.6 618503265 616008453 613659935 611720810 609386292 606427383 603129578 600349045 598316078
858.3 598316078 596649895 596244507 596499748 597071915 598547211 600903397 604536896 607743187 610305328
867 610305328 613348923 617317772 621936646 626923714 632226219 636404114 640178375 644039078 646972351
875.7 646972351 647301102 647553329 648933640 648739090 648680115 648939209 648467102 647038574 645625687
$$ packed form
815.9F55381775J41296j09710K63366m12063j159821j092529j44425j000900j76163
824.6F51690826N13077O89087O91071l56140j205903k167968j482315k073822k712403
833.3F43585510k829437k267952j056824p70569L50037j259537k188682j894455k161598
841.9F29506493p99942j863938k667351k017059j491165m87251j31874j94664j349984
850.6F18503265k494812k348518j939125k334518k958909l297805k780533k032967
858.3E98316078j666183m05388K55241N72167J475296K356186L633499L206291K562141
867F10305328L043595L968849M618874M987068N302505M177895L774261L860703K933273
875.7F46972351L28751K52227J380311j94550n8975K59094m72107j428528j412887
$$ plain form
884.4 645625687 644593277 642398682 640346756 639080582 636483383 632497749 629160271 626281281
892.1 626281281 623884659 622211647 620681839 620117683 619834785 618059998 615563545 613664169 611088638
900.8 611088638 607548447 604932709 603593941 602245789 600302887 598130646 595825081 593453217
908.5 593453217 590048447 585912399 582531662 578820610 574102707 569703026 566121254 562455215
916.2 562455215 558501434 554714012 551660576 549013367 546259117 544271431 542994766 541084480
923.9 541084480 539362564 538350182 537787437 537915077 537702904 537767715 538295212 539553642 540494881
932.6 540494881 540245285 540881577 541456566 542583351 544351807 545368080 546392784 547734299 549760284
941.3 549760284 551954956 554332237 556209488 556753387 556227608 554632645 552289505 549180946 545079536
$$ packed form
884.4F45625687j032410k194595k051926j266174k597199l985634l337478k878990
892.1F26281281k396622j673012j529808n64156k82898j774787k496453j899376k575531
900.8F11088638l540191k615738j338768j348152j942902k172241k305565k371864
908.5E93453217l404770m136048l380737l711052m717903m399681l581772l666039
916.2E62455215l953781l787422l053436k647209k754250j987686j276665j910286
923.9E41084480j721916j012382n62745J27640k12173O4811N27497J258430R41239
932.6E40494881k49596O36292N74989J126785J768456J016273J024704J341515K025985
941.3E49760284K194672K377281J877251N43899n25779j594963k343140l108559m101410
$$ plain form
949.9 545079536 540625877 537198448 533260002 527540703 521863251 516494904 511375427 505120163
957.7 505120163 498512077 492156105 484742661 477392960 470283737 464359894 458290443 452163734
965.4 452163734 445727310 438116074 430727806 422469521 414719238 406628990 398594017 391360626
973.1 391360626 384171829 376551323 368453712 361382523 353117371 346290474 340313683 334824982
980.8 334824982 329965172 324366798 320418930 316180515 313601971 310490665 307781620 306463585
988.5 306463585 304873829 304383316 302799435 302651653 301442642 301223450 302001343 301878700 303134651
997.2 303134651 302701607 302822399 303114166 304793739 305563507 304966660 305201302 304416275 305176697 304984913
1006.8 304984913 304729214 303999825 303754826 303555927 302250843 302954769 302226772 302194443 301272507 300616055
$$ packed form
949.9E45079536m453659l427429l938446n719299n677452n368347n119477o255264
957.7E05120163o608086o355972p413444p349701p109223n923843o069451o126709
965.4D52163734o436424p611236p388268q258285p750283q090248q034973p233391
973.1C91360626p188797p620506q097611p071189q265152o826897n976791n488701
980.8C34824982m859810n598374l947868m238415k578544l111306k709045j318035
988.5C06463585j589756m90513j583881j47782j209011k19192P77893j22643J255951
997.2C03134651m33044J20792K91767J679573P69768n96847K34642p85027P60422j91784
1006.8C04984913k55699p29389k44999j98899j305084P03926p27997l2329r21936o56452
$$ plain form
1016.5 300616055 301344376 301568127 302400036 301870728 302598267 302564716 304063454 306072102 307142105
1025.2 307142105 309494076 310369511 311877232 312354279 313351326 314724312 316609612 318203621 318666210
1033.8 318666210 320965347 321788559 323047485 323232460 323813210 324488335 324013023 324527588 323475151
1042.5 323475151 324035683 323736649 324633064 325483322 325137291 326312752 326387749 327503014 327497177 330212975
1052.2 330212975 332227020 333118439 335817451 336741104 340244026 343705482 347338676 349567070 352462616
1060.9 352462616 356631126 359723892 364246979 367369347 371942368 374447556 376096992 378020096
1068.6 378020096 377058067 375266151 371745148 368448906 363032074 358384132 354206390 350894661
1076.3 350894661 349664345 346777153 346327477 345750427 347069817 348103333 349167557 351513100 352526054
$$ packed form
1016.5C00616055P28321K23751Q31909n29308P27539l3551J498738K008648J070003
1025.2C07142105K351971Q75435J507721M77047R97047J372986J885300J594009M62589
1033.8C18666210K299137Q23212J258926J84975N80750O75125m75312N14565j052437
1042.5C23475151N60532k99034Q96415Q50258l46031J175461P4997J115265n837K715798
1052.2C30212975K014045Q91419K699012R23653L502922L461456L633194K228394K895546
1060.9C52462616M168510L092766M523087L122368M573021K505188J649436J923104
1068.6C78020096r62029j791916l521003l296242n416832m647942m177742l311729
1076.3C50894661j230316k887192m49676n77050J319390J033516J064224K345543J012954
$$ plain form
1085 352526054 355387993 356358261 358301430 359972878 362575569 365910721 367570534 371371803 374162292
1093.6 374162292 377390594 379000931 380241165 381839485 383107147 384686966 384507370 385548363
1101.4 385548363 385281219 385373421 385105019 385386391 386997948 387092247 388904762 389612846 391525269
1110 391525269 393522339 395376854 397885361 399095268 401337814 403277283 406703377 408434525 409355164
1118.7 409355164 411077728 412285385 413850822 413578033 414426727 415598946 417203598 418831978 420859795
1127.4 420859795 423724747 424856682 426687164 428175926 429921150 431604691 433385201 434022484
1135.1 434022484 433175125 434155960 434316826 433953018 432221451 430254059 428047447 424780426 420905647
1143.8 420905647 415107727 412512703 410595627 407779922 404377785 401549759 400784798 398757477
$$ packed form
1085C52526054K861939R70268J943169J671448K602691L335152J659813L801269K790489
1093.6C74162292L228302J610337J240234J598320J267662J579819j79596J040993
1101.4C85548363k67144R2202k68402K81372J611557R4299J812515P08084J912423
1110C91525269J997070J854515K508507J209907K242546J939469L426094J731148R20639
1118.7D09355164J722564J207657J565437k72789Q48694J172219J604652J628380K027817
1127.4D20859795K864952J131935J830482J488762J745224J683541J780510O37283
1135.1D34022484q47359R80835J60866l63808j731567j967392k206612l267021l874779
1143.8D20905647n797920k595024j917076k815705l402137k828026p64961k027321
$$ plain form
1151.5 398757477 397929535 396426430 395399628 394322319 393597755 394233246 393479881 394294968 394643669
1160.2 394643669 395741005 396874237 398614616 401578598 404420853 408606300 411062698 414401207
1167.9 414401207 418246384 422788582 427779541 432150040 437326241 442379150 448801727 454177742
1175.6 454177742 460040016 466378288 472112312 478332977 483200989 487897072 492160950 496647263
1183.3 496647263 501392670 506291542 511285133 515451050 519724007 522912903 525049744 527114105
1191 527114105 529201012 531263008 532806129 533711815 534572792 535931931 536832809 537142296 537544212
1199.7 537544212 538418732 539158173 539271164 539120674 538960114 539454041 540263557 541386185 542422523
1208.4 542422523 543789139 545889320 547691803 549661865 551004715 552158127 553799057 554824829
$$ packed form
1151.5C98757477q27942j503105j026802j077309p24564O35491p53365Q15087L48701
1160.2C94643669J097336J133232J740379K963982K842255M185447K456398L338509
1167.9D14401207L845177M542198M990959M370499N176201N052909O422577N376015
1175.6D54177742N862274O338272N734024O220665M868012M696083M263878M486313
1183.3D96647263M745407M898872M993591M165917M272957L188896K136841K064361
1191E27114105K086907K061996J543121R05686Q60977J359139R00878L09487M01916
1199.7E37544212Q74520P39441J12991j50490j60560M93927Q09516J122628J036338
1208.4E42422523J366616K100181J802483J970062J342850J153412J640930J025772
$$ plain form
1216.1 554824829 555592155 557067337 558806839 559716110 560552521 561905708 562807198 562741508 562420921
1224.8 562420921 561631775 560241547 559272537 558696747 558170319 557387962 556895218 556857758 556548538 556431770
1234.4 556431770 555901184 554962540 554003906 552896805 552143860 551513863 550901718 550525589 550928802
1243.1 550928802 551486015 551986351 552690926 553294411 553925323 553953438 553830223 554008942 554655800 555323448
1252.8 555323448 555591202 556277428 557407875 558871880 559903374 560656433 561217690 561482010 561794167
1261.4 561794167 561537094 561191902 561261711 561669312 562387848 563774757 565509453 566771927 567835464
1270.1 567835464 568843079 570070953 570836487 571056137 571122513 570960693 571099319 571699104 572384872
1278.8 572384872 572735062 573226166 573668442 573356476 572883110 572522354 572179718 571896858 571593590 571276894
$$ packed form
1216.1E54824829P67326J475182J739502R09271Q36411J353187R01490o5690l20587
1224.8E62420921p89146j390228r69010n75790n26428p82357m92744l7460l09220j16768
1234.4E56431770n30586r38644r58634j107101p52945o29997o12145l76129M03213
1243.1E50928802N57213N00336P04575O03485O30912K8115j23215J78719O46858O67648
1252.8E55323448K67754O86226J130447J464005J031494P53059N61257K64320L12157
1261.4E61794167k57073l45192O9809M07601P18536J386909J734696J262474J063537
1270.1E67835464J007615J227874P65534K19650O6376j61820J38626N99785O85768
1278.8E72384872L50190M91104M42276l11966m73366l60756l42636k82860l03268l16696
$$ plain form
1288.4 571276894 571164360 571454468 571632576 571728706 571729584 571077690 570261116 569334602 568040237 566848831
1298.1 566848831 566123695 565675087 565148010 564733124 564060555 563210564 562698822 561651421 559950943
1306.8 559950943 559307671 559319153 558248444 557084045 556242371 555610008 555488205 555435982 555388107 554856262
1316.4 554856262 554030762 553404045 552439880 551309853 550279236 549249153 548376045 547656174 546894150
1325.1 546894150 545857735 544372063 542691879 540888596 538769989 536377907 534102707 531975746
1332.8 531975746 530106468 529265671 528397980 527286301 526357346 526179733 526743011 526376915 525859222
1341.5 525859222 525845299 525934334 525467720 525445671 525412178 525080872 525428581 525889778 526554909 526727638
1351.1 526727638 526922569 526752892 526280174 525986137 524846420 524074364 523432388 523041382 522911148
$$ packed form
1288.4E71276894j12534K90108J78108R6130Q78o51894q16574r26514j294365j191406
1298.1E66848831p25136m48608n27077m14886o72569q49991n11742j047401j700478
1306.8E59950943o43272J1482j070709j164399q41674o32363j21803n2223m7875n31845
1316.4E54856262q25500o26717r64165j130027j030617j030083q73108p19871p62024
1325.1E46894150j036415j485672j680184j803283k118607k392082k275200k126961
1332.8E31975746j869278q40797q67691j111679r28955j77613N63278l66096n17693
1341.5E25859222j3923Q9035m66614k2049l3493l31306L47709M61197O65131J72729
1351.1E26727638J94931j69677m72718k94037j139717p72056o41976l91006j30234
$$ plain form
1359.8 522911148 522599564 522467651 522186661 521443481 520630112 520468178 519856453 519484825 519051285 518411407
1369.4 518411407 518698425 518584938 519446945 520340385 520776176 521212349 521264763 522078896 522631721 522819290
1379.1 522819290 522636185 523114014 523797340 524507980 525591850 526551018 528430443 530271111 531875229
1387.8 531875229 532848244 534305954 535662498 536404228 537220459 537692642 538692932 538881950 539134102
1396.4 539134102 539439049 539351349 537958412 536846771 537059212 536344337 535941925 535272636 533812027
1405.1 533812027 533132477 532876091 532995148 532376709 531748466 530768738 529839211 528719711 527570763
1413.8 527570763 527230911 526520004 526072693 525673141 525975952 524857445 524435844 524908104 524259605
1422.5 524259605 524328995 523419609 523655243 524207878 524360046 525412598 525707321 526072006 526318588 527832108
$$ packed form
1359.8E22911148l11584j31913k80990p43180q13369j61934o11725l71628m33540o39878
1369.4E18411407K87018j13487Q62007Q93440M35791M36173N2414Q14133N52825J87569
1379.1E22819290j83105M77829O83326P10640J083870R59168J879425J840668J604118
1387.8E31875229R73015J457710J356544P41730Q16231M72183J000290J89018K52152
1396.4E39134102L04947q7700j392937j111641K12441p14875m02412o69289j460609
1405.1E33812027o79550k56386J19057o18439o28243r79728r29527j119500j148948
1413.8E27570763l39852p10907m47311l99552L02811j118507m21601M72260o48499
1422.5E24259605O9390r09386K35634N52635J52168J052552K94723L64685K46582J513520
$$ plain form
1432.1 527832108 528773651 528787270 529807053 530424156 529594879 529249802 530959320 531569138 532357483
1440.8 532357483 533395538 534035492 535683022 536215553 537015915 537090569 536858978 535661545 535088692
1449.5 535088692 535648994 534815254 534433212 533517952 533904037 533916855 533733215 533955078 530310287 531861000
1459.1 531861000 530928307 531994171 531855240 532341309 534416542 534666710 537300644 538407898 541249428
1467.8 541249428 543272743 546628532 550639992 552608528 557980499 560061569 565169563 568253975
1475.5 568253975 572065735 576446037 580630760 584828796 587164383 591112175 592906265 595570526
1483.2 595570526 597918854 600300217 603923912 605832253 609220848 611401939 615173569 615281296
1491 615281296 616406708 618792038 620032959 622331161 623255768 623917274 625310059 626769524 627249947
$$ packed form
1432.1E27832108R41543J3619J019783O17103q29277l45077J709518O09818P88345
1440.8E32357483J038055O39954J647530N32531Q00362P4654k31591j197433n72853
1449.5E35088692N60302q33740l82042r15260L86085J2818j83640K21863l644791J550713
1459.1E31861000r32693J065864j38931M86069K075233K50168K633934J107254K841530
1467.8E41249428K023315L355789M011460J968536N371971K081070N107994L084412
1475.5E68253975L811760M380302M184723M198036K335587L947792J794090K664261
1483.2E95570526K348328K381363L623695J908341L388595K181091L771630J07727
1491F15281296J125412K385330J240921K298202R24607O61506J392785J459465M80423
$$ plain form
1499.6 627249947 628995285 631169395 631341896 632862434 634231834 637972984 639055061 629577560
1507.3 629577560 633872108 635775185 637673988 638371468 640250244 640850067 642002945 643422165 643954773
1516 643954773 646050797 643244171 645683060 647657776 647391968 646965256 647007980 650871887 652428207
1524.7 652428207 652981644 653187332 654442368 655000381 654906158 655667801 655562897 656824799 656928024
1533.4 656928024 656593628 657808838 659022064 660956039 662730713 664382782 656947403 658842621
1541.1 658842621 658543549 658259659 661254578 661831589 661631088 662903137 664339142 665358047 666072617
1549.8 666072617 664872208 665458755 666765213 666633530 665121765 665541458 668578186 670529556 666565170
1558.5 666565170 664113007 663309937 667317963 668484497 669259415 669497375 667433853 666734695 667222900
$$ packed form
1499.6F27249947J745338K174110J72501J520538J369400L741150J082077r477501
1507.3F29577560M294548J903077J898803O97480J878776N99823J152878J419220N32608
1516F43954773K096024k806626K438889J974716k65808m26712M2724L863907J556320
1524.7F52428207N53437K05688J255036N58013r4223P61643j04904J261902J03225
1533.4F56928024l34396J215210J213226J933975J774674J652069p435379J895218
1541.1F58842621k99072k83890K994919N77011k00501J272049J436005J018905P14570
1549.8F66072617j200409N86547J306458j31683j511765M19693L036728J951370l964386
1558.5F66565170k452163q03070M008026J166534P74918K37960k063522o99158M88205
$$ plain form
1567.1 667222900 668323898 669452133 666687393 666170883 666811905 666397400 665829544 665768585 664803009
1575.8 664803009 658810120 659118729 659660416 658769913 658179703 657682495 657081451 655706177 654510880
1584.5 654510880 652945023 650733109 648895111 646979904 645350571 643286591 641875153 640171585
1592.2 640171585 639001503 638134956 636245346 634638443 632025948 629624023 627017746 624955673
1599.9 624955673 622547188 619914169 618355026 616450386 615325394 613603897 612151604 610067558
1607.6 610067558 608245926 605701065 602662544 601789932 599332314 597196121 594769211 594478569 595013428
1616.3 595013428 588611794 588628845 587872505 586988258 585143814 584690514 583934021 579452972 578647499
1625 578647499 577770615 578249702 576598854 575254707 575267334 574899254 574621048 573594475 574175415 574866905
$$ packed form
1567.1F67222900J100998J128235k764740n16510O41022m14505n67856o0959r65576
1575.8F64803009n992889L08609N41687q90503n90210m97208o01044j375274j195297
1584.5F54510880j565857k211914j837998j915207j629333k063980j411438j703568
1592.2F40171585j170082q66547j889610j606903k612495k401925k606277k062073
1599.9F24955673k408485k633019j559143j904640j124992j721497j452293k084046
1607.6F10067558j821632k544861l038521q72612k457618k136193k426910k90642N34859
1616.3E95013428o401634J7051p56340q84247j844444m53300p56493m481049q05473
1625E78647499q76884M79087j650848j344147J2627l68080k78206j026573N80940O91490
$$ plain form
1634.6 574866905 572069054 570200005 571782722 571465645 571117592 571961136 572161064 573668518 573920250
1643.3 573920250 574933205 576555977 575994568 575760155 574799767 576944351 578616562 581532555 585713501
1652 585713501 591107941 584996643 584771194 587257423 589149742 590845566 591827354 593335800 595002975
1660.7 595002975 597218094 599885788 600902138 603256226 605525436 607810326 609866180 612364807
1668.4 612364807 613080635 614145432 617309952 619007797 621828995 624902077 627325249 628292274 631268768
1677.1 631268768 634295235 636514511 639095650 639788971 642203064 646172638 650134811 649049606
1684.8 649049606 649112320 652287750 654968491 656668625 658819046 660357895 661632462 663529205 664842148
1693.5 664842148 667294922 670328445 667514877 669682465 672770233 676732712 679769287 675014496
$$ packed form
1634.6E74866905k797851j869049J582717l17077l48053Q43544J99928J507454K51732
1643.3E73920250J012955J622772n61409k34413r60388K144584J672211K915993M180946
1652E85713501N394440o111298k25449K486229J892319J695824R81788J508446J667175
1660.7E95002975K215119K667694J016350K354088K269210K284890K055854K498627
1668.4F12364807P15828J064797L164520J697845K821198L073082K423172R67025K976494
1677.1F31268768L026467K219276K581139O93321K414093L969574L962173j085205
1684.8F49049606O2714L175430K680741J700134K150421J538849J274567J896743J312943
1693.5F64842148K452774L033523k813568K167588L087768L962479L036575m754791
$$ plain form
1701.2 675014496 677384186 679698105 681179810 680567551 680682526 679821320 680188599 682194061 683279266
1709.9 683279266 683711929 684641571 686072693 687759018 687700958 686087189 687635574 688484955 684416275
1718.5 684416275 685681000 687492752 688942108 690010529 691193924 691776276 692298813 692644653 692473984
1727.2 692473984 693071213 693787079 693035965 692429352 694591370 696790924 694664841 693300095 696024246
1735.9 696024246 698798370 699899750 701310577 701565857 698973541 700669556 702366943 702961884 703794327
1744.6 703794327 705879059 707713470 709127884 711152573 711330414 713531647 714247742 713891144 716194611
1753.3 716194611 717388077 718986359 721318665 722191315 723372726 725391617 726756516 728666458
1761 728666458 728424683 727739944 729601440 730177917 730734787 731955185 733009491 732751923 734529266
$$ packed form
1701.2F75014496K369690K313919J481705o12259J14975q61206L67279K005462J085205
1709.9F83279266M32663R29642J431122J686325n8060j613769J548385Q49381m068680
1718.5F84416275J264725J811752J449356J068421J183395N82352N22537L45840j70669
1727.2F92473984N97229P15866p51114o06613K162018K199554k126083j364746K724151
1735.9F96024246K774124J101380J410827K55280k592316J696015J697387N94941Q32443
1744.6G03794327K084732J834411J414414K024689J77841K201233P16095l56598K303467
1753.3G16194611J193466J598282K332306Q72650J181411K018891J364899J909942
1761G28666458k41775o84739J861496N76477N56870J220398J054306k57568J777343
$$ plain form
1769.7 734529266 737199249 737520065 737284851 735732193 737595367 738955460 738133850 739156952 739731903
1778.3 739731903 740853424 741536179 741590118 742289200 742967377 744031982 744157944 744021912 744224091
1787 744224091 744647369 745138626 746198502 746790390 746920700 747144928 747028961 748939896 749761200 749400330
1796.7 749400330 749814606 750666504 750478897 749154129 750539474 750964813 751666565 753054428 753717880
1805.3 753717880 754827118 755266113 754934235 754728928 755294647 754413910 754122314 755127716 755466003
1814 755466003 756348419 756923447 757620392 757660522 757780685 758470230 758276749 758106384 757570572 758324203
1823.7 758324203 759385300 758259354 758051910 759454041 761432571 762292480 759839096 759701385 761280365
1832.3 761280365 761057587 760630493 760615234 760807724 761123047 760816727 761752625 762084122 762673264 763078766
$$ packed form
1769.7G34529266K669983L20816k35214j552658J863174J360093q21610J023102N74951
1778.3G39731903J121521O82755N3939O99082O78177J064605J25962j36032K02179
1787G44224091M23278M91257J059876N91888J30310K24228j15967J910935Q21304l60870
1796.7G49400330M14276Q51898j87607j324768J385345M25339P01752J387863O63452
1805.3G53717880J109238M38995l31878k05307N65719q80737k91596J005402L38287
1814G55466003Q82416N75028O96945M0130J20163O89545j93481j70365n35812P53631
1823.7G58324203J061097j125946k07444J402131J978530Q59909k453384j37711J578980
1832.3G61280365k22778m27094j5259J92490L15323l06320R35898L31497N89142M05502
$$ plain form
1842 763078766 763581314 764627075 760637665 760754166 761704636 761621170 761707458 762382736 763535385 763595657
1851.6 763595657 763837433 763582687 763513947 763649063 763500290 763499756 763162994 763089294 762814407 763333511
1861.3 763333511 763504944 764122467 764794693 764444656 765122604 764775467 764425201 763656311 762746887 763334808
1870.9 763334808 763673630 764294968 764704208 765297012 765630493 765961456 765822601 765524139 765542755 764885101
1880.6 764885101 764967041 764980164 765448303 765971985 766048508 766349945 766313629 767022018 766989136 765920258
1890.2 765920258 765817871 766155167 766006927 766030197 766488571 766160355 766787338 767176743 767383270 767544327
1899.8 767544327 767137451 767415390 767448883 767145462 766529007 766461868 766692047 767039566 767598267 767790222
1909.5 767790222 767875137 767645264 768240662 768028946 767701569 767455902 766635513 767224503 766641541 766364594
$$ packed form
1842G63078766N02548J045761l989410J16501R50470q3466Q6288O75278J152649O0272
1851.6G63595657K41776k54746o8740J35116j48773n34l36762p3700k74887N19104
1861.3G63333511J71433O17523O72226l50037O77948l47137l50266p68890r09424N87921
1870.9G63334808L38822O21338M09240N92804L33481L30963j38855k98462J8616o57654
1880.6G64885101Q1940J3123M68139N23682P6523L01437l6316P08389l2882j068878
1890.2G65920258j02387L37296j48240K3270M58374l28216O26983L89405K06527J61057
1899.8G67544327m06876K77939L3493l03421o16455o7139K30179L47519N58701J91955
1909.5G67790222Q4915k29873N95398k11716l27377k45667q20389N88990n82962k76947
$$ plain form
1919.1 766364594 767215195 768042984 768820343 768078003 767630081 767895432 767822342 767358475 767494812 767542114
1928.8 767542114 767394943 767681274 767594986 767987595 768294296 768487625 768443756 768300018 768157654 767762299
1938.4 767762299 767943573 767549515 767956467 768546677 767549896 767910843 768788528 768928223 768563309 768343506
1948.1 768343506 767869797 767602844 767559204 767452621 767731323 768250351 768997269 769219589 769415741 769403229
1957.7 769403229 769256744 769115448 768714905 768488922 767774200 767760315 768208466 768830795 769810181 769806900
1967.3 769806900 769530792 769518127 769586792 769258652 768979263 768703537 768311081 768111801 767945175 768651352
1977 768651352 769436111 769897232 770171432 770505905 770649490 770155029 769717865 769129715 768858337 768572235
1986.6 768572235 768644104 769011841 768921738 769523468 770087051 769965134 769618759 769475327 769269333 769178467
$$ packed form
1919.1G66364594Q50601Q27789P77359p42340m47922K65351p3090m63867J36337M7302
1928.8G67542114j47171K86331q6288L92609L06701J93329m3869j43738j42364l95355
1938.4G67762299J81274l94058M06952N90210r96781L60947Q77685J39695l64914k19803
1948.1G68343506m73709k66953m3640j06583K78702N19028P46918K22320J96152j2512
1957.7G69403229j46485j41296m00543k25983p14722j3885M48151O22329R79386l281
1967.3G69806900k76108j2665O8665l28140k79389k75726l92456j99280j66626P06177
1977G68651352P84759M61121K74200L34473J43585m94461m37164n88150k71378k86102
1986.6G68572235P1869L67737r0103O01730N63583j21917l46375j43432k05994r0866
$$ plain form
1996.3 769178467 769113770 768730240 768804169 768896179 768927689 768905487 769413834 769880524 769703751 769616699 769044266
2006.9 769044266 768798370 768299561 767785721 767833862 767753983 768071442 768232574 768352432 768555756 768929443
2016.5 768929443 768716812 768271866 767769623 766583481 766274490 766215591 766370010 766775131 767082901 767058182
2026.2 767058182 766730728 767089081 766673737 766033249 765551834 765326691 765146179 764358215 764451447 764772568
2035.8 764772568 765242767 765400696 765122986 765087357 765049667 764842072 764054489 763751144 763450699 763457336
2045.5 763457336 763773270 763914337 764194565 764003296 764077530 763849182 763835449 764051285 763715134 763310013
2055.1 763310013 762804260 762800522 762685394 762996368 763449707 763588562 763838272 763896561 764277115 763771439
2064.7 763771439 762913132 762935333 763327179 763490143 763235245 763106003 763382645 764123611 764300613 764505844
$$ packed form
1996.3G69178467o4697l83530P3929R2010L1510k2202N08347M66690j76773q7052n72433
2006.9G69044266k45896m98809n13840M8141p9879L17459J61132J19858K03324L73687
2016.5G68929443k12631m44946n02243j186142l08991n8899J54419M05121L07770k4719
2026.2G67058182l27454L58353m15344o40488m81415k25143j80512p87964R3232L21121
2035.8G64772568M70199J57929k77710l5629l7690k07595p87583l03345l00445O637
2045.5G63457336L15934J41067K80228j91269P4234k28348j3733K15836l36151m05121
2055.1G63310013n05753l738j15128L10974M53339J38855K49710N8289L80554n05676
2064.7G63771439q58307K2201L91846J62964k54898j29242K76642P40966J77002K05231
$$ plain form
2074.4 764505844 764701691 764452591 764099426 763503723 763323669 762869949 762770233 763127518 763382721 763663025
2084 763663025 763938599 764550934 764339523 764009933 763947296 763916626 763830109 763421555 763500748 763532257 763785324
2094.6 763785324 764198151 764573364 764737854 764538651 764442444 764301071 764435196 764097824 763665619 763589401
2104.3 763589401 763774796 764237213 764618683 765124817 765256882 765541382 765389709 764887695 764660645 764218979
2113.9 764218979 764131699 764112473 764361877 764539413 764960937 765565796 765573654 765432587 765055084 765085068
2123.6 765085068 764778900 764379807 764596252 764770966 764698868 764427872 764826813 765263443 765375137 765092010
2133.2 765092010 765082245 765469284 764870377 764242020 764210510 764690094 764849548 764760056 765061722 765267487
2142.9 765267487 765467377 765499039 765676651 765561905 765269928 764868469 764264374 764221344 764211349 764511414
$$ packed form
2074.4G64505844J95847k49100l53165n95703j80054m53720r9716L57285K55203K80304
2084G63663025K75574O12335k11411l29590o2637l0670q6517m08554P9193L1509K53067
2094.6G63785324M12827L75213J64490j99203r6207j41373J34125l37372m32205p6218
2104.3G63589401J85395M62417L81470N06134J32065K84500j51673n02014k27050m41666
2113.9G64218979q7280j9226K49404J77536M21524O04859P858j41067l77503K9984
2123.6G65085068l06168l99093K16445J74714p2098k70996L98941M36630J11694k83127
2133.2G65092010r765L87039n98907o28357l1510M79584J59454q9492L01666K05765
2142.9G65267487J99890L1662J77612j14746k91977m01459o04095m3030r995L00065
$$ plain form
2152.5 764511414 765025940 765298538 765620270 766083069 766129837 765813751 765687180 765099487 764630356 764599915
2162.1 764599915 764881058 765372162 765768738 766117630 766580124 767349319 767279663 766896744 766740265 766543045
2171.8 766543045 766269684 765858688 766056747 766289139 766816330 767250595 767686386 768535156 768589401 768483582
2181.4 768483582 768369980 768397675 768336868 768107452 767995300 767706680 767824020 768437195 769296494 769601974
2191.1 769601974 769873962 770044937 769758301 769716949 769606705 769675446 769423981 769359512 769632645 769708328
2200.7 769708328 769880371 770094070 770651779 770979004 771176987 771069107 770999146 771035233 770770264 770970383
2210.4 770970383 771191025 771528854 771577530 771859512 772316742 772190475 772219391 772139816 772209015 771929474
2220 771929474 771965256 772086029 771759796 772176285 772585373 772929916 772772141 772536392 772490921 772429123
$$ packed form
2152.5G64511414N14526K72598L21732M62799M6768l16086j26571n87693m69131l0441
2162.1G64599915K81143M91104L96576L48892M62494P69195o9656l82919j56479j97220
2171.8G66543045k73361m10996J98059K32392N27191M34265M35791Q48770N4245j05819
2181.4G68483582j13602K7695o0807k29416j12152k88620J17340O13175Q59299L05480
2191.1G69601974K71988J70975k86636m1352j10244O8741k51465o4469K73133P5683
2200.7G69708328J72043K13699N57709L27225J97983j07880o9961L6087k64969K00119
2210.4G70970383K20642L37829M8676K81982M57230j26267K8916p9575O9199k79541
2220G71929474L5782J20773l26233M16489M09088L44543j57775k35749m5471o1798
$$ plain form
2229.7 772429123 772716980 772747269 773008957 773123322 773327026 773782883 774086151 774050446 773766098 773690643
2239.3 773690643 773053436 773039093 773366165 773074188 773026733 773370743 773759766 773865204 774252472 774373856
2248.9 774373856 774367447 774177322 773634186 773338852 773322525 773648224 773040390 772713852 773438187 774016418
2258.6 774016418 774369507 774635315 774921875 774704285 774516830 774064636 773783188 773911743 773939438 774238739
2268.2 774238739 774275894 774555893 774625549 774772186 774887543 774608841 774678192 774553833 774490891 774002991
2277.9 774002991 773974380 774143295 773993607 774423981 774652328 774774857 774727402 775226822 775347290 775054932
2287.5 775054932 775008392 774280090 774220200 774258347 774361649 774227066 774228210 774832458 774647217 774835129
2297.2 774835129 774819717 774650269 774586334 774395905 774157486 773512650 773473969 773615112 773970490 774007034
$$ packed form
2229.7G72429123K87857L0289K61688J14365K03704M55857L03268l5705k84348p5455
2239.3G73690643o37207j4343L27072k91977m7455L44010L89023J05438L87268J21384
2248.9G74373856o409j90125n43136k95334j6327L25699o07834l26538P24335N78231
2258.6G74016418L53089K65808K86560k17590j87455m52194k81448J28555K7695K99301
2268.2G74238739L7155K79999O9656J46637J15357k78702O9351j24359o2942m87900
2277.9G74002991k8611J68915j49688M30374K28347J22529m7455M99420J20468k92358
2287.5G75054932m6540p28302n9890L8147J03302j34583J144O04248j85241J87912
2297.2G74835129j5412j69448o3935j90429k38419o44836l8681J41143L55378L6544
$$ plain form
2306.8 774007034 774084396 774247589 774084930 774253616 773835983 774163666 774286194 773920364 773854828 773276901
2316.4 773276901 773356247 773272781 773087997 773236542 773401337 772998734 772506790 772311401 771890411 772044067
2326.1 772044067 771995544 772232590 771674042 771338272 771405869 770754929 771292114 770665283 770900574 771254807
2335.7 771254807 770001297 770390472 771541290 771718216 770644760 770717926 771112137 770855179 769746780
2344.4 769746780 768819275 769434967 768881760 769137878 770795898 771932602 771647034 771075058 771471405
2353.1 771471405 770997009 770023499 769873352 768793335 768153534 768893967 767135391 766145935 767677765
2361.8 767677765 768967361 769983444 769168625 768642654 768279800 768019791 767357101 766266327 767240677
2370.4 767240677 767873306 768025970 768355560 768578186 768593750 768642426 769343109 769693604 769594955 769393005
$$ packed form
2306.8G74007034P7362J63193j62659J68686m17633L27683J22528l65830o5536n77927
2316.4G73276901P9346q3466j84784J48545J64795m02603m91944j95389m20990J53656
2326.1G72044067m8523K37046n58548l35770O7597o50940N37185o26831K35291L54233
2335.7G71254807j253510L89175J150818J76926j073456P3166L94211k56958j108399
2344.4G69746780r27505O15692n53207K56118J658020J136704k85568n71976L96347
2353.1G71471405m74396r73510j50147j080017o39801P40433j758576r89456J531830
2361.8G67677765J289596J016083q14819n25971l62854k60009o62690j090774R74350
2370.4G67240677O32629J52664L29590K22626J5564M8676P00683L50495r8649k01950
$$ plain form
2380.1 769393005 769256439 768869324 768578491 768351517 768221436 768596725 768603973 768952255 769190292 768791962
2389.7 768791962 768717499 768679123 768441696 768175888 768089218 767604294 767528152 767761230 767545624 767572708
2399.4 767572708 767486343 767605209 767576752 767198944 766771927 766525955 766286163 765709000 765687714 765438232
2409 765438232 765286636 765551453 765669556 765674591 765378799 765445938 765168762 764688263 764262619 763804245
2418.7 763804245 763586884 763447189 763904800 764051743 763695679 763175507 762647629 762272339 762064209 762308578
2428.3 762308578 762228928 761927490 761347809 760899353 761086273 761348343 761505280 761206284 760665894 759906082
2438 759906082 759425964 759265747 758884506 758694153 758624420 758456955 758418427 758502426 758509903 758655090 758162689
2448.6 758162689 757497864 756991501 756100845 755933456 755802994 755731583 755763779 755674362 755776825 755541306
$$ packed form
2380.1G69393005j36566l87115k90833k26974j30081L75289P248L48282K38037l98330
2389.7G68791962p4463l8376k37427k65808q6670m84924p6142K33078k15606K7084
2399.4G67572708q6365J18866k8457l77808m27017k45972k39792n77163k1286k49482
2409G65438232j51596K64817J18103N035k95792O7139k77176m80499m25644m58374
2418.7G63804245k17361j39695M57611J46943l56064n20172n27878l75290k08130K44369
2428.3G62308578p9650l01438n79681m48456J86920K62070J56937k98996n40390p59812
2438G59906082m80118j60217l81241j90353o9733j67465l8528Q3999P477J45187m92401
2448.6G58162689o64825n06363q90656j67389j30462p1411L2196q9417J02463k35519
$$ plain form
2458.2 755541306 755716629 755642853 755240631 754533005 753576355 753351059 753109741 752971573 752946777 752966003
2467.8 752966003 753057251 753293381 753406601 753105850 752846375 752229919 751903992 751456528 750650177 750145569
2477.5 750145569 749976196 750298309 750456009 750927811 751274033 750921173 750271835 749837036 749756241 749051285
2487.1 749051285 748249664 747756729 747958298 748292236 747949295 747940750 748467255 748871765 748632660 748518600
2496.8 748518600 748085175 747305832 747034302 746559677 746254349 746286240 746484833 746682434 746944275 747162857
2506.4 747162857 746891479 746573181 746253433 745852585 745224228 744898224 744902649 744755173 744692307 744909973
2516.1 744909973 745403519 745467987 745340652 745239944 744867554 744144897 743672333 743592377 742918549 742463837
2525.7 742463837 742459106 742648010 742958145 742930374 742708054 742193909 741693878 741447601 741440277 741026230
$$ packed form
2458.2G55541306J75323p3776m02222p07626r56650k25296k41318j38168k4796J9226
2467.8G52966003R1248K36130J13220l00751k59475o16456l25927m47464q06351n04608
2477.5G50145569j69373L22113J57700M71802L46222l52860o49338m34799q0795p04956
2487.1G49051285q01621m92935K01569L33938l42941q545N26505M04510k39105j14060
2496.8G48518600m33425p79343k71530m74625l05328L1891J98593J97601K61841K18582
2506.4G47162857k71378l18298l19748m00848o28357l26004M425j47476o2866K17666
2516.1G44909973M93546O4468j27335j00708l72390p22657m72564p9956o73828m54712
2525.7G42463837m731J88904L10135k7771k22320n14145n00031k46277p324m14047
$$ plain form
2535.4 741026230 740521622 740255966 739962463 739862518 739448700 739599533 739931259 739743118 739405670 738904877
2545 738904877 738620453 738205872 738174438 737917252 737493057 737639236 737556458 737615128 737656937 737381058 736788101
2555.6 736788101 736149368 735535278 735091095 734883728 734729462 734717026 734328537 734508743 734687500 734600220
2565.2 734600220 734585800 733748703 733187561 732796555 732573700 732157593 731713791 731925201 731938248 732200394
2574.9 732200394 732308044 732189560 731556091 730885315 730732117 730167770 729789581 729296951 729052582 729054565
2584.5 729054565 728952026 729058990 729179306 729378662 728750687 728076630 727889175 727490845 726965485 726773758
2594.2 726773758 726809464 726317673 726214828 726479874 726705933 726939392 726858902 726573105 726018219 725495911
2603.8 725495911 724950333 724453354 724047699 723976212 724118195 724080353 724116211 723943787 723669815 723292542
$$ packed form
2535.4G41026230n04608k65656k93503r9945m13818J50833L31726j88141l37448n00793
2545G38904877k84424m14581l1434k57186m24195J46179q2778N8670M1809k75879n92957
2555.6G36788101o38733o14090m44183k07367j54266j2436l88489J80206J78757q7280
2565.2G34600220j4420q37097n61142l91006k22855m16107m43802K11410J3047K62146
2574.9G32200394J07650j18484o33469o70776j53198n64347l78189m92630k44369J983
2584.5G29054565j02539J06964J20316J99356o27975o74057j87455l98330n25360j91727
2594.2G26773758L5706m91791j02845K65046K26059K33459q0490k85797n54886n22308
2603.8G25495911n45578m96979m05655p1487J41983l7842L5858j72424k73972l77273
$$ plain form
2613.5 723292542 723014908 722592926 722048950 721657486 720961227 720557098 720253906 720131607 720153809 720127182
2623.1 720127182 720116425 719633102 719066620 718084259 717312546 717090759 716645660 716206055 716003036 715817413
2632.8 715817413 715293198 715049057 714674835 714342575 714564056 714273682 713460693 712532196 711864700 711377258
2642.4 711377258 711170425 711062088 710556107 710036392 709816437 709542618 708621979 707752533 706939240 706497955
2652 706497955 706492691 705816956 705453568 705702896 705749130 705172272 704520111 704230270 703810196 703310776
2661.7 703310776 702783890 702426682 702033844 701776123 701719437 701570358 701263809 700871658 700608215 700013657
2671.3 700013657 699670334 699343796 698658829 698314133 698389816 698329773 697519073 697171936 697053833 696535034
2681 696535034 696030960 695784683 695680695 694733887 694081879 693836746 693681488 693610077 692839203 692412720
$$ packed form
2613.5G23292542k77634m21982n43976l91464o96259m04129l03192j22299K2202k6627
2623.1G20127182j0757m83323n66482r82361p71713k21787m45099m39605k03019j85623
2632.8G15817413n24215k44141l74222l32260K21481k90374q12989r28497o67496m87442
2642.4G11377258k06833j08337n05981n19715k19955k73819r20639q69446q13293m41285
2652G06497955n264o75735l63388K49328M6234n76858o52161k89841m20074m99420
2661.7G03310776n26886l57208l92838k57721n6686j49079l06549l92151k63443n94558
2671.3G00013657l43323l26538o84967l44696P5683o0043q10700l47137j18103n18799
2681F96535034n04074k46277j03988r46808o52008k45133j55258p1411p70874m26483
$$ plain form
2690.6 692412720 692689819 692940292 692344894 691918182 692018433 691648712 691075897 690339890 689996796 689548416
2700.3 689548416 688986282 688506470 688138199 688421936 688028488 687157211 686727905 686910934 686952209 686210556
2709.9 686210556 685617447 685145187 684711609 684133224 683598099 683264084 682767105 682617340 682488632 681825867
2719.5 681825867 681371002 681357346 680847855 680148315 679903564 679897003 679965897 679995804 679732208 679004974
2729.2 679004974 678386688 677948914 677739334 677506638 676976700 676561737 676290817 676463165 676461334 675894165
2738.8 675894165 675210190 675146332 675468979 674959488 674224091 673596039 673507690 673966446 674016342 673539505
2748.5 673539505 673015671 672877960 672599792 672275162 671630630 671274490 671408005 670927429 670672989 670430298
2758.1 670430298 670024490 669738007 669712143 669691544 669285202 669287338 668971024 668507538 668550034 668490753 668015442
$$ packed form
2690.6F92412720K77099K50473n95398m26712J00251l69721n72815p36007l43094m48380
2700.3F89548416n62134m79812l68271K83737l93448q71277m29306J83029M1275p41653
2709.9F86210556n93109m72260m33578n78385n35125l34015m96979j49765j28708o62765
2719.5F81825867m54865j3656n09491o99540k44751o561O8894K9907k63596p27234
2729.2F79004974o18286m37774k09580k32696n29938m14963k70920J72348j831n67169
2738.8F75894165o83975o3858L22647n09491p35397o28052q8349M58756M9896m76837
2748.5F73539505n23834j37711k78168l24630o44532l56140J33515m80576k54440k42691
2758.1F70430298m05808k86483k5864k0599m06342K136l16314m63486M2496n9281m75311
$$ plain form
2768.7 668015442 667524872 667328033 667168655 667162933 666661606 666322556 666276703 665826569 665376129 664716415
2778.4 664716415 664466019 664331055 664017029 663654556 663262787 663103561 662974396 662835007 662089386 661520157
2788 661520157 660949783 660328140 660245056 659439163 658723145 658475418 657991943 657266159 656878891 656872864
2797.7 656872864 656206360 655156021 654394379 654051819 653192062 652282181 651581497 650659943 650508652
2806.3 650508652 650186920 649629974 648748245 647305298 646771240 646646652 645850677 644360199 643285751
2815 643285751 642835922 642207794 641299744 640142441 639417648 639017601 638276024 637556343 636511879 634804840
2824.7 634804840 633801041 633313484 632409973 631493378 630335464 629274521 628603554 627818031 626908607
2833.3 626908607 625798721 624393234 623289299 622307358 620825272 619326019 617540894 615828590
$$ packed form
2768.7F68015442m90570j96839j59378n722n01327l39050m5853m50134m50440o59714
2778.4F64716415k50396j34964l14026l62473l91769j59226j29165j39389p45621n69229
2788F61520157n70374o21643q3084q05893p16018k47727m83475p25784l87268o027
2797.7F56872864o66504j050339p61642l42560q59757r09881p00684r21554j51291
2806.3F50508652l21732n56946q81729j442947n34058j24588p95975j490478j074448
2815F43285751m49829o28128r08050j157303p24793m00047p41577p19681j044464j707039
2824.7F34804840j003799m87557r03511r16595j157914j060943o70967p85523r09424
2833.3F26908607j109886j405487j103935r81941j482086j499253j785125j712304
$$ plain form
2841.1 615828590 614460564 613190384 612158279 610206032 607898788 605956535 604248085 602652473
2848.8 602652473 600629807 598894424 597181702 595416260 594058533 593021278 592302132 591520538 590739555
2857.4 590739555 590100098 589618301 588896523 588125000 587221184 585771866 584391327 583307343 582307396
2866.1 582307396 580644798 578973503 577597313 575672569 573765793 571886215 570377083 569059219
2873.8 569059219 566944046 564469566 562310715 560817108 559689865 558011017 555888786 554512863
2881.6 554512863 553412476 551977615 550879021 550005493 549043770 548223228 547969551 547374802 546313820
2890.2 546313820 545719376 545236893 545157852 545150337 544584618 543986473 543587723 543167686 542591972 542281189
2899.9 542281189 542151260 541892662 541530533 540998421 540395584 539702415 538721199 537747917 536986580 536039276
$$ packed form
2841.1F15828590j368026j270180j032105j952247k307244j942253j708450j595612
2848.8F02652473k022666j735383j712722j765442j357727j037255p19146p81594p80983
2857.4E90739555o39457m81797p21778p71523r03816j449318j380539j083984r99947
2866.1E82307396j662598j671295j376190j924744j906776j879578j509132j317864
2873.8E69059219k115173k474480k158851j493607j127243j678848k122231j375923
2881.6E54512863j100387j434861j098594q73528r61723q20542k53677n94749j060982
2890.2E46313820n94444m82483p9041p515n65719n98145l98750m20037n75714l10783
2899.9E42281189j29929k58598l62129n32112o02837o93169r81216r73282p61337r47304
$$ plain form
2909.5 536039276 535045815 534026642 532725372 531151810 529455223 528090897 526761055 524678383
2917.2 524678383 522298927 520472412 518497925 516345978 515125084 514759407 514204063 512670326 511579971
2925.9 511579971 511545982 511574364 511893921 512094994 511677818 511505852 512136192 512771645 513698921 515185280
2935.6 515185280 516560326 518317337 519982758 521851006 524406548 526438217 528224754 530315552
2943.3 530315552 532342834 534710808 537381821 539222221 540767632 542895050 545278625 547330475
2951 547330475 549295044 551842308 553726463 555041008 556908188 559213867 561557045 563523636 565616875
2959.7 565616875 567691269 569639435 571585426 573458557 575445404 577306099 579023247 580435486
2967.4 580435486 581657944 583191566 585021210 586698570 588544121 590705833 592274818 593327255
$$ packed form
2909.5E36039276r93461j019173j301270j573562j696587j364326j329842k082672
2917.2E24678383k379456j826515j974487k151947j220894l65677n55344j533737j090355
2925.9E11579971l3989K8382L19557K01073m17176j71966O30340O35453R27276J486359
2935.6E15185280J375046J757011J665421J868248K555542K031669J786537K090798
2943.3E30315552K027282K367974K671013J840400J545411K127418K383575K051850
2951E47330475J964569K547264J884155J314545J867180K305679K343178J966591K093239
2959.7E65616875K074394J948166J945991J873131J986847J860695J717148J412239
2967.4E80435486J222458J533622J829644J677360J845551K161712J568985J052437
$$ plain form
2975.1 593327255 594688492 596370811 597696648 599029999 600473061 601881523 603401222 604314766
2982.8 604314766 605154648 606189537 607066078 607916794 608838310 609847984 610538864 611070023 611854897
2991.5 611854897 613047676 613852501 614274902 614663277 614719391 615131836 615518646 615470009 614968452 614608231
3001.1 614608231 615134506 615638733 615879288 615938606 615763741 615435982 615202370 615218620 615277748 614865685
3010.8 614865685 613998489 613817253 613636436 613157349 612901726 612127266 611291313 610930290 610397453 609431648
3020.4 609431648 608655205 608033905 607314110 606434441 605477219 604731140 603875999 603338432 603072777 602364502
3030.1 602364502 601385956 600590477 599878464 599096565 598339119 597049179 595669975 594818726 594411087
3038.7 594411087 593873253 592810135 592020416 591289062 590374832 589244308 587836800 586439285 585266685
$$ packed form
2975.1E93327255J361237J682319J325837J333351J443062J408462J519699R13544
2982.8F04314766Q39882J034889Q76541Q50716R21516J009674O90880N31159P84874
2991.5F11854897J192779Q04825M22401L88375N6114M12445L86810m8637n01557l60221
3001.1F14608231N26275N04227K40555N9318j74865l27759k33612J6250N9128m12063
3010.8F14865685q67196j81236j80817m79087k55623p74460q35953l61023n32837r65805
3020.4F09431648p76443o21300p19795q79669r57222p46079q55141n37567k65655p08275
3030.1F02364502r78546p95479p12013p81899p57446j289940j379204q51249m07639
3038.7E94411087n37834j063118p89719p31354r14230j130524j407508j397515j172600
$$ plain form
3047.4 585266685 584302902 583044167 581934776 580631523 579286003 578745193 578130646 577219276 576405067
3056.1 576405067 575301208 573933907 573139420 572122345 570719986 569799614 568911934 567742310 566269455
3064.8 566269455 565935440 565643425 563981667 562612457 561455956 560611420 559948235 559012756 557798386
3073.5 557798386 556349335 555061569 554139633 553778076 552782860 551528587 550476341 549172783 548145943
3082.1 548145943 546809578 545503502 544701996 544118576 542974892 541533699 541098785 540721283 539654198
3090.8 539654198 538058205 536569328 535613060 534619255 533176918 531457100 530687828 530567970 529902420
3099.5 529902420 528944740 528019333 526983604 525746231 524487877 523585052 522504463 520828743 519431877
3108.2 519431877 518479805 517627373 516804008 516417198 516257286 515485115 514323120 512543106 511072197
$$ packed form
3047.4E85266685r63783j258735j109391j303253j345520n40810o14547r11370q14209
3056.1E76405067j103859j367301p94487j017075j402359r20372q87680j169624j472855
3064.8E66269455l34015k92015j661758j369210j156501q44536o63185r35479j214370
3073.5E57798386j449051j287766r21936l61557r95216j254273j052246j303558j026840
3082.1E48145943j336365j306076q01506n83420j143684j441193m34914l77502j067085
3090.8E39654198j595993j488877r56268r93805j442337j719818p69272j19858o65550
3099.5E29902420r57680r25407j035729j237373j258354r02825j080589j675720j396866
3108.2E19431877r52072q52432q23365l86810j59912p72171j161995j780014j470909
$$ plain form
3116.9 511072197 510591736 509689255 508111038 506952553 505980873 504280548 503407440 503135147 502241211
3125.5 502241211 501261024 500145912 499445915 498527222 497277641 496258202 495146828 494062653 492871437
3134.2 492871437 492138939 491226616 490004539 489143219 488192253 487599487 487009125 485840988 484535217
3142.9 484535217 483581085 482798996 481876526 480704117 479449196 478803940 478089600 477116547 476296120
3151.6 476296120 475063896 473780365 472979851 472338142 471821060 471168823 469770927 468606186 467905045
3160.3 467905045 467033501 466244621 465141792 463970184 463050537 462110138 461442871 461114044 460321198
3168.9 460321198 458945351 457909279 457330933 456711159 455656548 454760628 454117126 453450546 452778435
3177.6 452778435 451575356 450757637 450246773 449571495 448913116 447823792 446920128 446066132 445229530
$$ packed form
3116.9E11072197m80461r02481j578217j158485r71680j700325q73108k72293q93936
3125.5E02241211r80187j115112o99997r18693j249581j019439j111374j084175j191216
3134.2D92871437p32498r12323j222077q61320r50966n92766n90362j168137j305771
3142.9D84535217r54132p82089r22470j172409j254921o45256p14340r73053q20427
3151.6D76296120j232224j283531q00514o41709n17082o52237j397896j164741p01141
3160.3D67905045q71544p88880j102829j171608r19647r40399o67267l28827p92846
3168.9D60321198j375847j036072n78346o19774j054611q95920o43502o66580o72111
3177.6D52778435j203079q17719n10864o75278o58379j089324r03664q53996q36602
$$ plain form
3186.3 445229530 444884033 444220924 443088417 442140198 441489143 441064873 440530663 439664726 438875885
3195 438875885 437999001 437295189 436657410 435615425 434668312 433995934 433631248 432815781 431851120 431225624
3204.6 431225624 430689621 430385323 429535370 428511581 427695084 427289276 427041969 426106339 425258026
3213.3 425258026 424419250 423470230 422920952 422809219 422514305 421855354 421193810 420124817 419313393
3222 419313393 418816910 418321571 417921295 417507172 417092743 416057243 415224419 415026779 414833984 414356079
3231.6 414356079 413240814 412531891 412455330 411953621 411124344 410222588 409730682 409777260 409044800 407970848
3241.3 407970848 407682495 407668343 407477341 406912155 406253891 405261841 404191322 403715324 403695869 403351288
3250.9 403351288 402143707 401656151 401532249 401146202 400991325 400223236 399537582 399115486 398542328
$$ packed form
3186.3D45229530l45497o63109j132507r48219o51055m24270n34210q65937p88841
3195D38875885q76884p03812o37779j041985r47113o72378l64686q15467r64661o25496
3204.6D31225624n36003l04298q49953j023789q16497m05808k47307r35630q48313
3213.3D25258026q38776r49020n49278j11733k94914o58951o61544j068993q11424
3222D19313393m96483m95339m00276m14123m14429j035500q32824j97640j92795m77905
3231.6D14356079j115265p08923p6561n01709q29277r01756m91906M6578p32460j073952
3241.3D07970848k88353j4152j91002n65186o58264r92050j070519m75998j9455l44581
3250.9D03351288j207581m87556j23902l86047j54877p68089o85654m22096n73158
$$ plain form
3259.6 398542328 398063354 397808647 397276230 396387596 395950432 395452499 395307350 395313988 394738312 394267960
3269.2 394267960 393858681 393395195 393067513 393050842 392644081 391869240 391081734 390401764 390465050 390234451
3278.9 390234451 389549599 389166222 388993263 388704643 388344612 388024445 387498398 387276726 387332573 387170105
3288.5 387170105 386519279 385868568 385423355 384913292 384816933 384559898 384365692 384419327 383884583 383131065
3298.2 383131065 382924461 382972794 382416458 382028465 381926651 381720238 381475868 380821228 380476875 379931297
3307.8 379931297 378926544 378681297 378680115 378236465 377526550 376823769 376611977 376779366 376567230 376049423
3317.4 376049423 375528145 374841232 374292259 374360390 374311485 373560181 372879868 372493401 372302399 371757050
3327.1 371757050 371085396 370799332 370120735 369484711 368968658 368620224 368419991 367781754 367724228 367690239
$$ packed form
3259.6C98542328m78974k54707n32417q88634m37164m97933j45149O638n75676m70352
3269.2C94267960m09279m63486l27682j6671m06761p74841p87506o79970O3286k30599
3278.9C90234451o84852l83377j72959k88620l60031l20167n26047k21672N5847j62468
3288.5C87170105o50826o50711m45213n10063r6359k57035j94206N3635n34744p53518
3298.2C83131065k06604M8333n56336l87993j01814k06413k44370o54640l44353n45578
3307.8C79931297j004753k45247j182m43650p09915p02781k11792J67389k12136n17807
3317.4C76049423n21278o86913n48973O8131m8905p51304o80313l86467j91002n45349
3327.1C71757050o71654k86064o78597o36024n16053l48434k00233o38237n7526l3989
$$ plain form
3336.7 367690239 367036514 366744347 366286163 365693626 365421028 364723701 364103546 363720131 362854881 362374573
3346.4 362374573 362299461 361869812 361447525 361160278 360634880 360287514 360144081 359507446 358847198 358376808
3356 358376808 358062019 357415123 356674271 356719246 356391029 355841179 355302315 354743690 354653664 354256821
3365.7 354256821 353822365 353190956 352176743 351549606 351271057 350778427 350493011 350693169 350174103
3374.3 350174103 349759216 349480476 348233337 347480354 347624168 347648773 347335587 346984100 346671371 346514015
3384 346514015 346234360 345565605 345141029 344956665 344914093 344810677 344493561 344457474 344130783 343504181
3393.6 343504181 343480339 343301125 343106194 342706108 341808090 342381973 342893677 342122192 341732521 341486130
3403.3 341486130 341428413 341494064 341433372 341304550 341230927 341264610 341192436 341173134 341035004 340883217 340520859
$$ packed form
3336.7C67690239o53725k92167m58184n92537k72598o97327o20155l83415q65250m80308
3346.4C62374573p5112m29649m22287k87247n25398l47366j43433o36635o60248m70390
3356C58376808l14789o46896p40852M4975l28217n49850n38864n58625r0026l96843
3365.7C54256821m34456o31409j014213o27137k78549m92630k85416K00158n19066
3374.3C50174103m14887k78740j247139p52983J43814K4605l13186l51487l12729j57356
3384C46514015k79655o68755m24576j84364m2572j03416l17116l6087l26691o26602
3393.6C43504181k3842j79214j94931m00086q98018N73883N11704p71485l89671k46391
3403.3C41486130n7717O5651o0692j28822p3623L3683p2174j9302j38130j51787l62358
$$ plain form
3413.9 340520859 340182686 339930496 339948387 340163002 339733467 339620056 339440002 339169388 339285851 339649925
3423.5 339649925 340241623 339953232 340037537 340453415 340434113 340456886 340310440 340262527 340332336 340909996
3433.2 340909996 341140633 341113358 341037750 340443954 340542870 341089058 341526794 341719513 341976547 341963081
3442.8 341963081 341821938 342387390 343171806 343959274 343713150 343511047 343855972 344470482 345330009 345131035
3452.5 345131035 344979019 345320930 346038246 346620560 346887093 347643318 347774506 347793007 348406105 349081154
3462.1 349081154 349113350 349012871 349461594 350099144 351216812 351543732 351333466 351788940 352623978 353638153
3471.7 353638153 354095421 354130707 354667892 355523834 355592499 355578728 356425018 357560654 358402481 358712006
3481.4 358712006 358568954 358595123 359393349 359849052 360362244 361404724 361857491 362622643 363812637
$$ packed form
3413.9C40520859l38173k52190J7891K14615m29535j13411j80054k70614J16463L64074
3423.5C39649925N91698k88391Q4305M15878j9302K2773j46446m7913O9809N77660
3433.2C40909996K30637k7275p5608n93796R8916N46188M37736J92719K57034j3466
3442.8C41963081j41143N65452P84416P87468k46124k02103L44925O14510Q59527j98974
3452.5C45131035j52016L41911P17316N82314K66533P56225J31188J8501O13098O75049
3462.1C49081154L2196j00479M48723O37550J117668L26920k10266M55474Q35038J014175
3471.7C53638153M57268L5286N37185Q55942O8665j3771Q46290J135636Q41827L09525
3481.4C58712006j43052K6169P98226M55703N13192J042480M52767P65152J189994
$$ plain form
3490.1 363812637 364286270 364113998 364757004 365561523 365935211 366620750 366723824 367231941 368104477 368743439
3499.7 368743439 369495926 370093307 370705452 370950546 371754646 372863922 373416710 374134636 375437965
3508.4 375437965 375987663 375654411 376706123 377743683 378127747 378679123 379495087 380386276 380709572
3517.1 380709572 381043930 381597443 382451820 383738785 385236969 385582504 384919891 385519905 386778793
3525.7 386778793 388311577 389228745 389586220 389903374 390796089 391951408 392767982 394096031 394576263
3534.4 394576263 395510178 396215782 395970497 397524605 398677940 399502983 400357056 401018219 401928635
3543.1 401928635 403049355 403578262 403875504 405346336 405054970 405968742 407487526 408998566 411513481
3551.8 411513481 411688080 412788963 413314629 414323502 416271553 416382751 417777634 418893738 419913139
$$ packed form
3490.1C63812637M73633j72272O43006Q04519L73688O85539J03074N08117Q72536O38962
3499.7C68743439P52487N97381O12145K45094Q04100J109276N52788P17926J303329
3508.4C75437965N49698l33252J051712J037560L84064N51376Q15964Q91189L23296
3517.1C80709572L34358N53513Q54377J286965J498184L45535o62613O00014J258888
3525.7C86778793J532784R17168L57475L17154Q92715J155319Q16574J328049M80232
3534.4C94576263R33915P05604k45285J554108J153335Q25043Q54073O61163R10416
3543.1D01928635J120720N28907K97242J470832k91366R13772J518784J511040K514915
3551.8D11513481J74599J100883N25666J008873J948051J11198J394883J116104J019401
$$ plain form
3560.5 419913139 420626717 422356834 424351845 425097656 429349823 430779686 429508209 429011078 428548584
3569.1 428548584 432099342 434014168 435953293 438537216 440039215 440998383 442441711 444205666
3576.9 444205666 444151573 445976028 447908859 449058952 451133804 453223305 455172844 456103554 459621010
3585.5 459621010 461586113 460936279 462788200 461580048 463971062 467291870 470524445 471783562
3593.2 471783562 472463989 476348801 475329704 477447433 481499786 482651405 485561905 486358948 487539406
3601.9 487539406 489766655 491197281 492751350 495445290 498264923 497212677 500543098 500887871
3609.6 500887871 501125259 509829216 512074928 508879585 512739830 512594185 515619316 519917717 520236282
3618.3 520236282 522042580 521597824 522374458 525879402 528478088 530340691 532832413 535007210 537406464
$$ packed form
3560.5D19913139P13578J730117J995011P45811M252167J429863j271477m97131m62494
3569.1D28548584L550758J914826J939125K583923J501999R59168J443328J763955
3576.9D44205666n4093J824455J932831J150093K074852K089501J949539R30710L517456
3585.5D59621010J965103o49834J851921j208152K391014L320808L232575J259117
3593.2D71783562O80427L884812j019097K117729M052353J151619K910500P97043J180458
3601.9D87539406K227249J430626J554069K693940K819633j052246L330421L44773
3609.6E00887871K37388Q703957K245712l195343L860245j45645L025131M298401L18565
3618.3E20236282J806298m44756P76634L504944K598686J862603K491722K174797K399254
$$ plain form
3627 537406464 545072670 546067200 532938995 536948547 542355042 548481216 550122986 547973137 550454865
3635.7 550454865 553870010 556021080 555622673 556954918 559938850 562730370 564004707 564355278 567359428
3644.4 567359428 572008476 577918549 575047951 571685181 579319763 579150085 575179977 573721581
3652.1 573721581 578380585 582304077 586522369 591907501 584185753 585745239 591262131 593391113
3659.8 593391113 594664574 594250069 596028137 597618484 599235840 600569611 601290665 606122169 609227295
3668.5 609227295 608386269 607419853 600339470 603568726 612889900 622889900 621188393 600873032
3676.2 600873032 606468086 614973984 619329414 616766052 616681709 620138779 621871300 623254547 624008293
3684.9 624008293 624277840 629055710 636873627 628349304 623166313 631261749 625243530 624975700 631111603
$$ packed form
3627E37406464P666206R94530j3128205M009552N406495O126174J641770k149849K481728
3635.7E50454865L415145K151070l98407J332245K983932K791520J274337L50571L004150
3644.4E67359428M649048N910073k870598l362770P634582j69678l970108j458396
3652.1E73721581M659004L923492M218292N385132p721748J559486N516892K128982
3659.8E93391113J273461m14505J778068J590347J617356J333771P21054M831504L105126
3668.5F09227295q41026r66416p080383L229256R321174J0000000j701507k0315361
3676.2F00873032N595054Q505898M355430k563362q4343L457070J732521J383247P53746
3684.9F24008293K69547M777870P817917q524323n182991Q095436o018219k67830O135903
$$ plain form
3693.5 631111603 632289276 634199142 634439583 634553566 636454811 636421394 638535652 641410141 636675873
3702.2 636675873 634449730 639231834 641516953 642065811 642662888 645476379 649542084 641634827 646056900
3710.9 646056900 651833572 637890701 641959839 646384506 646863861 647319870 649852753 651509399
3718.6 651509399 647934494 649757919 656146088 653296432 647957687 652727432 654892044 654078293
3726.3 654078293 650207977 649801331 653975067 655687637 661908112 658798294 650922318 661159363
3734 661159363 662281723 654151535 655584641 657443466 657207184 659809799 663054962 657674408 661037750
3742.7 661037750 673120804 660035706 646592178 657424469 663744202 670345764 668061447 658934631
3750.4 658934631 670230560 662748642 654447174 661636734 666637268 669735336 664415207 666782990
$$ packed form
3693.5F31111603J177673J909866K40441J13983J901245l3417K114258K874489m734268
3702.2F36675873k226143M782104K285119N48858N97077K813491M065705p907257M422073
3710.9F46056900N776672j3942871M069138M424667M79355M56009K532883J656646
3718.6F51509399l574905J823425O388169k849656n338745M769745K164612q13751
3726.3F54078293l870316m06646M173736J712570O220475l109818p875976J0237045
3734F61159363J122360q130188J433106J858825k36282K602615L245163n380554L363342
3742.7F61037750J2083054j3085098j3443528J0832291O319733O601562k284317r126816
3750.4F58934631J1295929p481918q301468P189560N000534L098068n320129K367783
$$ plain form
3758.2 666782990 673095551 664859924 662737350 666962433 668428879 669058380 672957764 670948792
3765.9 670948792 665814667 669049149 674755936 676109543 666612015 667751541 671240082 671162567 671893539
3774.5 671893539 672148056 673460464 674022217 677341309 678540878 669600220 671619568 674677582 675714493
3783.2 675714493 677722855 675022888 674219055 675407104 676362000 677165222 676936874 677077026 677006378
3791.9 677006378 677625656 677284775 679210281 684168930 680581436 675153503 676626740 681907349 689650955
3800.6 689650955 683115616 672979736 676150589 677985535 682586212 688420639 678835983 674359894
3808.3 674359894 679193115 680999451 681333542 682600861 683011551 684047165 689970856 689966202 675613251
3817 675613251 679654388 686175766 691807556 693806076 675835037 677191849 682989883 685100098
$$ packed form
3758.2F66782990O312561q235627k122574M225083J466446O29501L899384k008972
3765.9F70948792n134125L234482N706787J353607r497528J139526L488541p7515P30972
3774.5F71893539K54517J312408N61753L319092J199569q940658K019348L058014J036911
3783.2F75714493K008362k699967q03833J188049R54896Q03222k28348J40152p0648
3791.9F77006378O19278l40881J925506M958649l587494n427933J473237N280609P743606
3800.6F89650955o535339j0135880L170853J834946M600677N834427r584656m476089
3808.3F74359894M833221J806336L34091J267319M10690J035614N923691m654j4352951
3817F75613251M041137O521378N631790J998520j7971039J356812N798034K110215
$$ plain form
3824.7 685100098 687696075 687868118 682975769 683144073 685381927 688910217 691272812 682278976 684063110
3833.4 684063110 691993027 686898193 686109390 695643616 687465820 681649094 689585953 683350449
3841.1 683350449 683132706 690802841 688935852 684810104 687387619 688423538 688088913 690379257 689337921
3849.8 689337921 691227188 698080215 692633057 693005600 677590637 679635620 690722580 689562683
3857.5 689562683 687051697 689036484 691914139 695561523 690204468 689487305 697633209 692541580
3865.2 692541580 684913712 688868408 694792175 702361298 697044449 686129532 688404770 695052261
3872.9 695052261 700328293 689911499 688741684 692076874 691965561 694217072 699811783 695361633
3880.6 695361633 686440582 692682190 695360718 697652817 702146530 687493057 688493958 692902069
$$ packed form
3824.7F85100098K595977J72043m892349J68304K237854L528290K362595q993836J784134
3833.4F84063110P929917n094834p88803R534226q177796n816726P936859o235504
3841.1F83350449k17743P670135j866989m125748K577515J035919l34625K290344j041336
3849.8F89337921J889267O853027n447158L72543j5414963K044983J1086960j159897
3857.5F89562683k510986J984787K877655L647384n357055p17163Q145904n091629
3865.2F92541580p627868L954696N923767P569123n316849j0914917K275238O647491
3872.9F95052261N276032j0416794j169815L335190j11313K251511N594711m450150
3880.6F95361633q921051O241608K678528K292099M493713j4653473J000901M408111
$$ plain form
3888.3 692902069 693972931 698347321 697612991 689793701 691442184 694805603 693015671 694036636
3896.1 694036636 695596161 698247604 699726028 689533997 695288010 698468704 693354187 698380280
3903.8 698380280 694578934 692334442 692968369 693749847 696104507 695916977 696100388 695915909 696091690
3912.5 696091690 696424789 695855026 697104492 699661407 696433945 692232666 697084732 698451996 694295807
3921.1 694295807 695741196 697918777 700391693 698326187 693968048 695203094 697238312 699277878
3928.8 699277878 698926926 697968140 699175186 696931686 695047684 695870285 696562958 697634048 698036499
3937.5 698036499 697348099 697533493 698091812 700025787 701162567 696348648 695356140 696611252 697387161
3946.2 697387161 699378433 697428513 697917252 698972931 696340256 697980652 699409027 698446655 697990875
$$ packed form
3888.3F92902069J070862M374390p34330p819290J648483L363419j789932J020965
3896.1F94036636J559525K651443J478424j0192031N754013L180694n114517N026093
3903.8F98380280l801346k244492O33927P81478K354660j87530J83411j84479J75781
3912.5F96091690L33099n69763J249466K556915l227462m201279M852066J367264m156189
3921.1F94295807J445389K177581K472916k065506m358139J235046K035218K039566
3928.8F99277878l50952r58786J207046k243500j884002Q22601O92673J071090M02451
3937.5F98036499o88400J85394N58319J933975J136780m813919r92508J255112P75909
3946.2F97387161J991272j949920M88739J055679k632675J640396J428375r62372m55780
$$ plain form
3954.9 697990875 698662643 699480133 699476776 700039673 699143829 698741684 699132538 697825775 697874680 698795853
3964.5 698795853 698968658 698946457 699586487 700390167 699674606 698823090 699175797 699271927 699388428 699384689
3974.2 699384689 699041290 699134827 698483047 698921967 699965591 699457779 699255600 699729691 700013809 699568710
3983.8 699568710 699893646 700190887 699561844 699810181 700121841 700540848 700306931 699831543 699940262 699603195
3993.5 699603195 699543915 699638214 700285873 700954514 701021118 700556717 699912338
4000.2 699912338
$$ packed form
3954.9F97990875O71768Q17490l357N62897q95844m02145L90854j306763M8905R21173
3964.5F98795853J72805k2201O40030Q03680p15561q51516L52707R6130J16501l739
3974.2F99384689l43399R3537o51780M38920J043624n07812k02179M74091K84118m45099
3983.8F99568710L24936K97241o29043K48337L11660M19007k33917m75388J08719l37067
3993.5F99603195n9280R4299O47659O68641O6604m64401o44379
4000.2F99912338
##END=$$ End of the data block
