##TITLE=$$ Begin of the data block
##JCAMP-DX=5.00 $$ ACD/SpecManager v 10.08
##SPECTROMETER/DATA SYSTEM=Varian
##DATE=20 Nov 2012 14:08:12
##DATA TYPE=INFRARED SPECTRUM
##DATA CLASS=XYDATA
##ORIGIN=
##OWNER=
##NPOINTS=3735
##FIRSTX=399.26403809
##LASTX=4000.35498047
##MAXX=4000.35498047
##MINX=399.26403809
##MAXY=77.63691711
##MINY=30.10948372
##XFACTOR=1.0000000000
##YFACTOR=0.000000100000000
##FIRSTY=52.91401672
##DELTAX=0.96440572
##XUNITS=1/CM
##YUNITS=TRANSMITTANCE
##XYDATA=(X++(Y..Y))
399.3E29140167J2274208L168679q668137Q68454L627243Q242111O064263n382309
407E49334679p067223j458893N92804j244011L281861p11213K79351M539222P82929
415.7E48329506P821045J1538582Q372383j4056740j0185776O35185l699531o811638
423.4E41943016p186623j788215J0920143M779625k358513m674988q815040m132920
431.1E28686485K140465j11809J247635J409569K299156P60651m563370j768951L988723
439.8E34088554Q251648L82805k563247N214729K600212K887573Q57582j399498k174606
448.4E48145752n177422J160050P406807L329162k346305L61938m7913j602478J401902
457.1E52631493m44870n606079k741852K984237K422142N00679n67703m281463l750802
$$ plain form
399.3 529140167 541414375 544583054 535914917 536783371 540410614 548652725 554716988 549334679
407 549334679 542267456 540808563 541401367 540157356 543439217 542728004 543007355 547546577 548329506
415.7 548329506 556150551 567689133 576061516 562004776 551819000 552454185 548754654 541943016
423.4 541943016 534756393 532968178 543888321 548667946 546309433 541634445 532819405 528686485
431.1 528686485 530826950 530715141 531962776 533372345 535671501 536432152 531868782 530099831 534088554
439.8 534088554 542340202 542723007 540159760 545374489 547974701 550862274 551719856 550320358 548145752
448.4 548145752 542968330 544128380 551535187 554864349 552518044 552879982 552832069 551229591 552631493
457.1 552631493 552186623 546580544 543838692 546822929 549245071 549745750 549178047 544896584 541145782
465.8E41145782j813850J547546K333909j819649k881432j138611q86154j450462k399445
474.5E32637634q04367P96700n870095l708152O23474N2604J672020L269196M283562
483.2E32952576m241028k808991L863831j789017p234649l532486L768158K006340
490.9E22984734K023086j972084m235649J099663L381729L668213j258469j421280
498.6E24269943k452736j964111N80826n703011k174339J517296K160148j084137l505783
507.3E11644096j765060k558212L94439j160583k541847k021561j979561k61879K594
516D99752426j076393k355690j003380l652763k820244j105423o34079p99141k048302
524.6D84257011M78821K48947K787094K070694l7689q00895k202073R3041r48906L89290
$$ plain form
465.8 541145782 539331932 540879478 543213387 541393738 538512306 537373695 536487541 535037079 532637634
474.5 532637634 531833267 532629967 526759872 523051720 523675194 523727798 525399818 528669014 532952576
483.2 532952576 528711548 525902557 529766388 527977371 520742722 517210236 520978394 522984734
490.9 522984734 525007820 523035736 518800087 519899750 523281479 526949692 525691223 524269943
498.6 524269943 521817207 519853096 520433922 514730911 512556572 514073868 516234016 515149879 511644096
507.3 511644096 509879036 507320824 507715263 506554680 504012833 501991272 500011711 499749832 499752426
516 499752426 498676033 496320343 495316963 491664200 488843956 487738533 487104454 486305313 484257011
524.6 484257011 484735832 484984779 487771873 489842567 489804878 489003983 486801910 486894951 485946045 486335335
534.3D86335335N62935J037826K654343J801185L690415J871834K224769L264504K192116
543E05635262J189804O59904J758881p03965j599578r18160J966744K350540j854134
551.6E08485298p36084O7558n56716j394005j673699k328644k550926p50122j462822
560.3D97099838j984215k234077m05998r46121k761193k423095l873406l245239l450203
569D75776291k437096k189178k191315j396217j37329K175903p45163o53152N11245
577.7D68713989R87587L115349K359581J416283K781791K851525J919327M110145L097344
586.4D91352921J803245J967087J508026R84535m463J997147K332573Q86039m76761
595E02350349k23083P16247O12183R97200k4872Q6975q97102r33990r11179j298676
$$ plain form
534.3 486335335 486898270 487936096 490590439 492391624 496082039 497953873 500178642 503443146 505635262
543 505635262 506825066 507484970 509243851 508539886 506940308 506022148 507988892 510339432 508485298
551.6 508485298 507749214 507816772 507260056 505866051 504192352 501863708 499312782 498562660 497099838
560.3 497099838 495115623 492881546 492475548 491529427 488768234 486345139 482471733 479226494 475776291
569 475776291 473339195 471150017 468958702 467562485 467425156 469601059 468855896 468202744 468713989
577.7 468713989 469701576 472816925 475176506 476592789 479374580 482226105 484145432 488255577 491352921
586.4 491352921 493156166 495123253 496631279 497615814 497611351 499608498 501941071 502827110 502350349
595 502350349 502127266 502843513 503455696 504452896 504428024 504514999 503617897 502683907 501772728 500474052
604.7E00474052J063042J56746J365433J247368p16095L09715N4550N71861P8431J20964
614.3E04726067n03846l55415J482468Q52928J872368L101768L491745K000771N58166
623E17227020R76219J097298J98746O56319K400665J270103J535874K469062J251603
631.7E29082909J130867P36427k87247L76663R37653j274300m35371J502380J305237
640.4E33075218J889687J193886J586876J428222P18346J31073j716652j075516P03354
649E37934494J955948J249199L23295P50542O12183L47900K95830J671295J263924
657.7E46404610j84632K35749k49367l12309K34413Q60748R12705N09605K042198J084747
667.4E51538467n437240M192352J739121q25615J48620Q75817J094703K01989L34396
$$ plain form
604.7 500474052 501537094 501693840 503059273 504306641 503590546 503900261 503954811 504526672 504605103 504726067
614.3 504726067 504222221 503866806 505349274 506202202 508074570 511176338 514668083 516668854 517227020
623 517227020 518203239 519300537 519499283 520155602 522556267 523826370 525362244 527831306 529082909
631.7 529082909 530213776 530950203 530662956 531039619 531977272 530702972 530267601 531769981 533075218
640.4 533075218 534964905 536158791 537745667 539173889 539892235 540023308 538306656 537231140 537934494
649 537934494 539890442 541139641 541462936 542213478 542825661 543173561 543469391 545140686 546404610
657.7 546404610 546219978 546455727 546206360 545894051 546128464 546989212 547901917 548411522 550453720 551538467
667.4 551538467 546101227 550293579 552032700 551207085 551355705 552231522 553326225 553528214 553862610
676.1E53862610K274284K812729P38258n40351P92389L33137q82530o93436K29530
684.7E58926620J183053J110878O24160J072960J684418L14026N00030j93214k664871
693.4E62558060j711655j238594q26683j8044r11636L6202M00123q22372j039200j497841
703.1E54928360j994095j556740j281547o45256J42021r6321o7101J169091K400589
711.7E52999001J084747R1553P27882J675339K701149J521644R94263J334343K245865
720.4E65375786L298874K835502L034897K405586K378769K628060J127968O11763J395111
729.1E85092316K006797K286072J921845J339607J685638K299233J951713P51801R00917
737.8F00235939R89838K98004L86848k97355k42157M40902O78635J020775M94652p36084
$$ plain form
676.1 553862610 556136894 558949623 559687881 559147530 559939919 560273056 559390526 558697090 558926620
684.7 558926620 560109673 561220551 561844711 562917671 564602089 564916115 565416145 565222931 562558060
693.4 562558060 560846405 559607811 558781128 558763084 557851448 557887650 558287773 557465401 556426201 554928360
703.1 554928360 552934265 551377525 550095978 549450722 549592743 549496422 549429321 550598412 552999001
711.7 552999001 554083748 554175301 554903183 556578522 559279671 560801315 561795578 563129921 565375786
720.4 565375786 568674660 571510162 574545059 576950645 579329414 581957474 583085442 583697205 585092316
729.1 585092316 587099113 589385185 591307030 592646637 594332275 596631508 598583221 599335022 600235939
737.8 600235939 601225777 601523781 601910629 601613274 601371117 601812019 602490654 603511429 604006081 603269997
747.4F03269997j656456j758843k706070l756103k860413j846657j643409r65348m75540
756.1E85601158J145l08609k527504k441216j028252k254982k940979k045593j094436
764.8E70960732n84717M58831K829857L356285K099648J145020J772460K670899K056160
773.5E86765175J448250J937561L013611L063659L128433M031983M394760L252983
781.2F11036415K595482L054008K439728J314049Q67615J581383J889457J774903J206321
789.9F27759361K013321M328041K909279M98963P35626J278686J99318K20413J532212
798.5F41475220J576004J532135J801452K133027J876754J751709J968689K372666
806.2F56487656Q84018j648941j539917j043091L11050L35770j67847K20032J01318
$$ plain form
747.4 603269997 601613541 599854698 597148628 593392525 590532112 588685455 587042046 586076698 585601158
756.1 585601158 585602303 585293694 582766190 580324974 579296722 577041740 574100761 572055168 570960732
764.8 570960732 570376015 570834846 573664703 577020988 579120636 580265656 582038116 584709015 586765175
773.5 586765175 588213425 590150986 593164597 596228256 599356689 603388672 607783432 611036415
781.2 611036415 613631897 616685905 619125633 620439682 621307297 622888680 624778137 626553040 627759361
789.9 627759361 629772682 634100723 637010002 637508965 638244591 639523277 639722595 639943008 641475220
798.5 641475220 643051224 644583359 646384811 648517838 650394592 652146301 654114990 656487656
806.2 656487656 657371674 655722733 654182816 653139725 653450775 653786545 653618698 653838730 653940048
814.9F53940048Q37784M14658M70199L68271l45688j008758q97217j49765n24826K67410
824.6F53372116n89523m47006P52944K37046l57361k405624k358094j618347k222824
833.3F44363327l068237k108536j299744j766510R0828p30324j644554j282348k263565
841.9F30290337j799889j963577j766358j611061j594353r54551p78885j96915j105423
850.6F18519325k003288j270447j666298k926368l627549m016075k702255j503868
858.3E98803177j772156o16150M74396P24373J661148K637558L222656K566490K295380
867F09996872L265648M816856N159302M441452M283257M371185M821434L287887J788941
875.7F46232834J251373R91745N72052J10932j04294q00324n0888q17795j435775j164322
$$ plain form
814.9 653940048 654777832 655192490 655662689 656030960 655685272 654676514 653779297 653629532 653104706 653372116
824.6 653372116 652782593 652335587 653088531 653325577 652968216 650562592 648204498 646586151 644363327
833.3 644363327 641295090 639186554 637886810 636120300 636211128 635480804 633836250 632553902 630290337
841.9 630290337 628490448 626526871 624760513 623149452 621555099 620600548 619821663 619624748 618519325
850.6 618519325 616516037 615245590 613579292 610652924 607025375 603009300 600307045 598803177
858.3 598803177 597031021 596414871 596889267 597613640 599274788 601912346 605135002 607701492 609996872
867 609996872 613262520 618079376 623238678 627680130 631963387 636334572 641156006 644443893 646232834
875.7 646232834 647484207 648475952 649048004 649158936 649054642 648254318 648203430 647385635 645949860 644785538
885.3F44785538k083817j749954k341118l356132k692948k704162l350220k051010
893F24456177j101914j574440j477623j379585j881638k501373k098846k054901j852227
901.7F08533630j695709k895546k820206j678161j012993k040520k768058k792054
909.4E90830383l824119l794709m404945m807014m138031m023285l215447l517112
917.2E59105721m029351l748054l200379j697960j641388j629982k092323j838150
924.9E39228134q55636j245232J59264L19557O63223R26132J47858Q79364N89218P16553
934.5E41528435L14712O13060J448212R12056J088753J684265K845382K441826J883431
943.2E54760132J596031J70097p25021j821365k614136l135452l641358l910293m268570
$$ plain form
885.3 644785538 642701721 640951767 638610649 635254517 632561569 629857407 626507187 624456177
893 624456177 623354263 621779823 620302200 618922615 617040977 614539604 612440758 610385857 608533630
901.7 608533630 606837921 603942375 601122169 599444008 598431015 596390495 593622437 590830383
909.4 590830383 587006264 583211555 578806610 573999596 569861565 565838280 562622833 559105721
917.2 559105721 555076370 551328316 548127937 546429977 544788589 543158607 541066284 539228134
924.9 539228134 538372498 537127266 537286530 537606087 538269310 539195442 539343300 540222664 540811882 541528435
934.5 541528435 541843147 542456207 543904419 544816475 545905228 547589493 550434875 552876701 554760132
943.2 554760132 556356163 556526260 555801239 553979874 551365738 548230286 544588928 540678635 536410065
951.9E36410065m704438m728202m604721n895653n919190o271743p085076o905060
959.6D90295982o815986o030846o509781o429863o599464o217919o577262p742959
967.3D37371902p198982p971382p698822q458443p601127p148209q368034p312508
975C75614395p374687o808624p612305o352386o027375o437797n055123n218887m033279
983.7C20693932m471455l007221k700043k240791j599064j805287l35674j441440K43797
992.4C03336754l28045m71554J81084j07289P56169m22135Q07095l91197L86219J233139
1002C04980240L88412K04602o55938Q88863p00512j17378r19094p83310J324634m11968
1011.7C04198551l42884j596527k76718k47307o02226l8052O0215J169605k59437J025886
$$ plain form
951.9 536410065 531705627 526977425 522372704 516477051 510557861 504286118 497201042 490295982
959.6 490295982 483479996 477449150 470939369 464509506 457910042 451692123 445114861 437371902
967.3 437371902 430172920 422201538 414502716 406044273 398443146 391294937 382926903 375614395
975 375614395 368239708 361431084 353818779 347466393 341439018 335001221 329946098 324727211 320693932
983.7 320693932 316222477 313215256 310515213 308274422 306675358 304870071 304534397 303092957 303336754
992.4 303336754 303008709 302537155 302718239 302610950 303367119 302944984 303752079 303360882 303747101 304980240
1002 304980240 305368652 305573254 304917316 305806179 305105667 304988289 304069195 303285885 304610519 304198551
1011.7 304198551 303855667 302259140 301982422 301735115 301132889 301094837 301155052 302324657 302065220 303091106
1021.3C03091106N54429J558475J611214L60717J756115J151829J753311N11685J598854
1030C13947735J665039J212101J280365K09274K015991J050759J187515K32162J059800
1038.7C23860741R25903j244736j33209n37949J493073L30734N29823N92270m25338
1047.4C25391312J158180L81470J353035J76658J911659J635895J142235K913666J324882
1056C37388992K637978K549324L789864K656097L377228M809570L136444L754883K785072
1064.7C66885452M726563L106193K105751J541825j513329j875687l864440l164101
1072.4C67948227m231911m933510m902343l206711n57518j840210m99191j089936O69174
1081.1C47356071P93839J181145K503509J083870K387123J058426K338562K570496
$$ plain form
1021.3 303091106 303645535 305204010 306815224 307175941 308932056 310083885 311837196 312348881 313947735
1030 313947735 315612774 316824875 318105240 318314514 320330505 321381264 322568779 322800941 323860741
1038.7 323860741 324786644 323541908 323408699 322870750 324363823 324694557 325224380 325816650 325391312
1047.4 325391312 326549492 326930962 328283997 328460655 330372314 332008209 333150444 336064110 337388992
1056 337388992 340026970 342576294 346366158 349022255 352399483 357209053 360345497 364100380 366885452
1064.7 366885452 371612015 374718208 376823959 378365784 376852455 374976768 371112328 367948227
1072.4 367948227 363716316 358782806 353880463 350673752 350116234 348276024 347776833 346686897 347356071
1081.1 347356071 348149910 349331055 351834564 352918434 355305557 356363983 358702545 361273041
1088.8C61273041K292366J842575J824112M133377K844543K838326R90105J449012
1096.5C79487457J890183J410408J598892k7084J161537n9815N60265J1177k37274
1105.2C85795746J281357K68669J287880R12857J482849J147804K850838K878418J009674
1113.9C98916092K472572K099915L130264J535988J714821K074737R68743J330452
1121.6D14243584k26326N32875K18467J548272J446228J208572K732430J635742K602768
1130.3D25942612K383232K702331J388092P17812J312447M4822K53258n82352l91807
1139D33770447j768799k110291k170028l377686k605438l313446k845039m231568l893699
1147.6D07454453k855759k441368j330185k230721m99382j021270n82123p65534j303596
$$ plain form
1088.8 361273041 363565407 365407982 367232094 371365471 374210014 377048340 378038445 379487457
1096.5 379487457 381377640 382788048 384386940 384359856 385521393 385461578 386021843 386033020 385795746
1105.2 385795746 387077103 387345772 388633652 389546509 391029358 392177162 395028000 397906418 398916092
1113.9 398916092 401388664 403488579 406618843 408154831 409869652 411944389 412913132 414243584
1121.6 414243584 414017258 414550133 414768600 416316872 417763100 418971672 421704102 423339844 425942612
1130.3 425942612 428325844 431028175 432416267 433134079 434446526 434491348 434744606 434162254 433770447
1139 433770447 432001648 429891357 427721329 424343643 421738205 418424759 415579720 411348152 407454453
1147.6 407454453 404598694 402157326 400827141 398596420 398097038 397075768 396493645 395728111 394424515
1156.3C94424515m49066q15735R86137O89469J253814P79572J743393L068733K739906
1165D04420738L738137K864875M162674L685532M075127M778633M795417N437546M956055
1173.7D42914734O525345N709190O289635O306038N148811N028114M347039N029640
1181.4D87298546M235496M709549N152588M734802M553643M404068M621200L227883
1189.1E22937775K494774K153511J965751J685906J538543J476097M46778Q40111R65080
1197.8E36504326K99263N19523J173211O37397k53791K67829o5498J83830J324349
1206.5E40590439J417808J314202J519813J373825J361237K045822J585159J041832
1214.2E52250137J011086J051483J220398J380577J730194J417122J088104P94487
$$ plain form
1156.3 394424515 393975449 393159714 394145851 394835320 396089134 396868706 398612099 401680832 404420738
1165 404420738 408158875 411023750 415186424 418871956 422947083 427725716 432521133 437958679 442914734
1173.7 442914734 449440079 455149269 461438904 467744942 472893753 477921867 482268906 487298546
1181.4 487298546 491534042 496243591 501396179 506130981 510684624 515088692 519709892 522937775
1189.1 522937775 525432549 527586060 529551811 531237717 532776260 534252357 534699135 535539246 536504326
1197.8 536504326 536803589 537323112 538496323 539133720 538879929 539147758 539082260 539266090 540590439
1206.5 540590439 542008247 543322449 544842262 546216087 547577324 549623146 551208305 552250137
1214.2 552250137 553261223 554312706 555533104 556913681 558643875 560060997 561149101 561943588
1221.9E61943588N30815N35584k31400j124916j009903q97751q14628m91600p59010
1230.6E57680779m43764L18985j74523q43544o54411k16827j072464j784783j116447
1239.3E51693001o95992k60009k5254L59688O53038L51486N82733R42994L51944l98789
1248.9E53554840J25198N43862N19333N32913N56488J095962J467972J061478N72586
1257.6E60030632R01070O46934L3989M8485o5308k43225J57700P53822N34172P58362
1267.2E63556633J437187J542664J567840J273308Q46748M44413R5825j26305P7782
1275.9E70716095M19083O42166O42662P79075O19965K7199j35575l30925k75650m88090
1285.5E72616005k08321j59912r00154k40745K34146L56674J86958j71776l60107q27637
$$ plain form
1221.9 561943588 562474403 563009987 562778587 561653671 560643768 559746017 558931389 558439789 557680779
1230.6 557680779 557237015 557556000 557381477 556537933 555883522 555666695 554594231 552809448 551693001
1239.3 551693001 550997009 550737000 550711746 551071434 551724472 552075958 552658691 553601685 553953629 553554840
1248.9 553554840 553680038 554223900 554743233 555276146 555832634 556928596 558396568 559458046 560030632
1257.6 560030632 560931702 561578636 561612625 561661110 561595802 561352577 561510277 562264099 562798271 563556633
1267.2 563556633 564993820 566536484 568104324 569377632 570224380 570668793 570764618 570638313 570716095
1275.9 570716095 571135178 571777344 572420006 573199081 573819046 573846245 573710670 573379745 573104095 572616005
1285.5 572616005 572407684 572247772 571347618 571106873 571341019 571697693 571884651 571712875 571352768 570525131
1295.2E70525131q36334j054993j105003j022491p82433q50029q20236m9095l42598
1303.9E63661919n17960j269455j643104J11198k56348j921997j489753l29438k18048
1312.5E56127014l18642j5068l96614m58908n11017p02514q65975j239776j100617
1321.2E50517883j188430r28803n77507q19244r38149j436157j810036j676025j938477
1329.9E39205055k316246k004318j871567k094497j601525j121368n13687n80368l43781
1338.6E26757698j01051n81208j52778r0027j29776o06155j08796K53945L28407P65877
1348.2E26336136L12462J95312r9945K34261J1711m56848m24309q28171o29539p47147
1357.9E23903923n00565n69343n05142K11944J68190p82661q21724j35079r63058m30946
$$ plain form
1295.2 570525131 569688797 568633804 567528801 566506310 565723877 564873848 564053612 564004517 563661919
1303.9 563661919 563143959 561874504 560231400 560342598 560086250 558164253 556674500 556345062 556127014
1312.5 556127014 555808372 555793304 555396690 554937782 554426765 553724251 552858276 551618500 550517883
1321.2 550517883 549329453 548400650 547823143 547003899 546065750 544629593 542819557 541143532 539205055
1329.9 539205055 536888809 534884491 533012924 530918427 529316902 528195534 527681847 527101479 526757698
1338.6 526757698 526656647 526075439 525922661 525832634 525702858 525096703 524987907 525241852 525570259 526336136
1348.2 526336136 526648598 526843910 526743965 526978226 526989937 526533089 526108780 525280609 524651070 523903923
1357.9 523903923 523403358 522834015 522328873 522540817 522709007 521926346 521104622 520969543 520006485 519575539
1367.5E19575539l57285o28319J65940m235J110268P07397L63884L90397L93333P38449
1377.2E22455368k3689M29115j53885M56429J065521O58836Q26836J087913K066765
1385.8E28869209J538201J326675J411972J784973J121826O66695J139183Q13446J402970
1394.5E40075150m16146k64358J42555j34697j011620j151008j10398j088027o42472
1403.2E35398979l05595p56951o70280k45934K4567q74824q48580j315155o94237q19816
1412.8E28892174j277390n42793n74875j60522m94805J113358j129685j285133Q83141
1421.5E25423470m61770m8866r54590K21520J70440j16691Q97941J73340J121674M35753
1431.2E26862221J165237O35109M05502J151581M57077P88651j692505R39484R64164
$$ plain form
1367.5 519575539 519218254 518589935 518755875 518751640 519861908 520569305 520933189 521323586 521716919 522455368
1377.2 522455368 522431679 522860794 522706909 523163338 524228859 524887695 525714531 526802444 528869209
1385.8 528869209 530407410 531734085 533146057 534931030 536052856 536719551 537858734 538672180 540075150
1394.5 540075150 539659004 539394646 539537201 539402504 538390884 537239876 537129478 536041451 535398979
1403.2 535398979 535093384 534336433 533666153 533420219 533444786 532569962 531721382 530406227 529711990 528892174
1412.8 528892174 527614784 527071991 526497116 526336594 525841789 526955147 525825462 524540329 525423470
1421.5 525423470 524961700 524912834 523958244 524179764 524350204 524233513 525131454 525304794 526426468 526862221
1431.2 526862221 528027458 528662567 529068069 530219650 530676727 531465378 529772873 530712357 531676521
1439.8E31676521R66378J201896N56908J545410K90184M75235Q7090L70559o67305
1448.5E36502876j100502L31688q72268j23406n85365N35507M82902n15022o94771
1457.2E33961639l265495J751061r26018J108513j7662J27678J778221N0316K766952
1465.9E37335205K047348L205567J473770L173484M354706K346955M930801J345367
1473.6E60213203N068932L402710M240608L957825L715896M289170K766228L882522
1481.3E91537094J546021K906723K546234K173729L205795J758995L199959J719818
1489F10594368L980560Q49724J698418K586784J006394K159500L67202J831J990738
1497.7F25235519K139740N62592J589088K252541R3918J708221J506958K619171j99699
$$ plain form
1439.8 531676521 532642899 533844795 534401703 535947113 536237297 536712532 536799622 537170181 536502876
1448.5 536502876 535402374 535734062 534861794 534738388 534153023 534688530 535171432 534656410 533961639
1457.2 533961639 530696144 532447205 531521187 532629700 532612038 532739716 534517937 534568253 537335205
1465.9 537335205 539382553 542588120 544061890 547235374 551590080 553937035 558867836 560213203
1473.6 560213203 565282135 568684845 572925453 576883278 580599174 584888344 587654572 591537094
1481.3 591537094 593083115 595989838 598536072 600709801 603915596 605674591 608874550 610594368
1489 610594368 614574928 615424652 617123070 619709854 620716248 622875748 623242950 623244781 625235519
1497.7 625235519 627375259 627937851 629526939 631779480 631873398 633581619 635088577 637707748 637508049
1506.4F37508049o928368L331681J507759K142677J097565K104797L20511J432495
1514.1F42517166J706238p477J247559l264237L116837K393341r89456o87L91922L901291
1523.7F51012497K293396R90372p68280P17315L02887n2948J296006K71911J212387
1532.4F57275543l46832k56195J962356J125184J552963K142563K190246r485092K356339
1541.1F58517075R12704J47553K473220L09830m70734J073685J599884J138611P89642
1549.8F66491470r37423M36172J225968P15255r31778j378326K892227L985596K291107
1558.5F74790268N40924r078674K472381P14417J71051K45285j893921o75201N08575
1567.1F67795105P60727J171493j886520j160965K97394o9809k55051m5929j394424
$$ plain form
1506.4 637508049 630579681 633911362 635419121 637561798 638659363 640764160 641084671 642517166
1514.1 642517166 644223404 644215927 645463486 642199249 645316086 647709427 646719971 646719284 647111206 651012497
1523.7 651012497 653305893 654296265 653527985 654245300 654548187 654495239 655791245 656063156 657275543
1532.4 657275543 656928711 656672516 658634872 659760056 661313019 663455582 665645828 656160736 658517075
1541.1 658517075 659429779 659577332 662050552 662360382 661889648 662963333 664563217 665701828 666491470
1549.8 666491470 665554047 665990219 667216187 667931442 666999664 665621338 668513565 672499161 674790268
1558.5 674790268 675331192 666252518 668724899 669439316 669610367 669855652 667961731 667286530 667795105
1567.1 667795105 668555832 669727325 667840805 666679840 666977234 666907425 666652374 666606445 665212021
1575.8F65212021o713944O77872R61075n54657q64029j025848k98310q21304j521606
1584.5F55051270j775284j718216j643601k066269j862411k405319j543808j507111
1592.2F40529251j029625j125946k009125j530456k409287j726303k637062k855644
1599.9F25205803k253304j848945j395493k563743j760064j562538r55734j926002
1607.6F10939980j804200k476349l491630j420097k472573j666794j911163m09126
1615.4E95288048l44582o594963M10309n16014m99573j660194o71082q82072m643135
1624E79886742j005211p25708Q27751j297798j668320l10554m71459k14386q17642
1632.7E74203415L99666L94974k263909k344704J117211J47667J00021Q70896Q8958
$$ plain form
1575.8 665212021 658498077 659175949 660137024 659582367 658718338 657692490 657394180 656572876 655051270
1584.5 655051270 653275986 651557770 649914169 647847900 645985489 643580170 642036362 640529251
1592.2 640529251 639499626 638373680 636364555 634834099 632424812 630698509 628061447 625205803
1599.9 625205803 622952499 621103554 619708061 617144318 615384254 613821716 612865982 610939980
1607.6 610939980 609135780 606659431 603167801 601747704 599275131 597608337 595697174 595288048
1615.4 595288048 594943466 588348503 588758812 588242798 587743225 586083031 585411949 584529877 579886742
1624 579886742 578881531 578155823 578983574 577685776 576017456 575706902 575235443 575021057 574203415
1632.7 574203415 574603081 574998055 572734146 570389442 571506653 571654320 571754341 572625237 572714195
1641.4E72714195J459542N63583J391525J720696n83878R8648q06770J226272J250916
1650.1E79034729K736511L120423L241310j585846k21176K247810J620522J552886
1657.8E91747169J062699J273041J401825K372055K598724J184006K721596K403221
1665.5F06764336K317810K048530K908135P16209Q40378L607292J296005K485619L380089
1674.2F26364403K402611j87798L010521L560066K560692K563400M06723K061158L195877
1682.9F45937653J764907J92795J572952L402710K992402K102127K058868J367722
1690.6F61392136J433029J676712R47418K389374K505569k509842L014679L047409
1698.3F73896484L681107K988586m481964K093430K344818J291122q06274N91049n05752
$$ plain form
1641.4 572714195 574173737 574737320 576128845 577849541 577265663 577364311 576557541 577783813 579034729
1650.1 579034729 581771240 584891663 588132973 586547127 586325951 588573761 590194283 591747169
1657.8 591747169 592809868 594082909 595484734 597856789 600455513 601639519 604361115 606764336
1665.5 606764336 609082146 611130676 614038811 614755020 615595398 619202690 620498695 622984314 626364403
1674.2 626364403 628767014 628579216 631589737 635149803 637710495 640273895 640680618 642741776 645937653
1682.9 645937653 647702560 647895355 649468307 652871017 655863419 657965546 660024414 661392136
1690.6 661392136 662825165 664501877 665449295 667838669 670344238 667834396 670849075 673896484
1698.3 673896484 677577591 680566177 676084213 678177643 680522461 681813583 681007309 681598358 681092606
1707F81092606N90896K109833J060410P9345P55768J477737J067734k98919n48401
1715.6F87387009K107238J016541n258942R81980J742019J667252J276169R09576L57285
1724.3F92186127N42984N83496j80359L85513O51245m37240k43302J915894K455749
1733F97860107j534805k798614K800064K638931J075668J822968K91138k722550K063522
1741.7G01496429J843567R2621R93958K480621J673584J113663K057190M23813K268524
1750.4G14443970L77731n67551K647477J444549J485520K207336O14243J021881K124939
1759G25800095J551284K315751J79748j301269J610946Q57697M62417J310807J913299
1767.7G34700775o62002R48104K834778R18579m2266j969071J713791J443253j006012
$$ plain form
1707 681092606 681683502 683793335 684853745 684933090 685688858 687166595 688234329 687935410 687387009
1715.6 687387009 689494247 690510788 685251846 686233826 687975845 689643097 690919266 691828842 692186127
1724.3 692186127 692729111 693312607 693132248 693517761 694169006 693731766 693488464 695404358 697860107
1733 697860107 696325302 693526688 696326752 698965683 700041351 701864319 702155457 699432907 701496429
1741.7 701496429 703339996 703432617 704426575 706907196 708580780 709694443 711751633 712175446 714443970
1750.4 714443970 714821701 714254150 716901627 718346176 719831696 722039032 722653275 723675156 725800095
1759 725800095 727351379 729667130 729846878 728545609 730156555 731014252 731476669 732787476 734700775
1767.7 734700775 734038773 734986877 737821655 738740234 738697968 736728897 738442688 739885941 738879929
1776.4G38879929N58700L25928J266937R83277O2103O81457J054230J115723m26789
1785.1G44501495n03997L26919P99103O68487J153870P82013L86353r003m44183K091064
1794.7G49752121Q16116m93393M89884J143875J9455j602936J244354L67661O80160
1803.4G52417297J278611N84030R73739K61917j99050o3935Q11692r82056o58188Q73489
1813G55297546L63465J139145P81173J058197K58179r8877L04947m00925J52054m07867
1822.7G58447037P19986J007766r44900n3482Q98666J554337J141815j537323o26144
1831.4G60607758Q67767k72827l32489J83792J36871K89002n4627J044846O39114M09470
1841G63518677p782N82733J145019l931427K77176R19953m80500j56402P07245J169662
$$ plain form
1776.4 738879929 739438629 739764557 741031494 742014771 742076874 742758331 743812561 744928284 744501495
1785.1 744501495 743997498 744324417 745123520 745792007 746945877 747727890 748114243 748105240 747661057 749752121
1794.7 749752121 750568237 750074844 750564728 751708603 751728058 750125122 751369476 751737137 752417297
1803.4 752417297 753695908 754279938 755253677 755515594 755316544 755252609 756064301 755082245 754424057 755297546
1813 755297546 755661011 756800156 757581329 758639526 758897705 758798828 759103775 758702850 758854904 758447037
1822.7 758447037 759167023 760174789 759229889 759176407 760075073 761629410 762771225 761233902 760607758
1831.4 760607758 761475525 761202698 760870209 761054001 761190872 761479874 761425247 762470093 763109207 763518677
1841 763518677 763510895 764093628 765238647 761307220 761584396 762504349 762023849 761867447 762574692 763744354
1850.7G63744354L38288O85653k83355k54822J15433j41221J95694n40771j36185k1286
1860.3G63701782L08304J43356M55094N82428n0583N23224n12238n8288l79258j158447
1869.9G63555374J64032M04282R04312M09775M10537L38288K25143j86462k62070l15094
1879.6G65648117o87866M58450M4556L19214N62973J63040M44565J13983Q83179P4920
1889.2G68025131j545868k11639N97305p8964m3106K04697l59040R16443N92041K52075
1898.9G68349075J47171l45382O5994l13034o0043l59879k58408J57395J78146L65677
1908.5G67926712L64304J55792n11093M22363Q2932j88981k90527m70962Q15124j051559
1918.2G67254105n94788J286545J112518Q55637o42853r81522J37558L86277k83204
$$ plain form
1850.7 763744354 764082642 764768295 764484940 764230118 764345551 764204330 764400024 763859253 763723068 763701782
1860.3 763701782 764010086 764153442 764608536 765190964 765140381 765663605 765151367 765093079 764713821 763555374
1869.9 763555374 763719406 764123688 765028000 765437775 765848312 766186600 766411743 766225281 765963211 765648117
1879.6 765648117 764960251 765418701 765463257 765782471 766345444 766508484 766953049 767067032 767950211 768025131
1889.2 768025131 766479263 766267624 766864929 766785965 766742859 766947556 766588516 767504959 768097000 768349075
1898.9 768349075 768496246 768150864 768216858 767903824 767843781 767483902 767225494 767382889 767561035 767926712
1908.5 767926712 768291016 768446808 767935715 768358078 768441010 768252029 767961502 767490540 768305664 767254105
1918.2 767254105 766659317 767945862 769058380 769914017 769271164 768289642 768427200 768813477 768530273
1926.8G68530273m14886l10898J79215L24173J9607M64020K05917L37372j46027k33612
1936.5G68955154j87912m37393K84729j32370N97077N19256j170807k98309P59735
1945.2G68889160P15180l30353j54267m88662n39704N722K12174J95007P3929P20825
1954.8G69299011M57306L79639k0905j74560n5542l20130j07345q29087k17361L41415
1964.5G68752441O78635J084137q8730m14352J1215J80206m69131j66626q0872n03082
1974.1G68983841J44577K34528L21884K26898O11420K72598K2125K32926m47083l32184
1983.7G70271530n64575k69241r2545L9749L23944K4414N50766K85492O0959j39313
1993.4G70491180k72750k29187k49558j13296k89231N1880j00784J95617L35160K15988
$$ plain form
1926.8 768530273 768115387 767804489 767983704 768307877 768327484 768791504 768997421 769334793 769188766 768955154
1936.5 768955154 768767242 768329849 768614578 768482208 769079285 769598541 768427734 768129425 768889160
1945.2 768889160 769604340 769273987 769119720 768631058 768091354 768097076 768309250 768504257 768578186 769299011
1954.8 769299011 769756317 770135956 770115051 769940491 769884949 769564819 769457474 768628387 768411026 768752441
1964.5 768752441 769431076 770515213 770426483 770012131 770023346 770203552 769734421 769567795 769486923 768983841
1974.1 768983841 769128418 769362946 769684830 769911728 770523148 770795746 770817871 771050797 770603714 770271530
1983.7 770271530 769706955 769437714 769345169 769384918 769708862 769733276 770284042 770569534 770630493 770491180
1993.4 770491180 770218430 769989243 769739685 769626389 769337158 769389038 769288254 769483871 769819031 770035019
2003G70035019M18396L891L9062k59704l49198o53610n12008j63193k25907M90570
2012.7G68823318K61994J38550J33056m9514m30069m13437j36032p31583n50079m37928
2022.3G66608276K52304O83060L67661M5700l04642K59781m33121n53360r9106l20358
2032G66506195n72433m93699J59836l07769P6980L27683j65863n4398J85394m8675
2041.6G65613251q01392l49426m58222J0987K60086r3003M87977J68914M28467r155
2051.2G65258484l98483k34604m67758k72675m46320J15586R1705j9226L60641O20957
2060.9G64608307L96194l32870J18713j40228m81720j59531n035n7678k72370J04676
2070.5G63778458L69262N19562K03323L07236k289o65130l63159k17743P9879j09024
$$ plain form
2003 770035019 770453415 770457306 770496368 770236664 769887466 769233856 768721848 768558655 768332748 768823318
2012.7 768823318 769085312 769223862 769356918 769307404 768877335 768463898 768327866 767596283 767046204 766608276
2022.3 766608276 766860580 767543640 767911301 767957001 767652359 767912140 767479019 766925659 766826553 766506195
2032 766506195 765933762 765440063 765599899 765292130 765369110 765696793 765530930 765476532 765661926 765613251
2041.6 765613251 764811859 764462433 764004211 764015198 764275284 764182281 764670258 764839172 765267639 765258484
2051.2 765258484 764860001 764625397 764157639 763884964 763438644 763554230 763645935 763626709 763987350 764608307
2060.9 764608307 765004501 764671631 764790344 764650116 764168396 764008865 764003830 763946152 763673782 763778458
2070.5 763778458 764147720 764667282 764870605 765177841 765175552 764510422 764147263 763929520 764009399 763900375
2080.2G63900375N7526K88239K75726N73959M60282L14102m53568p07092l50800J27716
2089.8G64486465p4234l83377M67224N15214K37808j83029J14746M52957l30506k88086
2099.5G65015182k4414M1962j47171k87933p6905L98713M50363K07977M26025M28467
2109.1G66432266L06320n20477o36139l60107l99857j5335j2207L63693L56903L54844
2118.7G65869904K30560O5918J13067k17742j01777o38885k55203K33001L06J51596
2128.4G65450745L8910L18985J21459R2774k29J24359J05896q17718n29633L0289K10190
2139G65146027%K77328L44010J90124N32379j39923j4954J06125l49350n21316m35639
2149.6G65134811r5977j30310M63638P57980K69699q9035K03095J27563j09024R7122
$$ plain form
2080.2 763900375 763957901 764246140 764521866 765095825 765556107 765870209 765416641 764709549 764358749 764486465
2089.8 764486465 764412231 764028854 764496078 765011292 765249100 765066071 765180817 765633774 765303268 765015182
2099.5 765015182 764990768 765032730 764885559 764597626 764520721 764919434 765369797 765577774 766003799 766432266
2109.1 766432266 766738586 766218109 765581970 765221863 764822006 764806671 764794464 765158157 765515060 765869904
2118.7 765869904 766100464 766166382 766279449 766061707 765959930 765321045 765065842 765298843 765299149 765450745
2128.4 765450745 765489655 765808640 765930099 766022873 766022644 766147003 766252899 765435181 764905548 764935837 765146027
2139 765146027 765146027 765423355 765767365 765957489 766489868 766349945 766334991 766441116 766091766 765570450 765134811
2149.6 765134811 765038834 764908524 765372162 766130142 766399841 766310806 766513901 766641464 766532440 766629562
2159.3G66629562l67660n13306m57840J93863L10822K95486Q04978K59094M32129K72674
2168.9G67859802j46255m69589m44642j5945j94473M12674K55661K98767O89392O88705
2178.5G68934097N65567o0882K46124o7825l51639j95389K2507K44751j10016q2855
2188.2G69144440J38931N54428K19116L33939L52630k3880K36817l18604l61404l36075
2197.8G69940338K14920O82526L13949K88468Q6212M17175K59934Q1405K5483j62201
2207.5G72148209l23334j36032M28238j98136J00174K92435J32370M64706K29111J51978
2217.1G73289719k82822j00098J6556J29166K17972p2403J53961K03857L79715j90353
2226.8G73745270l09220J34812J59683M6082j74485J91727O4240J76239M03518K42539
$$ plain form
2159.3 766629562 766261902 765748596 765290756 765484619 765795441 766090927 766895905 767154999 767587128 767859802
2168.9 767859802 767713547 767243958 766799316 766783371 766588898 767001572 767257233 767556000 768245392 768934097
2178.5 768934097 769499664 769438782 769684906 769617081 769265442 769070053 769092560 769337311 769227295 769144440
2188.2 769144440 769283371 769837799 770056915 770390854 770743484 770719604 770956421 770637817 770276413 769940338
2197.8 769940338 770155258 770837784 771151733 771440201 771526413 771943588 772203522 772284927 772310410 772148209
2207.5 772148209 771824875 771688843 772117081 771918945 772019119 772311554 772443924 772908630 773137741 773289719
2217.1 773289719 773006897 772906799 772923355 773052521 773270493 773198090 773352051 773555908 773935623 773745270
2226.8 773745270 773436050 773570862 773730545 773776627 773602142 773793869 773858109 774034348 774437866 774680405
2236.4G74680405O179O0807K7771l90396r8420l61404J58920J60828m07562J00021
2246G73937149L17612R88464J21842l47443j41831l75671P3700k34222j58997l04565
2255.7G73876038P6980M31519M85000P65839J92108R7885m88968k43301J02158l66898
2265.3G74928360l06091j42975L17764K30789J37101r7046K60391M42810N4245j02539
2275G75722809n32303j65253j84250K04239p0266j73798O06766J73797M97513M7455
2284.6G76126709Q1863J60599o38122l95585l21197K52075O2866J07117P7972r9716
2294.3G75414581N48401m2419m22364k17208K37808p7820l82309k38419j03607M38843
2303.9G75155487J26648K01721j62887k79541q6213K2278J05667o10962M22669L16162
$$ plain form
2236.4 774680405 774686584 774747391 774775162 774384766 774286346 773924942 774083862 774244690 773837128 773937149
2246 773937149 774254761 775243225 775365067 775017624 774875793 774500122 774573822 774339600 774180603 773876038
2255.7 773876038 773953018 774384537 774869537 775635376 775827484 775925369 775436401 775193100 775295258 774928360
2265.3 774928360 774622269 774479294 774797058 775027847 775164948 775067902 775328293 775771103 775825348 775722809
2275 775722809 775190506 775025253 774841003 775045242 774974976 774801178 775407944 775581741 776079254 776126709
2284.6 776126709 776208572 776369171 775731049 775335464 775014267 775266342 775329208 775436325 775514297 775414581
2294.3 775414581 775962982 775920563 775498199 775280991 775518799 775440979 775058670 774820251 774716644 775155487
2303.9 775155487 775282135 775483856 775320969 775041428 774955215 774977493 775083160 774472198 774894867 775211029
2313.5G75211029M044P5378n92041j69830m22898j93023n4779J21536k80075o41251
2323.2G73058090q1405l28446J93100K27203K79313k12555j39466o96487r97543Q74023
2332.8G72175827L46298P54853j13831j584473l00674P86590M11835l14865N48401
2341.5G72709961j073074j592865q12989R2850J264801J18179O08521J398086R94034
2350.2G73707504j057815j105271N19486n69611m12979l39966j287079o82678R21936
2358.9G69693527p88040j293259M77066O29960J067886q49533j02768M69665J71891
2367.6G69476395j61667Q926J694107r98764q12683M66004k79007J40380N27420J005707
2377.2G71066818r6283n47485k83814m64096n34668k74963K28043J55258L54233R2010
$$ plain form
2313.5 775211029 775215073 775290451 774698410 774528580 774105682 773912659 773857880 773979416 773699341 773058090
2323.2 773058090 772976685 772648239 772841339 773068542 773347855 773135300 772995834 772299347 771301804 772175827
2332.8 772175827 772522125 773276978 773163147 771578674 771278000 772064590 772476425 772161560 772709961
2341.5 772709961 771636887 770044022 769231033 769323883 770588684 770706863 771315384 772713470 773707504
2350.2 773707504 772649689 771544418 772063904 771494293 771081314 770741348 769454269 768771591 769693527
2358.9 769693527 768905487 767612228 768089294 768719254 769787140 768937607 768834839 769304504 769476395
2367.6 769476395 769314728 769323654 771017761 770018997 769206314 769672318 769393311 769533691 770061111 771066818
2377.2 771066818 770970535 770423050 770139236 769675140 769140472 768865509 769093552 769248810 769603043 769695053
2386.8G69695053J33438K00806j63574K5253m53796o19889l08761K6703k3423j27029
2396.5G68384781J22757j08261k213J03150O4010k17438m76150l11508j11695k23617
2406.1G67223816l59268J87988p8659l50723q7509J58462K12174l95356l14254l70789
2415.8G65825882l16238o8284l66516l72467k04467J74789J62659j89972n37720n01556
2425.4G63606110l23029k64511j42670k48337J19935K1514l03726M654n3634m07639
2435.1G62008667j21536J25732n68466n74341l39889n29633n27649k23923M2115l0823
2444.7G59260254K65121L4638k24610l00979m30298n47943r14002n02700n6229M12750
2454.3G56996002P0114l12194J82876j43204k24685k13013l35007n23300m74243l79028
$$ plain form
2386.8 769695053 769828491 770029297 769865723 769890976 769437180 768817291 768508530 768535233 768511810 768384781
2396.5 768384781 768507538 768399277 768397064 768500214 768564224 768346786 767870636 767559128 767447433 767223816
2406.1 767223816 766864548 767052536 766973877 766623154 766535645 766694107 766906281 766510925 766196671 765825882
2415.8 765825882 765509644 765441360 765074844 764702377 764497910 764672699 764835358 764645386 764107666 763606110
2425.4 763606110 763283081 763018570 762875900 762627563 762747498 762769012 762465286 762469940 762416306 762008667
2435.1 762008667 761887131 762012863 761444397 760870056 760530167 760000534 759472885 759248962 759291077 759260254
2444.7 759260254 759525375 759560013 759335403 759034424 758604126 758056183 757142181 756639481 756583252 756996002
2454.3 756996002 757066116 756753922 756936798 756793594 756568909 756355896 756020889 755497589 755023346 754644318
2464G54644318p93076m11682L43323M68063m3564J98364J51902l66745n79377q89205
2473.6G52722321l04337n20172m92706k40784k96173K39639L3493M99115O83594J95770
2483.3G52519760o39801r63211j66092m47998o43616o14318l03040j7853K7008M30451
2492.9G49181290M30298J43585l11508j27182n74036o38275p3700m09165k7923P3852
2502.6G47667236n9204m654L73001K44904n16892o7291k41165q27103m64019r308l98178
2513.2G45697327l65677L38821J77384J08490J26495M1962m08631n57022k10724r2849
2522.8G44855576m2191m97208m57458m04434N6076N25818j3733k84348o23855l75061
2532.5G42739182r8420j59454k80762n42679k59323m6920j05057j40610J38016k06604
$$ plain form
2464 754644318 753851242 753439560 753782883 754250946 754207382 754405746 754557648 754190903 753611526 752722321
2473.6 752722321 752417984 751897812 751405106 751164322 750868149 751107788 751141281 751640396 752323990 752519760
2483.3 752519760 751879959 750916748 750750656 750302658 749659042 749044724 748741684 748723831 748750839 749181290
2492.9 749181290 749611588 749755173 749443665 749316483 748742447 748104172 748030472 747621307 747593384 747667236
2502.6 747667236 747608032 747603378 747976379 748221283 747704391 747637100 747395935 746568832 746104813 746095505 745697327
2513.2 745697327 745331650 745670471 745847855 745956345 746082840 746124802 745716171 745159149 744948425 744855576
2522.8 744855576 744813385 744316177 743858719 743454285 743510361 744036179 744022446 743738098 743114243 742739182
2532.5 742739182 742640762 742481308 742200546 741657867 741398544 741351624 741246567 741105957 741243973 741037369
2542.1G41037369n64118m20150k84424k10724n80444j02082p705k35901J6708m7836
2551.7G38600693R7427r9029n76477q34427k47498j21384n63736n03311o0196M55323
2561.4G36147385k39716k51541p5989l36532k73819m56925k77328m96064k15530k12784
2571G33311157n05523j86692P2327N02167J39999k99683n93948k16751k81830q53653
2580.7G31087570k61841l23867n05372l13568K43531Q7738p7515J85699n38406o6910
2590.3G29517059N4932m98123o88324l20740L4866o44912q8501L49426K59399J4801
2600G27989883l48281l77045l30353n4092o58799k59933Q392m88205m35409n32150
2609.6G24514008N6381K65732J78756k42386n35583o82526q75854k68097l19367k69928
$$ plain form
2542.1 741037369 740473251 740053101 739768677 739557953 738977509 738875427 738867722 738631821 738648529 738600693
2551.7 738600693 738698120 738599091 738022614 737188187 736940689 736819305 736255569 735752258 735692062 736147385
2561.4 736147385 735907669 735656128 735580139 735243607 734969788 734512863 734235535 733739471 733523941 733311157
2571 733311157 732805634 732618942 732691269 733193436 733333435 733033752 732439804 732223053 731941223 731087570
2580.7 731087570 730825729 730501862 729996490 729682922 729926453 730014191 729936676 730122375 729583969 729517059
2590.3 729517059 729571991 729073868 728385544 728064804 728099670 727454758 727366257 727715683 727975082 727989883
2600 727989883 727641602 727264557 726934204 726880112 726221313 725961380 725969772 725481567 725046158 724514008
2609.6 724514008 724570389 724836121 725014877 724772491 724236908 723554382 722678528 722410431 722091064 721821136
2619.3G21821136k98767k93884j90353l41797j4954j11236l12577r59396r34525k57339
2628.9G18106308k17514j91727l40042l78494l70560j50833l31497l40958j85241o91681
2638.5G14907761q48923r92127n84335j48392j69067j55258k06452m00085n86777l64990
2648.2G10451355n70374n07507p88116q56018o409j62048k05231j33896l90930o10886
2657.8G06219940n50995o42471o53763m425l60489n83725m62265m29916j00021j79215
2667.5G02252655k26135k00424j20774l20587l08380m36630o02341j08261j67008n49926
2677.1F99212189o39801j73264l3035l57132p21665o14624j96991n78536l68577l49655
2686.8F95178909m32205k16751l95584j18561J03455J5869p95288n65491L5324j87988
$$ plain form
2619.3 721821136 721522369 721228485 721038132 720696335 720681381 720570145 720257568 719298172 718363647 718106308
2628.9 718106308 717888794 717697067 717357025 716978531 716607971 716457138 716125641 715784683 715599442 714907761
2638.5 714907761 714058838 713066711 712482376 712333984 712164917 712009659 711803207 711403122 710816345 710451355
2648.2 710451355 709880981 709373474 708585358 707729340 707722931 707560883 707355652 707221756 706830826 706219940
2657.8 706219940 705668945 705026474 704372711 704368286 704007797 703424072 702961807 702531891 702431870 702252655
2667.5 702252655 702026520 701826096 701705322 701384735 701076355 700639725 700037384 699929123 699762115 699212189
2677.1 699212189 698572388 698399124 698366089 698008957 697287292 696672668 696475677 695897141 695528564 695178909
2686.8 695178909 694746704 694529953 694134369 694015808 694119263 694135132 693339844 692774353 692809677 692621689
2696.4F92621689j63117p09838l58048l08533o98776m31900m31747o1875j65252m43345
2706F88849258o58722m67071k17667o61239o89163l49427J56327l01590r25980n70831
2715.7F84163895k33231J56937R2163p43485q20617p6752k15912l47443j87835j72882
2725.3F81614838q2856o93817p88574j11999j06736n02700m30375l75213k22168j75247
2735F78125153l51181L128l38822l86734m28314l89481M03290n35736p22809J10626
2744.6F75489120M3335R1324j85547o83212o96335l02734l67966l74145k29111n2948
2754.3F72731781j29852n35813j84860k15607l96423m37317j65481J93176j2207J52130
2763.9F70999527k42233l24250j52664m38461k77100m59747o14014p5073R4452n42526
$$ plain form
2696.4 692621689 692458572 691748734 691390686 691082153 690383377 689951477 689519730 689457855 689292603 688849258
2706 688849258 688190536 687723465 687505798 686844559 686155396 685805969 685962296 685660706 684734726 684163895
2715.7 684163895 683930664 684087601 684179764 683436279 682615662 682538910 682322998 681975555 681787720 681614838
2725.3 681614838 681531982 680838165 680049591 679937592 679830856 679328156 678897781 678522568 678300400 678125153
2735 678125153 677773972 677777100 677438278 677051544 676623230 676233749 676637039 676101303 675378494 675489120
2744.6 675489120 675532455 675623779 675438232 674755020 674058685 673755951 673387985 673013840 672784729 672731781
2754.3 672731781 672601929 672066116 671881256 671665649 671269226 670831909 670666428 670859604 670847397 670999527
2763.9 670999527 670757294 670433044 670280380 669841919 669564819 669105072 668491058 668415985 668510437 667967911
2773.5F67967911k38877l33252r20562j36032p2556k40707j80054k52380o4164m54712
2783.2F65074615p65151k44370q9951o62689m76684n08805n53436k75650q84018q54721
2792.8F59759140j06049n2948q17489n69611j98211q79593o15387k85340p41348j267242
2802.5F54225922q00171m06418q74100n90591k92511l08609o58875j037674q23135
2811.2F48433838o30341r14001j122437r37194j024552o51245n88989p65915m85687
2819.8F41313477q19397p42417n98945j092263j496734j215172p49054q13141p70302
2828.5F33016052q54759r47418j033364j202392j268311j223182p97043p61566j187439
2837.2F23740578j312065j570855k181244j759529j049499j237488j391220j567078
$$ plain form
2773.5 667967911 667729034 667395782 666475220 666339188 666266632 666025925 665845871 665593491 665529327 665074615
2783.2 665074615 664309464 664065094 663975143 663312454 662835770 662326965 661773529 661497879 660613861 659759140
2792.8 659759140 659653091 659600143 658782654 658213043 658014832 657135239 656519852 656234512 655493164 654225922
2802.5 654225922 653425751 653019333 652145233 651554642 651262131 650953522 650294647 649256973 648433838
2811.2 648433838 647803497 646889496 645767059 644829865 643805313 643154068 642565079 641799164 641313477
2819.8 641313477 640494080 639751663 639152718 638060455 636563721 635348549 634599495 633786354 633016052
2828.5 633016052 632161293 631213875 630180511 628978119 627709808 626486626 625689583 624928017 623740578
2837.2 623740578 622428513 620857658 618676414 616916885 615867386 614629898 613238678 611671600
2844.9F11671600j798210k111130k240753k054443j893425j859322j636238j090965
2852.6E96987114j423950j292839n10712n19905p50847j059799p21550m62837r44023
2861.3E89300652j159783r19647j232681j675415j115342j238784j756249k010078
2869E78192673k005539j495552j502304j560936k205696k602539j785126j369171j321450
2877.7E62344360j440277j761665j952477j467361r61342j185036j353073j415481
2885.4E50807648j076012n89256n29213n08919l97491k44713l22190o80999r79767
2894.1E45479088o59790j71318l56446n56640m52156j16387K79007j81465m73709l47786
2903.7E42442398r38225r91745r18503j018447p73621j068649r10302p50045j492043
$$ plain form
2844.9 611671600 609873390 607762260 605521507 603467064 601573639 599714317 598078079 596987114
2852.6 596987114 595563164 594270325 593759613 593239708 592488861 591429062 590707512 590244675 589300652
2861.3 589300652 588140869 587221222 585988541 584313126 583197784 581959000 580202751 578192673
2869 578192673 576187134 574691582 573189278 571628342 569422646 566820107 565034981 563665810 562344360
2877.7 562344360 560904083 559142418 557189941 555722580 554761238 553576202 552223129 550807648
2885.4 550807648 549731636 549142380 548613167 548104248 547706757 547462044 547139854 546458855 545479088
2894.1 545479088 544819298 544647980 544291534 543734894 543282738 543166351 543445358 543263893 542790184 542442398
2903.7 542442398 541504173 540512428 539593925 538575478 537801857 536733208 535822906 535072861 533580818
2912.4E33580818j682129j210861j218910j561508j946221k362137k018776j825256
2920.1E19755020j916656j383667j164055j078491q80433o34689j0109Q6556l54958
2928.8E12418518k66800p7820J13945N53055Q32558J209984J335830J628685J813736
2937.5E19561691J477814J720123K001610K292557K396812K209969J883087J995697
2945.2E35539360K664490K090263J758156K115288K395935K521629J938057J609612
2952.9E52632790J499786K013397K530747K020950J591072K126007K075043J478386
2960.6E67968178K280807K520218K100868J717377J435928J517601J370697J704827
2968.3E82616501J892891K079544J861381J677170J751404J395874J464119J186714
$$ plain form
2912.4 533580818 531898689 530687828 529468918 527907410 525961189 523599052 521580276 519755020
2920.1 519755020 517838364 516454697 515290642 514212151 513331718 512697029 512686920 512773476 512418518
2928.8 512418518 512151718 512073898 512187843 512740898 513573456 514783440 516119270 517747955 519561691
2937.5 519561691 521039505 522759628 524761238 527053795 529450607 531660576 533543663 535539360
2945.2 535539360 538203850 540294113 542052269 544167557 546563492 549085121 551023178 552632790
2952.9 552632790 554132576 556145973 558676720 560697670 562288742 564414749 566489792 567968178
2960.6 567968178 570248985 572769203 574870071 576587448 578023376 579540977 580911674 582616501
2968.3 582616501 584509392 586588936 588450317 590127487 591878891 593274765 594738884 595925598
2976.1E95925598J469383J370240J158142J890259J451873R58672Q37631Q17680J003418
2984.7F06882896J316910J234970Q77343Q05587O74744J209717Q33511M16641O88782
2993.4F14941101K24991J95999L76167O88630M84199M5052K4566J08986L70636j22681
3003.1F17337646j26304L31917j41831l33633M2763k00921m41703j99242k30675m01725
3012.7F15636292q18329o63262k90184l34320l04756n47028n33371n33065o94275o09818
3022.4F10307884q01086j150971j088371j012459p31430j73225l59726l28255p12089
3031F03950272j645317j062394l56712r22775j373482r59778j127090r91822n65757
3039.7E94945145n80674o61926j165924r66339j028748r83696q59489j108437q19244
$$ plain form
2976.1 595925598 597394981 598765221 599923363 601813622 603265495 604224167 605061798 605879478 606882896
2984.7 606882896 608199806 609434776 610312119 611117706 611792450 613002167 613835678 614252319 614941101
2993.4 614941101 615166092 615362091 615738258 616426888 616911087 616956139 616980705 617089691 617460327 617337646
3003.1 617337646 617211342 617543259 617401428 617067795 617110558 616909637 616467934 616268692 616038017 615636292
3012.7 615636292 614817963 614154701 613864517 613530197 613225441 612678413 612145042 611611977 610917702 610307884
3022.4 610307884 609506798 608355827 607267456 606254997 605523567 605350342 604990616 604662361 603950272
3031 603950272 602304955 601242561 600885849 599963074 598589592 597629814 596502724 595510902 594945145
3039.7 594945145 594364471 593702545 592536621 591570282 590541534 589557838 588698349 587589912 586770668
3048.4E86770668j398621j283721p61681q79746j325225j357003n15175r48753j302338
3057.1E76998405j334266j288948j029396r28994m97894r67750j026040r26399r56001
3065.7E68042717q76122j428604j382217j299324r92470p21779r66339j285438j340638
3074.4E57749786q85772n41382l98827q17756j378556j585388j110268j152000j465416
3083.1E48414421p95746j049766j083451q09135j055069o78940m60205j026993j676330
3091.8E39778786j221466p90291j097565j596680j390304o35147p41310r18274j198654
3100.5E30189095r95865o35949j069030j286736j247291j068612j083488j152039j113853
3109.1E20536232j109276j031418k96669l31268j245613q60405j388016j749153q88176
$$ plain form
3048.4 586770668 585372047 584088326 583326645 582446899 581121674 579764671 579249496 578300743 576998405
3057.1 576998405 575664139 574375191 573345795 572416801 571918907 570951157 569925117 568998718 568042717
3065.7 568042717 567166595 565737991 564355774 563056450 562063980 561342201 560375862 559090424 557749786
3074.4 557749786 556864014 556322632 555923805 555106049 553727493 552142105 551031837 549879837 548414421
3083.1 548414421 547618675 546568909 545485458 544676323 543621254 542942314 542482109 541455116 539778786
3091.8 539778786 538557320 537767029 536669464 535072784 533682480 533047333 532306023 531387749 530189095
3100.5 530189095 529193230 528557281 527488251 526201515 524954224 523885612 522802124 521650085 520536232
3109.1 520536232 519426956 518395538 518098869 517767601 516521988 515661583 514273567 512524414 511636238
3117.8E11636238j097336j514549q87604j74904j298141j447678m94690n97419q62923
3126.5E03260994j256676j183433j408119j186104q83065j046447q64487q78792p99866
3135.2D93754005j122055q03718p95250r32961o82907j165619q33397r69123r75647
3143.9D85473328r56574j265488r84954j159630q72040j149750r59816l89785j074105
3152.5D76661186j084289q93555j049881j021767p70187p49168o86455n40314o91032
3161.2D69174538j065407j481552j118775p76825q15658q73184p31697j016694j049690
3169.9D60245056l17154o31904q50068j080932j206055j019440n77278j00555j275902
3178.6D53185768j147690o85196q79364o72950p95441n85365j068268p96700p41272
$$ plain form
3117.8 511636238 510538902 509024353 508136749 507961845 506663704 505216026 504721336 504123917 503260994
3126.5 503260994 502004318 500820885 499412766 498226662 497343597 496297150 495432663 494553871 493754005
3135.2 493754005 492631950 491828232 491032982 490100021 489417114 488251495 487418098 486448975 485473328
3143.9 485473328 484516754 483251266 482266312 481106682 480234642 479084892 478125076 477735291 476661186
3152.5 476661186 475576897 474683342 473633461 472611694 471841507 471092339 470405884 469865570 469174538
3161.2 469174538 468109131 466627579 465508804 464731979 463916321 463043137 462311440 461294746 460245056
3169.9 460245056 459927902 459295998 458445930 457364998 456158943 455139503 454562225 454461670 453185768
3178.6 453185768 452038078 451352882 450473518 449800568 449005127 448419762 447351494 446554794 445813522
3187.3D45813522r82170k94876o41250p59621r05152j017608q47130q87756n69039
3195.9D38908920k95372n63888j133080q99277r53674j001510q53425r33647n16815
3204.6D31758232k43950j26533n78270p98836o45714p35359r04045q60558l46946o28472
3214.3D25889549o92596p07092r17740n01671l15285m13093p56913n83343o46363q46633
3223.9D19508820p52907o14662l33290r60503q34618j63574k61421m63982q63113q47740
3233.5D13413010l84674n39666q41560n42297o35758m16450l91236q63571m75426j12342
3243.2D08210030m8447r21593q80813l32909r87740n36994n8480k54745o43807n37643
3252.8D03006859q1711m37317o69289o91871o31714n68047k97432n48095q40225n12009
$$ plain form
3187.3 445813522 444831352 444536476 443895226 443135605 442230453 441212845 440365715 439477959 438908920
3195.9 438908920 438613548 438049660 436916580 436017303 435063629 434062119 433208694 432275047 431758232
3204.6 431758232 431514282 431387749 430809479 430010643 429364929 428629570 427725525 426864967 426518021 425889549
3214.3 425889549 425196953 424489861 423572121 423070450 422755165 422342072 421585159 421001816 420355453 419508820
3223.9 419508820 418755913 418141251 417807961 416847458 416012840 415849266 415587845 415123863 414260750 413413010
3233.5 413413010 413028336 412488670 411647110 411104813 410469055 410052605 409661369 408797798 408322372 408210030
3243.2 408210030 408161583 407239990 406359177 406026268 405038528 404501534 404443054 404188309 403544502 403006859
3252.8 403006859 402925148 402487831 401818542 401126671 400494957 399926910 399629478 399081383 398241158 397729149
3262.5C97729149o01654j03836J95465k44751q38967j060676n80826l63274l11546
3271.2C93819084k02713j22490m64401j27525r5826r32006l27340k06565q78296o00357
3280.8C89861565O065j44615n08118l02811l33976m71993m95567k42157j8845j31302
3290.4C87218246n16395p68051q59375p23610K10037L1891k84119k7084j51482k34184
3300.1C83895874o04744j30882k32887p31316o18134p03392m03022l82042k12784l24669
3309.7C79552002m38271l97148m99649j58958m67339n05104j99928k75078r44862r07021
3319.4C74758644o4850k48871j66130l11699k66037m2457o34461o03523m85496n49584
3329C71385536o97212o11877o43769m73404K1363l03841k75765o06536r07250j00097
$$ plain form
3262.5 397729149 397127495 397023659 397219124 396974373 396135406 395074730 394493904 394130630 393819084
3271.2 393819084 393616371 393493881 393029480 392901955 392806129 391874123 391546783 391340218 390461922 389861565
3280.8 389861565 389867630 389723015 389214897 388912086 388578110 388106117 387610550 387368393 387349548 387218246
3290.4 387218246 386701851 385933800 385074425 384350815 384560852 384592743 384308624 384281540 384130058 383895874
3300.1 383895874 383291130 383160248 382927361 382196045 381577911 380874519 380471497 380089455 379876671 379552002
3309.7 379552002 379113731 378716583 378216934 378057976 377590637 377085533 376885605 376610527 375665665 374758644
3319.4 374758644 374693794 374444923 374278793 373967094 373701057 373658600 373024139 372420616 371935120 371385536
3329 371385536 370688324 370076447 369432678 368959274 368980637 368676796 368401031 367794495 366887245 366787148
3338.7C66787148M4326l69835m68177l94936o49033r19761o54602l75099n04494l16086
3348.3C62179451k9564K0142j66054q92601j053200q37211o56891o96297l75061K45819
3357.9C57738533o44493p72705p1488l09600l94288m18472l72429m23126p19109j037445
3367.6C52575378q38737M3068K22282k31552K1401j72348j026688m26064l61747j068650
3377.2C48736343m68521J3199j86272n81207k94723J07612k65426n16053n70144k89536
3386.9C45685272j87721m02641j01090O8131j45302m53453n56450o8932j45988l96347
3396.5C43295479m61464n71938n3291j7014r0293l22609k98767K28042k61459j50681
3406.2C41296005j35078p706J57890o98585o20728p6561M33922k89383n74989M47197
$$ plain form
3338.7 366787148 366831474 366461639 365993462 365598526 364949493 364029732 363375130 363000031 362495537 362179451
3348.3 362179451 362149887 362170029 362003975 361111374 360058174 359220963 358564072 357867775 357492714 357738533
3357.9 357738533 357094040 356321335 356249847 355940247 355545959 355127487 354755058 354331932 353612823 352575378
3367.6 352575378 351736641 351779709 352001991 351770439 351791840 351619492 350592804 350166740 349804993 348736343
3377.2 348736343 348267822 348281021 348094749 347513542 347218819 347326431 347061005 346544952 345974808 345685272
3386.9 345685272 345497551 345094910 344993820 345061951 344916649 344463196 343906746 343837814 343691826 343295479
3396.5 343295479 342834015 342262077 342208786 342191772 342101479 341778870 341480103 341708145 341446686 341296005
3406.2 341296005 341160927 341153221 341311111 340612526 339991798 339915237 340349159 340059776 339484787 339931984
3415.8C39931984N51529M03290j69297k81219l63960j34812J64566l24669J0529K79999
3425.5C40067940N80444J92108k69279j06125L0403L73650l00103l42369K10572L81965
3435.1C40819206L06359j57853k83584L98941Q23212K68669L32031m36783k72713M55895
3444.7C42253380M21943J024018o01769J52817J316834M64401N27992K24304M96292
3453.4C46280212k00920r9983O86531L82385N95589K63443N26543K66113L09563J78261
3463.1C49187737m72947Q93555J137962M95148M22554N09377N96428O13517M11263
3471.7C53794594J58043M84543L49235M07219O81725N70030L62205O93512J073036
3480.4C58574142O53153J15204j68038Q82073P78732J58119O51589L18489L55377N95779
$$ plain form
3415.8 339931984 340483513 340886803 340717506 340436287 340072327 339937515 340102081 339777412 339787941 340067940
3425.5 340067940 340648384 340840492 340571213 340465088 340495491 340869141 340569038 340226669 340437241 340819206
3435.1 340819206 341125565 340967712 340684128 341083069 341906281 342174950 342506981 342070198 341797485 342253380
3444.7 342253380 342675323 343699341 343097572 343250389 344567223 345031624 345559616 345783920 346280212
3453.4 346280212 346079292 345979309 346665840 347048225 347643814 347907257 348433800 348699913 349009476 349187737
3463.1 349187737 348714790 349608345 350746307 351241455 351664009 352173386 352769814 353383331 353794594
3471.7 353794594 353952637 354437180 354786415 355193634 355875359 356445389 356807594 357501106 358574142
3480.4 358574142 359227295 359342499 359174461 360056534 360835266 360993385 361644974 361963463 362318840 362914619
3490.1C62914619P90825M88243M26140Q42324N75256N97839N89562Q21914N22690O33736
3499.7C69203148Q53271J74179N57328N51223J23406N93376J294327J352348J341057
3508.4C76043663K23236p28454J004905P85256M13284O07223Q16498J360550Q37555
3517.1C81363716Q15163K6665n0736J022720J485062J367188J24397J01166R74845
3525.7C87230186J494637P24182O68488Q91685O96640Q67500O42128Q32215N15976
3534.4C94563637J521873N86624q08525J588974J665840J124268O15082O47468P97730
3543.1D02302971J329498J405258j71547R14994R9144J640205K262650J326637J841316
3551.8D12951126p42531M08783N67017J294975K095642J66550J512604J106796R19113
$$ plain form
3490.1 362914619 363705444 364193687 364619827 365462151 366037407 366635246 367224808 368046722 368569412 369203148
3499.7 369203148 370056419 370230598 370787926 371339149 371462555 372055931 373350258 374702606 376043663
3508.4 376043663 376266899 375538445 376543350 377328606 377741890 378349113 379165611 380526161 381363716
3517.1 381363716 382178879 382205544 382154808 383177528 384662590 386029778 386154175 386255341 387230186
3525.7 387230186 388724823 389449005 390117493 391009178 391705818 392573318 393215446 394047661 394563637
3534.4 394563637 396085510 396672134 395863609 397452583 399118423 400242691 400857773 401505241 402302971
3543.1 402302971 403632469 405037727 404866180 405781174 405880318 407520523 409783173 411109810 412951126
3551.8 412951126 412208595 412617378 413184395 414479370 416575012 416741562 418254166 419360962 420280075
3560.5D20280075R64050J720391J700287J292190M501610P71675o14319j7128j413688
3569.1D29185143K965087K120972J972199J814079J473312J646652J631470K255631
3576.9D45064545P13844J937561J889534L83224J223298K445182K356759R76524L751411
3585.5D60741882K049027j059990J830215m72374K757988L256264L003464Q28552m14581
3594.2D72520447L493538J14669K644539L941155O73675K633286N11436Q30803K458878
3602.9D89822426J795158K651749L925247L091850j342926L263512k37808o29883Q311005
3611.6E10650330J802253k407074M098358m12979L586769M569359M89502O18058j623498
3620.3E21371078J558190L667297L135453K514572K128257J915360K486610P294998
$$ plain form
3560.5 420280075 421244125 422964516 424664803 425956993 430458603 431230278 430615959 430598831 429185143
3569.1 429185143 432150230 434271202 436243401 438057480 439530792 441177444 442808914 445064545
3576.9 445064545 445778389 447715950 449605484 449988708 451212006 453657188 456013947 456990471 460741882
3585.5 460741882 462790909 461730919 463561134 463088760 465846748 469103012 472106476 472935028 472520447
3594.2 472520447 476013985 476128654 478773193 482714348 483388023 486021309 486532745 487363548 489822426
3602.9 489822426 491617584 494269333 498194580 501286430 499943504 503207016 502969208 502339325 510650330
3611.6 510650330 512452583 510045509 514143867 513730888 517317657 521887016 522376518 522994576 521371078
3620.3 521371078 522929268 526596565 529732018 532246590 534374847 536290207 538776817 546071815
3628E46071815J005021j3166123L769760N775719O239548K122650j284332K491645
3635.7E53025703K671891J894378J54915R23844K819748K966194R45129N32684K880478
3644.4E68814964L853112N515556k143974l638649O932563J61744l199578o14662M664116
3653E80345192M087143M662323N317726r204864J304168N887680J669808J254196J88522
3661.7E95511894J978035J371842J589393K023545P48329M737968L539658r36013n61523
3670.4F10003128p404327K841262R242402R492607n89676j9718781L138809Q511086
3678.1F15516510N336914k473488k22282L403663J559258J120682M45404P53288N435867
3686.8F30875816O979332r966583l371925R028740o123925q02955N456543R14230K030296
$$ plain form
3628 546071815 547076836 533910713 537680473 543456192 549695740 551818390 550534058 553025703
3635.7 553025703 555697594 557591972 557746887 558670731 561490479 564456673 565401802 565934486 568814964
3644.4 568814964 572668076 578183632 576039658 572401009 579333572 579495316 576295738 575681076 580345192
3653 580345192 584432335 589094658 594412384 585207520 586511688 592399368 594069176 595323372 595511894
3661.7 595511894 597489929 598861771 600451164 602474709 603223038 607961006 611500664 610564651 610003128
3670.4 610003128 602598801 605440063 614682465 624175072 623585396 603866615 607005424 615516510
3678.1 615516510 620853424 618379936 618157654 621561317 623120575 624241257 624686661 625439949 630875816
3686.8 630875816 637855148 627888565 624516640 633545380 627421455 626618500 632075043 632989273 635019569
3695.5F35019569Q98247K98920J007995j30920K945557L986969l993607k755699M329185
3704.1F41606216J655045k91443M7455L226776N443344p817688L986511O823349j4855575
3712.8F39823990K997208M425201R65881Q11615K629853J605606m218521J433944O233139
3721.5F56707916k864914m322662N566940J977387j614380l665009j21231L957596
3729.2F55621643R86099N490341k135162p021255R861297l21579r527511L034591K331086
3737.9F58319550j15891K792969L583069m173661L150559J1981354j2544098j5582428
3745.6F47411423J1646423O613770O585540k180557j1636429J1366425m712448p979355
3753.3F57114792O334991M739228L210220n867004K356948O800232q169784k415619
$$ plain form
3695.5 635019569 635917816 636216736 637224731 637093811 640039368 644026337 640032730 637277031 641606216
3704.1 641606216 643261261 642969818 643017273 646244049 651687393 643869705 647856216 654679565 639823990
3712.8 639823990 642821198 647246399 648212280 649023895 651653748 653259354 649040833 650474777 656707916
3721.5 656707916 653843002 649520340 655087280 657064667 655450287 651785278 651664047 655621643
3729.2 655621643 656607742 662098083 659962921 652941666 662802963 662481384 652953873 655988464 658319550
3737.9 658319550 658203659 660996628 664579697 660406036 663556595 675537949 662993851 647411423
3745.6 647411423 659057846 665671616 672257156 670076599 658440170 669806595 665094147 657114792
3753.3 657114792 663449783 668189011 671399231 665532227 667889175 674689407 666519623 664104004
3761F64104004M398575J694030M13361M408493j675339n676956L029251N111313J163788
3769.7F76970520q530273J203155K865830j6633Q79975k40250J338806O49491L231582
3778.4F78352203Q53577q376083K676010K594223P78885K024078k811050p33109J527023
3787.1F76885757P32346L60718M39987L54538m36554O27899j9607J920166M450073
3795.8F85315323l653183n372620K156449N603408P317734n969238j1143265K491226
3803.5F76745834K568894N474090N717163j0513534m549408N245590K321396l20816
3811.2F82689209Q57239Q03756J085587O200562O50939j4372100L761749O314545N690994
3819.9F93682480L341446j7880402o05774M687882K147369L247604J38474m627075
$$ plain form
3761 664104004 668502579 670196609 670609970 675018463 673343124 667666168 670695419 675806732 676970520
3769.7 676970520 668440247 669643402 672509232 672492599 673372574 673132324 674471130 675120621 678352203
3778.4 678352203 679205780 670829697 673505707 676099930 676878815 678902893 676091843 675358734 676885757
3787.1 676885757 677618103 677978821 678418808 678773346 678336792 678964691 678945084 680865250 685315323
3795.8 685315323 681662140 676289520 678445969 684049377 691367111 685397873 674254608 676745834
3803.5 676745834 679314728 684788818 690505981 679992447 675443039 680688629 683010025 682689209
3811.2 682689209 683546448 684350204 685435791 691636353 692287292 677915192 681676941 687991486 693682480
3819.9 693682480 697023926 679143524 678537750 683225632 685373001 688620605 688759079 684132004
3827.6F84132004M83551K603149L961182J913299r327240J468430P647400n354920
3835.3F87526855j292648Q878403q373566l944702Q308792o098938k84805P396469
3843F92115860j507111m723892K514191K032623L31116J997757j737671J240463O829758
3851.7F99093094l073654N07888j6390838J410293J0275803j052170k249756K095414
3859.4F90616074K809372L158187o098556j11694R002151n964127p198715M310303
3867.1F90522995O010437P950821p854004j1754684L854599P453765M366913j1332092
3874.8F89218750L93753M257965j10092K164688N055237n137405q192902O449051K267914
3883.5F96366959J845703N429916j3645325O8741M542618J002579M143982l82462q268127
$$ plain form
3827.6 684132004 684615555 687218704 691179886 693093185 683765945 685234375 692881775 687526855
3835.3 687526855 686234207 695112610 686739044 682794342 691103134 685004196 684719391 692115860
3843 692115860 690608749 685884857 688399048 690431671 690762787 692760544 691022873 692263336 699093094
3851.7 699093094 696019440 696527328 680136490 681546783 691822586 690770416 688520660 690616074
3859.4 690616074 693425446 696583633 690485077 690373383 699375534 693411407 686212692 690522995
3867.1 690522995 696533432 704484253 696630249 684875565 688730164 696183929 700550842 689218750
3874.8 689218750 689612503 693870468 693760376 695925064 700980301 695842896 687649994 694099045 696366959
3883.5 696366959 698212662 703642578 689997253 690065994 694608612 695611191 699755173 699372711 691104584
3892.2F91104584J634445L483200j557236R13544J627197L720474J852417j0599136
3899.9F92179489N556488J752091o180115O319885k931137l232422P98340J352234
3907.6F95614853K358627j80206L53317o31103p54166K41394K45209K025833K143555
3916.3G01417313l848420l559722M986343R52225m075547K073212J523132J150589
3924G00619125k095413m380569J528625K469788K107773p84989q26568K609481k380676
3932.7F98866577j954803J718521K53372J81961j86691p23725K69242O66427K327576
3941.4G01418457J132431m853134q12607J497498J120529K480697k116165p12433N69001
3950.1F99724274k061234J460953N28946o61316K89230M59595M48761k35138Q83789
$$ plain form
3892.2 691104584 692739029 696222229 694664993 695578537 697205734 700926208 702778625 692179489
3899.9 692179489 697735977 699488068 693307953 699627838 696696701 693464279 694262619 695614853
3907.6 695614853 697973480 697793274 698146591 697515488 696761322 697002716 697247925 699273758 701417313
3916.3 701417313 697568893 694009171 698995514 699947739 695872192 697945404 699468536 700619125
3924 700619125 698523712 694143143 695671768 698141556 700249329 699464340 698637772 701247253 698866577
3932.7 698866577 696911774 698630295 698883667 699065628 698878937 698155212 698424454 699090881 701418457
3941.4 701418457 702550888 697697754 696885147 698382645 699503174 701983871 699867706 699155273 699724274
3950.1 699724274 697663040 699123993 699652939 698991623 699280853 699740448 700189209 699954071 700837860
3958.7G00837860l66669k29415O40335j514435o96488M09775M74243O68259R04083
3967.4G01127548P96585n58166j040344J03912Q62121M76685l70102o22101p57980
3976.1G00018158r08203P30972J147232K52381J60751l94364j40914r6283J24206J11466
3985.7G01005402k21558M85840M68597N86548j68991l71475n8441k14386K76260p94067
3995.4G00993729J8768R10339j66092j2512r308
4000.2G01734924
$$ plain form
3958.7 700837860 700471191 700241776 700882111 699367676 698671188 699080963 699555206 700223465 701127548
3967.4 701127548 701924133 701365967 700325623 700429535 701291656 701768341 701398239 700776138 700018158
3976.1 700018158 699109955 699840927 700988159 701240540 701401291 701006927 700866013 700769730 700893936 701005402
3985.7 701005402 700783844 701269684 701738281 702324829 702155838 701784363 701725922 701511536 701787796 700993729
3995.4 700993729 701012497 701922836 701756744 701744232 701734924
4000.2 701734924
##END=$$ End of the data block
