##TITLE=$$ Begin of the data block
##JCAMP-DX=5.00 $$ ACD/SpecManager v 10.08
##SPECTROMETER/DATA SYSTEM=Varian
##DATE=20 Nov 2012 14:08:08
##DATA TYPE=INFRARED SPECTRUM
##DATA CLASS=XYDATA
##ORIGIN=
##OWNER=
##NPOINTS=3735
##FIRSTX=399.26403809
##LASTX=4000.35498047
##MAXX=4000.35498047
##MINX=399.26403809
##MAXY=77.73651123
##MINY=30.12195778
##XFACTOR=1.0000000000
##YFACTOR=0.000000100000000
##FIRSTY=55.90699387
##DELTAX=0.96440572
##XUNITS=1/CM
##YUNITS=TRANSMITTANCE
##XYDATA=(X++(Y..Y))
$$ plain form
399.3 559069939 563526611 546764679 534836807 541004715 551348343 547124405 539921684 543262520
407 543262520 547814407 541722298 538905411 540762138 539392509 542693977 549155350 552850723 553409882
415.7 553409882 554059639 553553505 534756584 525950279 536755753 538157196 539066734 535751305 530024872
424.3 530024872 533062782 538875618 539840927 539444962 540216370 539564095 535257416 528915253 524570770
433 524570770 531163177 538595963 535080643 529865150 528901596 532888756 538295517 542370300 543189049
441.7 543189049 542273903 543030128 544122276 546610832 547256660 545130959 541475716 542497559 550867500
450.4 550867500 556728935 556539955 551035538 546567726 546304474 549410858 552783775 552247810 551797562
459.1 551797562 549601898 547072144 547848091 547007980 543864594 542796478 542999420 541415672 538513031
$$ packed form
399.3E59069939M456672j6761932j1927872O167908J0343628m223938p202721L340836
407E43262520M551887o092109k816887J856727j369629L301468O461373L695373N59159
415.7E53409882O49757n06134j8796921q806305J0805474J401443R09538l315429n726433
424.3E30024872L037910N812836R65309l95965P71408o52275m306679o342163m344483
433E24570770O592407P432786l515320n215493r63554L987160N406761M074783Q18749
441.7E43189049r15146P56225J092148K488556O45828k125701l655243J021843Q369941
450.4E50867500N861435j88980n504417m467812k63252L106384L372917n35965m50248
459.1E51797562k195664k529754P75947q40111l143386j068116K02942j583748k902641
$$ plain form
467.7 538513031 536453323 535914154 535359879 538766060 538673820 534640160 536315117 534854088 534420509
476.4 534420509 532622337 528756065 526505852 525895271 528204765 526407890 526270638 526217651 524468269
485.1 524468269 527508507 529124222 524849701 521683769 527226830 529575539 525605087 521988831
492.8 521988831 521963921 527673187 529840431 526840363 524565849 524509201 520651398 516140442 515744591
501.5 515744591 514127731 515250053 515637474 515586853 515559845 512981339 511385002 511149712 510944519
510.2 510944519 507042122 502237663 499555397 500012054 500034218 498981094 500865173 499617386 497716637
518.9 497716637 495313911 493148575 490966454 486693420 484925232 485844917 488555489 487762222 486139450
527.5 486139450 487727356 488971901 486738930 486012344 488244667 487691002 487136269 486503601 489071922
$$ packed form
467.7E38513031k059708n39169n54275L406181r2240m033660J674957j461029m33579
476.4E34420509j798172l866272k250213o10581K309494j796875j37252n2987j749382
485.1E24468269L040238J615715m274521l165932N543061K348709l970452l616256
492.8E21988831k4910N709266K167244l000068k274514n6648l857803m510956l95851
501.5E15744591j616860J122322L87421n0621k7008k578506j596337k35290k05193
510.2E10944519l902397m804459k682266M56657K2164j053124J884079j247787j900749
518.9D97716637k402726k165336k182121m273034j768188R19685K710572p93267j622772
527.5D86139450J587906J244545k232971p26586K232323n53665n54733o32668K568321
$$ plain form
536.2 489071922 492690849 494529762 498488579 499193459 500457573 503231049 505666275 508254509 507453957
544.9 507453957 507241974 507674866 506934547 506562462 507661285 508984947 509014969 509838104 509627266 507120323
554.5 507120323 504111977 502760925 501733322 500456352 499386330 498544769 498310814 494680481 491868210
563.2 491868210 491619987 490326996 487599525 483352509 480205345 476310883 474260864 472909012 471492424
571.9 471492424 471682663 470553665 469744148 467690811 466974182 468981552 470575485 473006783 476173058
580.6 476173058 476986809 478050842 481836319 486142464 491029663 494002724 495182686 495681114 497219238
589.3 497219238 499290771 499784775 501035500 501990967 502565346 502553215 503022232 503567467 503542595 505187378
598.9 505187378 505695801 505058250 503023224 502059975 502661400 500765610 499585609 499600334 501796646
$$ packed form
536.2D89071922L618927J838913L958817P04880J264114K773476K435226K588234q00552
544.9E07453957k11983M32892p40319l72085J098823J323662L0022Q23135k10838k506943
554.5E07120323l008346j351052j027603j276970j070022q41561k33955l630333k812271
563.2D91868210k48223j292991k727471m247016l147164l894462k050019j351852j416588
571.9D71492424J90239j128998q09517k053337p16629K007370J593933K431298L166275
580.6D76173058Q13751J064033L785477M306145M887199K973061J179962M98428J538124
589.3D97219238K071533M94004J250725R55467N74379j2131M69017N45235k4872J644783
598.9E05187378N08423o37551k035026r63249O01425j895790j180001J4725K196312
$$ plain form
607.6 501796646 504603043 505720596 506090431 505076561 504772758 505091362 505832481 506730957 507813148
616.3 507813148 508358307 508784714 511025238 512915764 514779015 516418686 517383308 518130646 519712715
624.9 519712715 520893669 519885368 520676079 523392029 525983047 527877007 529124146 530358963 531979904
633.6 531979904 533065376 532876396 533207779 531927910 531595955 533982849 534231262 535036888 537674866
642.3 537674866 539571075 538905296 537083778 537901535 539800873 540569420 540073357 540325356 542224655
651 542224655 543393059 544164963 545948334 546856232 546097946 546058159 547168121 547473297 547222900 547082939
660.6 547082939 546588974 546779518 548052788 549176369 550628662 553234100 554986382 549522705 549911461
669.3 549911461 550234337 550131836 551586189 552840652 554035263 555161362 556954346 558785439 560154152
$$ packed form
607.6E01796646K806397J117553L69835j013870l03803L18604P41119Q98476J082191
616.3E07813148N45159M26407K240524J890526J863251J639671R64622P47338J582069
624.9E19712715J180954j008301P90711K715950K591018J893960J247139J234817J620941
633.6E31979904J085472j88980L31383j279869l31955K386894K48413Q05626K637978
642.3E37674866J896209o65779j821518Q17757J899338P68547m96063K51999J899299
651E42224655J168404P71904J783371R07898p58286l9787J109962L05176k50397j39961
660.6E47082939m93965J90544J273270J123581J452293K605438J752282n463677L88756
669.3E49911461L22876j02501J454353J254463J194611J126099J792984J831093J368713
$$ plain form
678 560154152 560775261 560255280 561226921 561848907 561048126 561049385 561665421 561720543 561557961 562968025
687.6 562968025 564339905 564907875 565615921 565963860 565701447 564279480 562324715 561018257 560668488
696.3 560668488 560246468 559345741 559475288 559461670 558021965 556350632 554917221 554234848 553735695
705 553735695 551795349 549748726 549403839 550180206 551145172 552817497 554637756 555095787 556224670
713.7 556224670 557905502 559012222 560561218 561467438 562133865 564295654 568081856 571249771 573462715
722.3 573462715 575528030 577233810 579219055 581861877 584511566 585478477 587086487 589363289 591081390
731 591081390 592867775 593322678 594977570 597432861 599975204 603052711 604106941 604144592 604136887 603969460
740.7 603969460 603768196 603828163 604024658 604226074 605061989 605454941 604239693 602686920 601652336
$$ packed form
678E60154152O21109n19981R71641O21986q00781J259O16036N5122j62582J410064
687.6E62968025J371880N67970P08046L47939k62413j421967j954765j306458l49769
696.3E60668488m22020r00727J29547j3618j439705j671333j433411o82373m99153
705E53735695j940346k046623l44887P76367R64966J672325J820259M58031J128883
713.7E56224670J680832J106720J548996R06220O66427K161789L786202L167915K212944
722.3E73462715K065315J705780J985245K642822K649689R66911J608010K276802J718101
731E91081390J786385M54903J654892K455291K542343L077507J054230L7651p705j67427
740.7F03969460k01264N9967J96495K01416Q35915L92952j215248j552773j034584
$$ plain form
749.3 601652336 599229965 596072807 593612633 591648254 589888458 587451363 585637321 585170364 584918785
758 584918785 583516769 580910416 579036255 577444839 575464401 573507843 572745857 573077469 573273506
766.7 573273506 575172539 577683792 579220734 580814514 582579918 584738998 587172127 589371567
774.4 589371567 591991081 595253983 598175850 601490974 604953918 607973862 610921440 614248047
782.1 614248047 617788010 620848770 623022461 623026543 623492050 625720100 627812958 629523201 631378975
790.8 631378975 634375839 636957283 638868561 640341263 640802917 641987610 643608398 643820496 643673477
799.5 643673477 644503784 646574326 649771118 652263565 654543152 656405258 656485291 656411667 656774597
808.2 656774597 656657028 655446320 654559326 654407272 654559402 654571533 655324554 656403122 655458374 655559921
$$ packed form
749.3F01652336k422371l157158k460174j964379j759796k437095j814042m66957k51579
758E84918785j402016k606353j874161j591416j980438j956558p61986L31612J96037
766.7E73273506J899033K511253J536942J593780J765404K159080K433129K199440
774.4E89371567K619514L262902K921867L315124L462944L019944K947578L326607
782.1F14248047L539963L060760K173691M082M65507K228050K092858J710243J855774
790.8F31378975K996864K581444J911278J472702M61654J184693J620788K12098j47019
799.5F43673477Q30307K070542L196792K492447K279587J862106Q0033p3624L62930
808.2F56774597j17569j210708q86994j52054J52130J2131P53021J078568r44748J01547
$$ plain form
817.8 655559921 656686935 656315918 654918365 653997955 653995514 653700638 654527893 654971695 654308929 654229355
827.5 654229355 654319992 653461075 651251755 649355850 647333527 645280838 642703323 640240479 639719925
836.1 639719925 639239235 637868423 635676079 633477898 631653557 629967499 628264236 626601677 625457916
844.8 625457916 623881416 621878357 620534210 619937057 619134827 618493271 617284698 615082817 612881813
853.5 612881813 609294014 605963821 603589363 601557121 600317726 598592262 597673721 597727623 597847290
862.2 597847290 599337425 602021103 604812355 607488861 611002579 614688110 618312492 622739410
869.9 622739410 627557983 632533302 637690582 642313232 645267715 647216492 648502502 649937668
877.6 649937668 650147095 649481659 649263763 648367920 647807159 646269379 645470505 645408325 643064117 640331955
$$ packed form
817.8F55559921J127014l71017j397553r20410k441k94876Q27255M43802o62766p9574
827.5F54229355R0637q58917k209320j895905k022323k052689k577515k462844n20554
836.1F39719925m80690j370812k192344k198181j824341j686058j703263j662559j143761
844.8F25457916j576500k003059j344147n97153q02230o41556j208573k201881k201004
853.5F12881813l587799l330193k374458k032242j239395j725464r18541N3902J19667
862.2E97847290J490135K683678K791252K676506L513718L685531L624382M426918
869.9F22739410M818573M975319N157280M622650K954483J948777J286010J435166
877.6F49937668K09427o65436k17896q95843n60761j537780p98874o2180k344208k732162
$$ plain form
887.3 640331955 637805443 634515305 631114388 628717079 626166191 624102859 622922592 621555519
895 621555519 620688515 619550285 617647362 615532532 613900986 611601791 608526917 605510712 602570953
903.7 602570953 600971718 599622917 598017426 595507126 592304840 589774208 586539612 583088837
911.4 583088837 578793259 573700714 569824944 566251640 562138748 557766533 554343224 551682510
919.1 551682510 548648911 546301384 544746742 543570709 541815300 539794044 538511009 537960014 538207741
927.8 538207741 537998009 538305016 539016838 539846268 540693245 540722809 541696243 542343941 542554970 543607903
937.4 543607903 544957314 546497993 547904396 549798813 552218361 554439468 555648537 556113625 555796204
946.1 555796204 554597931 552978973 549432983 544626007 540716095 536957474 532671738 528197365
$$ packed form
887.3F40331955k526512l290138l400917k397309k550888k063332j180267j367073
895F21555519q67004j138230j902923k114830j631546k299195l074874l016205k939759
903.7F02570953j599235j348801j605491k510300l202286k530632l234596l450775
911.4E83088837m295578n092545l875770l573304m112892m372215l423309k660714
919.1E51682510l033599k347527j554642j176033j755409k021256j283035n50995K47727
927.8E38207741k09732L07007P11822Q29430Q46977K9564R73434O47698K11029J052933
937.4E43607903J349411J540679J406403J894417K419548K221107J209069M65088l17421
946.1E55796204j198273j618958l545990m806976l909912l758621m285736m474373
$$ plain form
953.8 528197365 522597084 515846519 510029411 504063454 497244110 490676804 484442291 477506866
961.5 477506866 469889603 463879242 457531586 451106606 444628410 437168274 429523888 421255302
969.2 421255302 414076653 405979843 397835236 389570541 381507645 375052719 367739105 361146049
976.9 361146049 353645020 346963005 341068687 335501518 330384483 324014511 319749718 316458855
984.7 316458855 314226322 311223755 308936768 307523365 305642204 304906425 302894917 302658710 302418556
993.3 302418556 302532883 303082180 303438683 303941097 302738342 303695049 303605022 303495922 304074898 304799023
1003 304799023 305714226 305176353 305770187 304972076 304958134 304241581 303505058 303685131 302843914 303360519
1012.6 303360519 302027740 301882629 301891861 301417656 301219578 301494617 303309841 303348846 304251347 304330044
$$ packed form
953.8E28197365n600281o750565n817108n965957o819344o567306o234513o935425
961.5D77506866p617263o010361o347656o424980o478196p460136p644386q268586
969.2D21255302p178649q096810q144607q264695q062896o454926p313614o593056
976.9C61146049p501029o682015n894318n567169n117035o369972m264793l290863
984.7C16458855k232533l002567k286987j413403j881161p35779k011508k36207k40154
993.3C02418556J14327N49297L56503N02414j202755R56707r0027j09100N78976P24125
1003C04799023R15203n37873N93834p98111j3942p16553p36523J80073q41217N16605
1012.6C03360519j332779j45111R232m74205j98078K75039J815224L9005R02501P8697
$$ plain form
1022.3 304330044 305139980 305962543 306671467 308504238 309259510 311760216 312515697 313976307 315334702
1031 315334702 316300888 318285217 319080410 320793877 321196251 322522316 322487793 322671280 323758888
1039.6 323758888 323444138 323771324 323012123 324503899 324562073 324834404 325594406 325331459 326141930 325803871
1049.3 325803871 327773285 328489990 329899406 331138344 332391624 335963516 338233337 341881523
1057 341881523 344265366 348126450 351155815 353320618 356763611 359546547 364384766 367523804 371838112
1065.7 371838112 375603180 377284966 377610550 376181984 375190048 371352234 367693062 362933006 357675056
1074.4 357675056 353681984 350378418 348725204 347407150 347917747 346927719 347591057 348776245 349714890
1083 349714890 351914711 353866692 356671371 357170410 359294930 361459961 363312492 365637054 367573051
$$ packed form
1022.3C04330044Q09936Q22563P08924J832771P55272K500706P55481J460610J358395
1031C15334702R66186J984329P95193J713467M02374J326065l4523J83487J087608
1039.6C23758888l14750L27186p59201J491776N8174K72331P60002k62947Q10471l38059
1049.3C25803871J969414P16705J409416J238938J253280L571892K269821L648186
1057C41881523K383843L861084L029365K164803L442993K782936M838219L139038M314308
1065.7C71838112L765068J681786L25584j428566r91936l837814l659172m760056n257950
1074.4C57675056l993072l303566j653214j318054N10597r90028O63338J185188R38645
1083C49714890K199821J951981K804679M99039K124520K165031J852531K324562J935997
$$ plain form
1091.7 367573051 371052895 373583641 376659050 377921028 379798355 382090073 383042526 384098282
1099.4 384098282 383933067 385454330 386026611 386435204 386703262 387174530 387652092 387237206 389341583
1108.1 389341583 390669899 392158737 392890663 394606628 397297516 398868637 402188492 404580803
1115.8 404580803 406874886 407942123 409612198 412021980 413197517 414010811 413482056 414737320 415990143
1124.5 415990143 417367783 418678169 419945297 422029305 423646011 426113319 427831917 430490837
1132.2 430490837 431979446 432445793 433714485 434422150 435330315 434403191 433792610 432565231 429997635
1140.9 429997635 427252541 424135170 420736580 416147194 413567810 411079788 408462372 405688248
1148.6 405688248 403124962 401819229 399657822 398093414 395958176 395827827 395578041 394671898 394507980
$$ packed form
1091.7C67573051L479844K530746L075409J261978J877327K291718R52453J055756
1099.4C84098282j65215J521263N72281M08593K68058M71268M77562m14886K104377
1108.1C89341583J328316J488838P31926J715965K690888J571121L319855K392311
1115.8D04580803K294083J067237J670075K409782J175537Q13294n28755J255264J252823
1124.5D15990143J377640J310386J267128K084008J616706K467308J718598K658920
1132.2D30490837J488609M66347J268692P07665R08165r27124o10581j227379k567596
1140.9D29997635k745094l117371l398590m589386k579384k488022k617416k774124
1148.6D05688248k563286j305733k161407j564408k135238j30349k49786r06143j63918
$$ plain form
1157.3 394507980 393617363 394333267 394277954 395643997 397300224 399250984 402023201 404818497 408918800
1166 408918800 411291542 415026245 419044266 423237343 428083038 432710991 438268929 443589478 449879799
1174.6 449879799 455671844 461497345 466599922 471817017 477657166 482452087 487723579 491914864
1182.4 491914864 496240692 501257782 506441269 510960541 514804077 519336777 522765121 525824471
1190.1 525824471 528053818 529358139 531089783 532585564 534023666 535071106 535924911 536643333 537139397
1198.8 537139397 537986183 538933754 539275627 539265060 539683380 539815140 539332352 539542046 541260910 542794609
1208.4 542794609 543881149 545709724 547705917 549550285 550876579 552047539 553257027 554358673
1216.1 554358673 555497971 556632957 557840691 559338760 560858002 561939926 562903290 562826805 561947784
$$ packed form
1157.3C94507980q90617P15904n5313J366043J656227J950760K772217K795296M100303
1166D08918800K372742L734703M018021M193077M845695M627953N557938N320549O290321
1174.6D49879799N792045N825501N102577N217095N840149M794921N271492M191285
1182.4D91914864M325828N017090N183487M519272L843536M532700L428344L059350
1190.1E25824471K229347J304321J731644J495781J438102J047440Q53805P18422M96064
1198.8E37139397Q46786R47571L41873j0567M18320J31760m82788K09694J718864J533699
1208.4E42794609J086540J828575J996193J844368J326294J170960J209488J101646
1216.1E54358673J139298J134986J207734J498069J519242J081924R63364p6485q79021
$$ plain form
1224.8 561947784 561399345 560716553 559732857 558866920 558390694 557825279 557522469 557471771 556943092 556324654
1234.4 556324654 555506020 554895668 554055061 552844315 552030296 551252594 550759201 550366364 550808640
1243.1 550808640 551594696 551830711 552705536 553565559 553883133 553984985 554180336 554871979 555676384 555857277
1252.8 555857277 555805359 556440468 557950821 559633446 560349998 560745964 561166496 561455917 561732254
1261.4 561732254 561557732 561353416 561624031 562336960 563041039 563913269 565529442 567457657 568874512
1270.1 568874512 569623337 570416794 571125717 571344566 571309776 571428490 571814270 572362480 572794495 573406754
1279.8 573406754 574101791 574087906 573681107 573365517 572900963 572091560 571932793 571967049 571633606 571772423
1289.4 571772423 571920509 572049332 572155151 572222328 571765251 570673218 569888344 568816528 567422943
$$ packed form
1224.8E61947784n48439o82792r83696q65937m76226n65415l02810n0698n28679o18438
1234.4E56324654q18634o10352q40607j210746q14019p77702m93393l92837M42276
1243.1E50808640P86056K36015Q74825Q60023L17574J01852J95351O91643Q04405J80893
1252.8E55857277n1918O35109J510353J682625P16552L95966M20532K89421K76337
1261.4E61732254j74522k04316K70615P12929P04079Q72230J616173J928215J416855
1270.1E68874512P48825P93457P08923K18849l4790J18714L85780N48210M32015O12259
1279.8E73406754O95037j3885m06799l15590m64554q09403j58767L4256l33443J38817
1289.4E71772423J48086J28823J05819O7177m57077j092033p84874j071816j393585
$$ plain form
1298.1 567422943 566518440 566123390 565455437 564943810 564587326 563669510 563113785 562487488 561701889 560848465
1307.7 560848465 559519958 558289528 557166634 556755562 556534386 555824852 555590477 555442810 555010529
1316.4 555010529 554366913 553615875 552539062 551185913 550310860 549792404 549289513 548645134 547760582
1325.1 547760582 546611633 545121498 543239250 541220627 539098930 536720467 534694824 532936745
1332.8 532936745 531210327 529931793 528723068 527978630 527266922 526985207 527256699 526772995 526326714
1341.5 526326714 526057358 525851784 525310135 525377274 525796623 526051064 526371689 526379204 526900787 527307281
1351.1 527307281 527472763 527204437 526901665 526534157 525508308 524906044 524285126 523827934 523447685
1359.8 523447685 523276558 523408356 523445625 522731514 521586647 521371422 520566292 519977112 519448586 518869514
$$ packed form
1298.1E67422943r04503l95050o67953n11627l56484r17816n55725o26297p85599q53424
1307.7E60848465j328507j230430j122894m11072k21176p09534k34375j47667m32281
1316.4E55010529o43616p51038j076813j353149q75053n18456n02891o44379q84552
1325.1E47760582j148949j490135j882248k018623k121697k378463k025643j758079
1332.8E32936745j726418j278534j208725p44438p11708k81715K71492m83704m46281
1341.5E26326714k69356k05574n41649O7139M19349K54441L20625P515N21583M06494
1351.1E27307281J65482k68326l02772l67508j025849o02264o20918m57192l80249
1359.8E23447685j71127J31798L7269p14111j144867k15225q05130n89180n28526n79072
$$ plain form
1369.4 518869514 519247932 519294167 520207520 520791359 520981102 521297455 521626587 522519875 522798653 523467979
1379.1 523467979 523691063 523958206 524567947 525212288 526222000 527381859 529470444 530992393 531593132
1387.8 531593132 532529678 534434013 536197586 537053795 537884598 539034653 540074577 539169846 539397240
1396.4 539397240 539589844 539666939 538372917 536975441 537255173 536547470 535996208 535217705 534163666
1405.1 534163666 533545380 532933006 533011360 532623253 532051773 530948753 530134315 529198990 528148689
1413.8 528148689 527473068 526757355 526897430 526536255 527347984 525747261 524463615 525548897 525424080
1422.5 525424080 525344696 524043579 524358521 524641914 524516754 525656929 525970955 526524315 526859131
1431.2 526859131 528231354 528817787 528950577 530236359 530997009 531179237 530271873 531513481 532076874
$$ packed form
1369.4E18869514L78418M6235R13353N83839J89743L16353L29132Q93288K78778O69326
1379.1E23467979K23084K67143O09741O44341J009712J159859K088585J521949O00739
1387.8E31593132R36546J904335J763573Q56209Q30803J150055J039924r04731K27394
1396.4E39397240J92604P7095j294022j397476K79732p07703n51262p78503j054039
1405.1E34163666o18286o12374P8354l88107n71480j103020q14438r35325j050301
1413.8E28148689o75621p15713J40075l61175Q11729j600723j283646J085282j24817
1422.5E25424080p9384j301117L14942K83393j25160J140175L14026N53360L34816
1431.2E26859131J372223N86433J32790J285782P60650J82228r07364J241608N63393
$$ plain form
1439.8 532076874 532881546 534168015 534796715 536078606 536321449 537079773 537492676 537588158 535969849
1448.5 535969849 535312920 536009026 535011368 534896164 534590340 535292931 535732880 535880699 534713593
1457.2 534713593 530396347 532083588 531433220 533075447 533147697 533455009 535222626 534810677 537566643
1465.9 537566643 539221764 542375412 544281616 547460403 551369247 553619232 559730835 561515656
1473.6 561515656 566187172 569051743 573298416 577505646 580914230 585200577 588009834 591845932
1481.3 591845932 593839760 596902390 599342461 601446228 604502602 606269875 609460068 610686607
1489 610686607 614042358 615601158 617436142 619740295 620593910 622838631 623739128 623763237 625563354
1497.7 625563354 627890282 628158684 629264336 631265678 632023315 634042397 635575485 638934250 637319489
$$ packed form
1439.8E32076874Q04672J286469O28700J281891K42843P58324M12903R5482j618309
1448.5E35969849o56929O96106r97658j15204l05824P02591M39949J47819j167106
1457.2E34713593m317246J687241o50368J642227P2250L07312J767617m11949K755966
1465.9E37566643J655121L153648J906204L178787L908844K249985O111603J784821
1473.6E61515656M671516K864571M246673M207230L408584M286347K809257L836098
1481.3E91845932J993828L062630K440071K103767L056374J767273L190193J226539
1489F10686607L355751J558800J834984K304153Q53615K244721R00497K4109J800117
1497.7F25563354K326928K68402J105652K001342P57637K019082J533088L358765j614761
$$ plain form
1506.4 637319489 630180435 634582672 635487785 637490425 639016647 641687775 641915894 643034668 644558487
1515.1 644558487 644601059 646312408 643442230 646404648 649143677 649222336 647069778 646875229 651445236
1523.7 651445236 654042053 654984283 654003220 655154114 655101242 654443207 655877075 656269836 657367325
1532.4 657367325 657161789 656609039 658143539 659821320 662088394 664481201 666827545 657165985 659658279
1541.1 659658279 660568848 661143494 663236847 663129959 662680435 663463669 665225677 666673050 667503433
1549.8 667503433 666378937 666747589 668007965 668507538 667661743 666381912 668944168 671495132 667711487
1558.5 667711487 668216858 665417480 668786011 669731522 670436859 671033173 668643341 667856979 668625793
1567.1 668625793 669410782 669843063 666919479 666780624 667621384 667400970 667275696 667593460 666366501
$$ packed form
1506.4F37319489p139054M402237R05113K002640J526222K671128K28119J118774J523819
1515.1F44558487M2572J711349k870178K962418K739029P8659k152558j94549M570007
1523.7F51445236K596817R42230r81063J150894n2872o58035J433868L92761J097489
1532.4F57367325k05536n52750J534500J677781K267074K392807K346344r661560K492294
1541.1F59658279R10569N74646K093353j06888m49524P83234J762008J447373Q30383
1549.8F67503433j124496L68652J260376M99573q45795j279831K562256K550964l783645
1558.5F67711487N05371k799378L368531R45511P05337N96314k389832p86362P68814
1567.1F68625793P84989M32281k923584j38855Q40760k20414j25274L17764j226959
$$ plain form
1575.8 666366501 659921036 660200577 660785675 660051422 659516830 658870850 658436279 657610779 656194382
1584.5 656194382 654295654 652091064 650098953 648096848 646118774 643706055 642428284 641283493
1592.2 641283493 640390320 639136810 636901169 635049019 632858772 631217194 628379784 625849915
1599.9 625849915 623684921 621425056 619984856 617854576 616161652 614415665 613427391 611532555
1607.6 611532555 609639664 607035294 603826447 602555199 600276871 598709869 596558418 596380539
1615.4 596380539 596450386 589351158 589409180 588775558 588186569 586562157 586457176 585686874 580402756
1624 580402756 579694595 579428711 580279160 578385620 576713829 576440277 575974045 575884247 575163193 576205368
1633.7 576205368 577676048 574577103 571028175 572669754 572580185 572291527 573250198 573475533 574885101
$$ packed form
1575.8F66366501o445465K79541N85098p34253n34592o45980m34571q25500j416397
1584.5F56194382j898728k204590j992111k002105j978074k412719j277771j144791
1592.2F41283493q93173j253510k235641j852150k190247j641578k837410k529869
1599.9F25849915k164994k259865j440200k130280j692924j745987r88274j894836
1607.6F11532555j892891k604370l208847j271248k278328j567002k151451j77879
1615.4E96380539O9847p099228N8022o33622n88989j624412j04981p70302n284118
1624E80402756p08161k65884Q50449j893540j671791k73552m66232q9798p21054J042175
1633.7E76205368J470680l098945l548928J641579q9569k88658R58671K25335J409568
$$ plain form
1642.4 574885101 575151329 576499443 578134499 576856346 577108841 577618141 579496536 580184479 582526207
1651 582526207 585589027 584524384 582569695 585903740 589371147 591019211 592589302 593869743 595475616
1659.7 595475616 596941833 598699188 601091461 602502060 605742989 608467789 610509148 612435913
1667.4 612435913 614768295 615625267 617170372 620361519 621714935 624127617 627237206 629861755
1675.1 629861755 630316010 633009529 635987892 638351669 640941925 641421432 643970795 647742310 649393005
1683.8 649393005 648349915 650201569 653963623 657157211 659120865 661154251 662475128 663529816
1691.5 663529816 665079803 666573410 669319763 671725006 669174423 672101593 675402222 679559708
1699.3 679559708 682378159 676618881 679286346 681927338 683344650 682687683 682901535 681915588 681973114
$$ packed form
1642.4E74885101K66228J348114J635056j278153K52495N09300J878395O87943K341728
1651E82526207L062820j064643j954689L334045L467407J648064J570091J280441J605873
1659.7E95475616J466217J757355K392273J410599L240929K724800K041359J926765
1667.4F12435913K332382Q56972J545105L191147J353416K412682L109589K624549
1675.1F29861755M54255K693519K978363K363777K590256M79507K549363L771515J650695
1683.8F49393005j043090J851654L762054L193588J963654K033386J320877J054688
1691.5F63529816J549987J493607K746353K405243k550583K927170L300629M157486
1699.3F79559708K818451n759278K667465K640992J417312o56967K13852r85947N7526
$$ plain form
1707.9 681973114 683732605 685002518 685703888 686756058 687812729 688316269 687846527 687394180 689347839
1716.6 689347839 691119080 687364502 687527924 689271164 690954742 691997147 692676468 692978592 693704147
1725.3 693704147 693956070 693601303 694097290 694822388 694267349 693845215 696390686 699377747 697383575
1734 697383575 694167557 697002258 699771194 700862274 702779388 703300171 700321579 701973724 703794785
1742.7 703794785 704328842 705304794 707549210 709158325 710355225 712000885 712411423 714903946 715407867
1751.3 715407867 715104218 717599487 719072571 720407867 722335815 722962875 723737259 725888443 727751083
1760 727751083 730049362 729911270 729129715 730996399 731534348 732145309 733701630 735217285 734225464
1768.7 734225464 735486984 738542480 739196930 739190674 737540741 738945160 739921722 738977432 740086365
$$ packed form
1707.9F81973114J759491J269913P01370J052170J056671N03540m69742m52347J953659
1716.6F89347839J771241l754578J63422J743240J683578J042405O79321L02124P25555
1725.3F93704147K51923l54767M95987P25098n55039m22134K545471K987061j994172
1734F97383575l216018K834701K768936J091080J917114N20783k978592J652145J821061
1742.7G03794785N34057R75952K244416J609115J196900J645660M10538K492523N03921
1751.3G15407867l03649K495269J473084J335296J927948O27060P74384K151184J862640
1760G27751083K298279j38092p81555J866684N37949O10961J556321J515655r91821
1768.7G34225464J261520L055496O54450o256j649933J404419R76562r44290J108933
$$ plain form
1777.4 740086365 740789948 742081223 743004227 743058472 743831635 744670181 745306396 744895935 744954071 745516739
1787 745516739 745905304 746104355 747175369 748140945 748953094 748698120 748093338 750481186 751265030 750425186
1796.7 750425186 750673294 751808624 752223434 750683136 751855316 752488480 752992783 754347992 755240173
1805.3 755240173 756193848 756583939 756302795 756028442 756548462 755343018 754866638 755723343 756136551
1814 756136551 757221146 757917252 759025269 759450302 759609909 759987030 759660797 759671173 759118118 759690857
1823.7 759690857 760428238 759369659 759347382 760663147 762409363 763075409 760876007 760769196 762695389
1832.3 762695389 762633743 761885605 761615219 761591492 762340317 762357407 763204346 763791809 764261551 764230423
1842 764230423 764742432 765922012 761843185 762087631 763086166 762892532 762775192 763231812 764335251
$$ packed form
1777.4G40086365P03583J291275R23004N4245P73163Q38546O36215m10461N8136N62668
1787G45516739L88565J99051J071014R65576Q12149k54974o04782K387848P83844q39844
1796.7G50425186K48108J135330M14810j540298J172180O33164N04303J355209Q92181
1805.3G55240173R53675L90091k81144k74353N20020j205444m76380Q56705M13208
1814G56136551J084595O96106J108017M25033J59607L77121l26233J0376n53055N72739
1823.7G59690857P37381j058579k2277J315765J746216O66046k199402j06811J926193
1832.3G62695389o1646p48138k70386k3727P48825J7090Q46939N87463M69742l1128
1842G64230423N12009J179580m078827K44446R98535j93634j17340M56620J103439
$$ plain form
1850.7 764335251 764708710 765303421 764914398 764961929 765347900 764936371 764649124 764053421 764209442 764113998
1860.3 764113998 764432755 764975357 765836945 766402054 765809631 766135635 765994186 766232071 765760422 764179764
1869.9 764179764 764168549 764498444 765254288 765922318 766858597 767146606 767100906 766975555 766913300 766836929
1879.6 766836929 766138763 766183548 766072235 766666641 767199249 767224731 767841644 768006287 768603745 768314438
1889.2 768314438 766859894 766786880 767511368 767758408 767764130 767803574 767255707 767924042 768545227 768933258
1898.9 768933258 768850632 768508072 768836670 768410721 768398285 768171463 767793961 768040314 768287811 768605194
1908.5 768605194 769037476 769264984 768767776 769117584 769183426 769081650 768859100 768388367 769121780 768159790
1918.2 768159790 767618637 768491364 769199677 770015640 769684143 769114227 769096146 769144974 768930435 768762894
$$ packed form
1850.7G64335251L73459N94711l89023M7531L85971m11529k87247n95703J56021r5444
1860.3G64113998L18757N42602Q61588N65109n92423L26004j41449K37885m71649j580658
1869.9G64179764j1215L29895P55844O68030R36279K88009m5700j25351o2255p6371
1879.6G66836929o98166M4785j11313N94406N32608K5482O16913J64643N97458k89307
1889.2G68314438j454544p3014P24488K47040N722L9444n47867O68335O21185L88031
1898.9G68933258q2626l42560L28598m25949j2436k26822l77502K46353K47497L17383
1908.5G68605194M32282K27508m97208L49808O5842j01776k22550m70733P33413r61990
1918.2G68159790n41153Q72727P08313Q15963l31497n69916j8081M8828k14539j67541
$$ plain form
1927.8 768762894 768456192 768448257 768904419 769192429 769698563 769844666 770118179 769889374 769522171 769356308
1937.5 769356308 768885345 769088211 769101562 769690018 769833221 768960571 769636230 770263748 770085220 769675293
1947.1 769675293 769667969 769435272 769150162 769032974 768932037 769062119 769347229 769849167 769976654 770387344
1956.7 770387344 770572815 770665894 770998154 770711517 770153809 769372482 769320679 769527435 770060959 771030121
1966.4 771030121 770979156 770857315 771029205 770853119 770281067 770167007 770275574 770016174 769530411 769519196
1976 769519196 770370941 770936508 771336746 771420059 771715393 771919861 771291580 770771790 770387573 770367355
1985.7 770367355 770199356 770412064 770407333 770085602 770949020 771455002 771152191 770953140 771207886 770986481
1995.3 770986481 770608978 770450974 769891815 769889374 769838791 770005798 770375519 770890427 771694260 771776886
$$ packed form
1927.8G68762894l06702p935M56162K88010N06134J46103K73513k28805l67203j65863
1937.5G69356308m70963K02866J3351N88456J43203q72650O75659O27518j78528m09927
1947.1G69675293p324k32697k85110j17188j00937J30082K85110N01938J27487M10690
1956.7G70387344J85471R3079L32260k86637n57708p81327n1803K06756N33524R69162
1966.4G71030121n0965j21841J71890j76086n72052j14060J08567k59400m85763j1215
1976G69519196Q51745N65567M00238Q3313K95334K04468o28281n19790l84217k0218
1985.7G70367355j67999K12708m731l21731Q63418N05982l02811j99051K54746k21405
1995.3G70986481l77503j58004n59159k441n0583J67007L69721N14908Q03833Q2626
$$ plain form
2005 771776886 771296768 770665970 770407944 769728165 769275665 769175797 769071655 769426727 769544373 769937439
2014.6 769937439 770099258 770356979 770028076 769193573 769050446 768510208 768065872 767649155 767874146 768223801
2024.2 768223801 768301697 768687897 768816681 769017563 768336792 767633362 767317657 767045975 766779556 766379013
2033.9 766379013 766532745 766384964 766558914 766899414 766936111 766760635 766364517 765896606 765309448 765327301
2043.5 765327301 764884644 764914017 765308380 765310822 765677338 765802231 766158295 765903397 765708923 765697861
2053.2 765697861 765337753 765031815 764254608 764287262 764562759 764818420 765090866 765322113 765536728 765277176
2062.8 765277176 765700378 765688324 765045776 764636993 764374161 764476013 764686203 765003738 765292282 765525208
2072.5 765525208 765513229 765846786 766026764 765888748 765797958 765360565 765228958 764980240 764747620 764660950
$$ packed form
2005G71776886m80118o30798k58026o79779m52500r9868j04142L55072J17646L93066
2014.6G69937439J61819K57721l28903q34503j43127n40238m44336m16717K24991L49655
2024.2G68223801P7896L86200J28784K00882o80771p03430l15705k71682k66419m00543
2033.9G66379013J53732j47781J73950L40500L6697j75476l96118m67911n87158J7853
2043.5G65327301m42657K9373L94363K442L66516J24893L56064k54898j94474j1062
2053.2G65697861l60108l05938p77207L2654K75497K55661K72446K31247K14615k59552
2062.8G65277176M23202j2054o42548m08783k62832J01852K10190L17535K88544K32926
2072.5G65525208j1979L33557J79978j38016r0790m37393j31607k48718k32620q6670
$$ plain form
2082.1 764660950 765120163 765864716 766128159 766428528 766119461 765744171 765337448 765119476 765293198 765123520
2091.7 765123520 764982224 764937363 765411911 765756836 766261139 766657028 766210785 765985184 765964203 766212234
2101.4 766212234 766123123 765736237 765522461 765631027 766024933 766280823 766489716 766647034 767292709 767315826
2111 767315826 766622467 766156311 765944290 766083527 765919876 765928040 766034317 766461334 767073898 767160263
2120.7 767160263 767040176 766861267 766953430 766653976 766289978 766315308 766474228 766318359 766196442 766596375
2130.3 766596375 766534500 766878662 767173538 767032700 766926498 766387405 766065750 766015244 766186676 766058044
2140 766058044 766255875 766774979 767016907 767526093 767612915 767437439 767087479 766748734 766370010 766027069
2149.6 766027069 766079559 766104889 766409760 766870880 767420273 767745667 767819061 767677765 767701492 767736969
$$ packed form
2082.1G64660950M59213P44553K63443L00369l09067l75290m06723k17972J73722j69678
2091.7G65123520j41296m4861M74548L44925N04303L95889m46243k25601k0981K48031
2101.4G66212234q9111l86886k13776J08566L93906K55890K08893J57318O45675K3117
2111G67315826o93359m66156k12021J39237j63651Q164J06277M27017O12564Q6365
2120.7G67160263j20087j78909R2163k99454l63998K5330J58920j55869j21917L99933
2130.3G66596375o1875L44162K94876j40838j06202n39093l21655n0506J71432j28632
2140G66058044J97831N19104K41928N09186Q6822j75476l49960l38745l78724l42941
2149.6G66027069N2490K5330L04871M61120N49393L25394P3394j41296K3727L5477
$$ plain form
2159.3 767736969 767005310 766566391 766326828 766390228 766528854 767028275 768177795 768680801 769058456 769315186
2168.9 769315186 769493027 768954086 768228149 768054199 767942276 768451157 768460846 768744659 769365540 769801712
2178.5 769801712 770484085 770755234 770727844 770225067 770393372 770587234 770199127 770039139 770125809 770456543
2188.2 770456543 770640411 771359024 771781235 771897583 771845551 771689606 771854706 771536942 771601715 771512833
2197.8 771512833 771529694 771648026 771564331 772118073 772404556 772537613 772833633 773321609 773105621 772800064
2207.5 772800064 772844620 772549896 772707672 772906723 773457031 773688049 773638763 773783417 773886566 774183731
2217.1 774183731 773929825 773855438 773820038 774283142 774641495 774413300 774908676 775276031 775397568 774790344
2226.8 774790344 774490128 774645233 774548264 774753265 774614563 774881592 775232468 775454102 775575790 775657501
$$ packed form
2159.3G67736969p31659m38919k39563O3400J38626M99421J149520N03006L77655K56730
2168.9G69315186J77841n38941p25937j73950j11923N08881R689K83813O20881M36172
2178.5G69801712O82373K71149k7390n02777J68305J93862l88107j59988Q6670L30734
2188.2G70456543J83868P18613M22211J16348n2032j55945J65100l17764O4773q8882
2197.8G71512833J6861J18332q3695N53742K86483J33057K96020M87976k15988l05557
2207.5G72800064M4556k94724J57776J99051N50308K31018m9286J44654J03149K97165
2217.1G74183731k53906p4387l5400M63104L58353k28195M95376L67355J21537o07224
2226.8G74790344l00216J55105r6969K05001j38702K67029L50876K21634J21688Q1711
$$ plain form
2236.4 775657501 775894775 775877838 775733871 775045166 774856186 774857101 774747467 774972458 775189896 775360641
2246 775360641 775448151 776255341 776565399 776375656 776145859 775595703 775380859 775244217 775442047 775456238
2255.7 775456238 775477371 775598907 775888748 776484222 776811905 776967773 776694565 776578598 776283035 775980911
2265.3 775980911 775710678 775628586 775886383 775697174 776113892 776403122 776956329 777365112 776948395 776799774
2275 776799774 776394272 776535645 776461411 776088867 775735931 775852737 776664047 776880417 777060699 776940765
2284.6 776940765 777244568 777285156 776939163 777018585 776561356 776388397 776188736 776384048 776314697 776209946
2294.3 776209946 776570129 776554718 777099686 777247086 777306976 776958237 776441803 776153412 775585251 775923920
2303.9 775923920 776225891 776333466 775857239 775974731 776395493 775738907 775328598 774972076 775662308 775843658
$$ packed form
2236.4G75657501K37274j6937j43967o88705j88980R15j09634K24991K17438J70745
2246G75360641Q7510Q07190L10058j89743k29797n50156k14844j36642J97830J4191
2255.7G75456238K1133J21536K89841N95474L27683J55868k73208j15967k95563l02124
2265.3G75980911k70233q2092K57797j89209M16718K89230N53207M08783m16717j48621
2275G76799774m05502J41373p4234l72544l52936J16806Q11310K16370J80282j19934
2284.6G76940765L03803M0588l45993P9422m57229j72959j99661J95312o9351j04751
2294.3G76209946L60183j5411N44968J47400N9890l48739n16434k88391n68161L38669
2303.9G75923920L01971J07575m76227J17492M20762o56586m10309l56522O90232J81350
$$ plain form
2313.5 775843658 775810318 776100616 775613937 775668030 775282135 775101242 775351562 775430908 774487534 773516312
2323.2 773516312 774166641 774793549 775200958 775106506 774943771 774317093 774522705 774172134 773022079 773754654
2332.8 773754654 773442078 773205719 772592163 772251282 772885132 773083572 772946167 771699371 772766495
2341.5 772766495 773975830 773869324 772374496 770811996 771370087 771276398 772122192 773659973 775022202
2350.2 775022202 775017319 773601303 773027496 772050018 771404037 771624374 771994019 772198334 771494904 769474792
2359.8 769474792 768789444 768946991 768906937 771552048 772492447 771671906 770739670 770322495 769810562 768986359
2369.5 768986359 770674591 771246338 770751495 770850754 770964890 770810165 770979309 771960907 771873398 771602249
2379.1 771602249 771299820 770761642 770428848 770162735 770163040 770220795 770827789 771243515 771265640 771208115 771010284
$$ packed form
2313.5G75843658l3340K90298m86679N4093l85895j80893K50320P9346r43374r71222
2323.2G73516312O50329O26908M07409r4452j62735o26678K05612l50571j150055P32575
2332.8G73754654l12576k36359o13556l40881O33850J98440j37405j246796J067124
2341.5G72766495J209335j06506j494828j562500N58091r3689Q45794J537781J362229
2350.2G75022202m883j416016n73807r77478o45981K20337L69645K04315p03430k020112
2359.8G69474792o85348J57547m0054K645111R40399q20541r32236m17175n11933q24203
2369.5G68986359J688232N71747m94843R9259J14136j54725J69144R81598q7509k71149
2379.1G71602249l02429n38178l32794k66113L05N7755O06994M15726K2125n7525j97831
$$ plain form
2389.7 771010284 771021729 770782700 770335159 769959717 769945679 769703140 769370804 769291153 769152298 769364700
2399.4 769364700 769460678 769496613 769562454 769492340 769029999 768657227 768499985 767937622 767762680 767516708
2409 767516708 767528915 767823715 767975464 768129730 767577057 767258148 766967773 766512604 766297531 766134262
2418.7 766134262 766089859 765936813 765918274 765834122 765724792 765492706 765286560 764980392 764420242 764022751
2428.3 764022751 763666840 763659363 763364944 763215256 763478317 763550034 763689194 763447647 762900543 762195816
2438 762195816 761924744 761762314 761090088 760554123 760494385 760647278 760669174 760955505 760887451 760741806
2447.6 760741806 760435181 759608994 759113464 758535767 758145828 757789001 757878418 758155518 757952957 758155899
2457.2 758155899 758091965 757719269 757517853 757579269 757098999 756202087 755616150 755004654 755023956 755089417
$$ packed form
2389.7G71010284J1445k39029m47541l75442j4038k42539l32336p9651j38855K12402
2399.4G69364700R5978L5935O5841p0114m62341l72772j57242n62363j74942k45972
2409G67516708J2207K94800J51749J54266n52673l18909k90375m55169k15073j63269
2418.7G66134262m4403j53046j8539q4152j09330k32086k06146l06168n60150l97491
2428.3G64022751l55911p477k94419j49688K63061P1717J39160k41547n47104p04727
2438G62195816k71072j62430o72226n35965n9738J52893K1896K86331o8054j45645
2447.6G60741806l06625q26187m95530n77697l89939l56827Q9417K77100k02561K02942
2457.2G58155899o3934l72696k01416O1416m80270q96912n85937o11496J9302O5461
$$ plain form
2466.9 755089417 754949493 755083313 755693741 756097336 755697632 755107422 754283371 753866425 753414001 753175125
2476.5 753175125 752913437 752317886 752793121 753137817 753441772 753672409 753230591 752641754 752074585 751852570
2486.2 751852570 751381378 751024933 750655212 750276260 750450363 750661850 750825424 751231842 751268768 750521317
2495.8 750521317 750499191 750398636 749592438 749031830 748759003 748876953 748777466 748998184 749051666 748976212
2505.5 748976212 749170685 748905716 748995895 748801193 748156052 747639618 747425003 747387619 747347260 747575073
2515.1 747575073 747425156 747424698 747506104 747198334 746910934 746637497 746351242 745987701 745737457 745557022
2524.7 745557022 745361786 745016251 745231857 745812836 745726242 745187149 744438553 744142380 744067535 743892059
2534.4 743892059 743451538 742781601 742623596 742919083 743036194 742526855 742443695 742391739 741845932 741436157
$$ packed form
2466.9G55089417j39924J33820O10428M03595l99704n90210q24051m16946m52424k38876
2476.5G53175125k61688n95551M75235L44696L03955K30637m41818n88837n67169k22015
2486.2G51852570m71192l56445l69721l78952J74103K11487J63574M06418L6926p47451
2495.8G50521317k2126j00555q06198n60608k72827J17950r9487K20718N3482p5454
2505.5G48976212J94473k64969R0179j94702o45141n16434k14615l7384m0359K27813
2515.1G47575073j49917m58Q1406l07770k87400k73437k86255l63541k50244j80435
2524.7G45557022j95236l45535K15606N80979q6594n39093p48596k96173p4845j75476
2534.4G43892059m40521o69937j58005K95487J17111n09339q3160n1956n45807m09775
$$ plain form
2544 741436157 741116867 741140213 740811768 740318069 739969482 739830399 739768219 739468613 739664078 739813232
2553.7 739813232 739591827 738857117 738237915 738260040 738018188 737611389 737417908 737615051 737554550 737265549
2563.3 737265549 737160263 737028046 736680298 736068497 735606918 735278091 735226364 734813385 734146652 733844376
2573 733844376 734024124 734591599 734631195 734644928 734219437 733474197 732929306 732203522 731922302 731564026
2582.6 731564026 731244431 731125870 731134796 731316071 731469955 731613693 731374741 731119385 730715942 730320435
2592.2 730320435 729813614 729264908 729045563 728768616 729113159 729731522 729979858 729552460 728826599 728496704
2601.9 728496704 728320770 728059845 727549820 727308578 726926346 726525269 726359863 726424713 726794662 726484222
2611.5 726484222 726154861 726122742 726032028 725388718 724569244 724093170 723264389 722910309 722659378 722371902
$$ packed form
2544G41436157l19290K3346l28445m93699l48587j39083o2180k99606J95465J49154
2553.7G39813232k21405p34710o19202K2125k41852m06799j93481J97143o0501k89001
2563.3G37265549j05286j32217l47748o11801m61579l28827n1727m12979o66733l02276
2573G33844376J79748N67475L9596J3733m25491p45240n44891p25784k81220l58276
2582.6G31564026l19595j18561Q926J81275J53884J43738k38952k55356m03443l95507
2592.2G30320435n06821n48706k19345k76947L44543O18363K48336m27398p25861l29895
2601.9G28496704j75934k60925n10025k41242l82232m01077j65406O4850L69949l10440
2611.5G26484222l29361l2119r0714o43310q19474m76074q28781l54080k50931k87476
$$ plain form
2621.2 722371902 722337341 722241669 722095337 721694107 721730423 721390610 720643082 720160522 719565659 719057007
2630.8 719057007 718661346 718455505 718281326 718163986 717623444 717056198 716917572 716299133 715669327 715123444
2640.5 715123444 714407349 713993835 713781662 713607864 713547287 713014908 712473679 712306519 711630859 710946350
2650.1 710946350 710018234 709132462 708853149 708480911 708370361 708590622 708489075 707773361 707374268 706890869
2659.8 706890869 706152954 706127167 705966110 705414200 704712372 704497223 704675293 704457397 703830795 703404160
2669.4 703404160 703358917 702903061 702563400 701711121 700861740 701058578 700946121 700498734 700244522 700446396
2679 700446396 700089111 699171448 698380051 698202209 698631058 698023911 697413101 697117081 696740341 696350403
2688.7 696350403 696017380 696217041 696020432 695842133 695252151 694515457 694308319 694176636 694156265 693624954
$$ packed form
2621.2G22371902l4561r5672j46332m01230L6316l39813p47528m82560n94863n08652
2630.8G19057007l95661k05841j74179j17340n40542n67246j38626o18439o29806n45883
2640.5G15123444p16095m13514k12173j73798o0577n32379n41229j67160o75660o84509
2650.1G10946350r28116q85772k79313l72238j10550K20261j01547p15714l99093m83399
2659.8G06890869p37915k5787j61057n51910p01828k15149J78070k17896o26602m26635
2669.4G03404160m5243m55856l39661q52279q49381J96838j12457m47387k54212K01874
2679G00446396l57285r17663p91397j77842M28849o07147o10810k96020l76740l89938
2688.7F96350403l33023J99661j96609j78299n89982p36694k07138j31683k0371n31311
$$ plain form
2698.3 693624954 693415298 693044968 692208099 691386566 690646591 690699768 690645142 690378113 690101471 689912872
2708 689912872 689526520 688853836 688429108 687912445 687639236 687101059 686557922 686416473 685979004 685562668
2717.6 685562668 685245514 684693298 684228973 684411469 684075394 683339996 683217316 683156891 683050613 682543106
2727.3 682543106 681877899 681593170 681530457 681247635 680761795 680525513 680344620 680035477 679810638 679631958
2736.9 679631958 678928070 678419189 678443069 678472900 678376541 677845154 677450104 677124405 676711655 676458054
2746.5 676458054 676472549 676290970 675871048 675827332 675317154 674869308 674483490 674042053 674114761 673855896
2756.2 673855896 673546066 673388672 673488235 673090134 672426758 672443695 672550278 672821503 672344360 671753845
2765.8 671753845 671738663 671447067 671063766 670553055 670226669 670269165 670567017 670531158 670341187 669972229
$$ packed form
2698.3F93624954k09656l70330q36869q21533p39975N3177n4626k67029k76642j88599
2708F89912872l86352o72684m24728n16663k73209n38177n43137j41449m37469m16336
2717.6F85562668l17154n52216m64325J82496l36075p35398j22680o0425j06278n07507
2727.3F82543106o65207k84729o2713k82822m85840k36282j80893l09143k24839j78680
2736.9F79631958p03888n08881K3880K9831r6359n31387l95050l25699m12750k53601
2746.5F76458054J4495j81579m19922m3716n10178m47846l85818m41437P2708k58865
2756.2F73855896l09830j57394R9563l98101o63376J6937J06583K71225m77143n90515
2765.8F71753845j5182k91596l83301n10711l26386M2496K97852l5859j89971l68958
$$ plain form
2775.5 669972229 668977356 668257828 667847366 667784271 667495575 666802597 666583481 666470032 666187820 665875168
2785.1 665875168 665739746 665554504 665143433 664485321 663645935 662921906 662375183 661899643 661495056 661287613
2794.8 661287613 660571518 659862137 659728928 659195938 658322449 657731400 657144928 656018600 655256958
2803.4 655256958 654726257 653887558 653524246 653328934 652893600 652054291 651047134 650018082 649195938
2812.1 649195938 648765945 647823334 646536026 645670624 645272446 644822311 644001389 643124771 642358627
2820.8 642358627 641443100 640542908 639565468 638105621 637027740 636096268 635108833 634450302 633578911
2829.5 633578911 632764091 632272606 631777534 630443153 628710098 627419853 626485176 625514908 623881569
2838.2 623881569 622251701 620657806 619166527 617790070 616388588 615204430 613534279 611735992
$$ packed form
2775.5F69972229r94873p19528m10462o3095k88696o92978k19116j13449k82212l12652
2785.1F65875168j35422j85242m11071o58112q39386p24029n46723m75540m04587k07443
2794.8F61287613p16095p09381j33209n32990q73489n91049n86472j126328p61642
2803.4F55256958n30701q38699l63312j95312m35334q39309j007157j029052q22144
2812.1F49195938m29993r42611j287308q65402l98178m50135q20922q76618p66144
2820.8F42358627r15527r00192r77440j459847j077881r31472r87435o58531q71391
2829.5F33578911q14820m91485m95072j334381j733055j290245r34677r70268j633339
2838.2F23881569j629868j593895j491279j376457j401482j184158j670151j798287
$$ plain form
2845.9 611735992 609660110 607467079 605360489 603201065 601505013 599786568 598510628 597501183
2853.6 597501183 596606789 595748177 594505119 593521805 592792702 592569847 591974144 590627747 589431152
2862.3 589431152 588615952 587703972 586315689 585314331 583998299 582119141 580113182 577919426 576178894
2870.9 576178894 574551697 572774620 570619011 568393059 566554909 564798965 563117523 561619568
2878.7 561619568 560309143 558749504 557288971 556091156 554644356 553334427 552338371 551198692
2886.4 551198692 550505600 550408745 549654427 548975105 548626938 548121071 547807541 547128716 546610947 546387024
2896 546387024 546051483 545611229 545045471 544672089 544384689 544297523 544187393 543845901 543149529 542294044
2905.7 542294044 541406937 540294189 539413757 538321571 537232552 536469193 535181427 533279266 531527443
$$ packed form
2845.9F11735992k075882k193031k106590k159424j696052j718445j275940j009445
2853.6E97501183q94394q58612j243058r83314p29103k22855n95703j346397j196595
2862.3E89431152q15200r11980j388283j001358j316032j879158k005959k193756j740532
2870.9E76178894j627197j777077k155609k225952j838150j755944j681442j497955
2878.7E61619568j310425j559639j460533j197815j446800j309929r96056j139679
2886.4E51198692o93092r6855p54318o79322l48167n05867l13530o78825n17769k23923
2896E46387024l35541m40254n65758l73382k87400q7166j10130l41492o96372q55485
2905.7E42294044q87107j112748q80432j092186j089019p63359j287766j902161j751823
$$ plain form
2914.3 531527443 530195465 528359756 526090851 524079437 522371025 520750923 519263840 518034782
2922.1 518034782 516861420 516022110 515219803 514783440 514723625 514096298 513579216 513476830 513638573 514245529
2931.7 514245529 515036354 515558014 516146164 517447319 518911018 520262413 522148705 524350204 526248703
2940.4 526248703 528379745 530696335 532866821 534893341 536868057 539234657 541320686 543369179
2948.1 543369179 545696259 547807312 550023041 552280197 554419060 556390915 558332100 560172424
2955.8 560172424 561807556 563632126 565965881 568085022 569958191 572213211 573940010 575654488
2963.5 575654488 577723236 579614143 581242294 582752228 584585762 586268959 588274803 590178146
2971.2 590178146 591746750 593462677 594965134 596315536 597358437 599035797 600563774 601842308
$$ packed form
2914.3E31527443j331978j835709k268905k011414j708412j620102j487083j229058
2922.1E18034782j173362q39310q02307m36363n9815o27327n17082j02386J61743O06956
2931.7E14245529P90825N21660N88150J301155J463699J351395J886292K201499J898499
2940.4E26248703K131042K316590K170486K026520J974716K366600K086029K048493
2948.1E43369179K327080K111053K215729K257156K138863J971855J941185J840324
2955.8E60172424J635132J824570K333755K119141J873169K255020J726799J714478
2963.5E75654488K068748J890907J628151J509934J833534J683197K005844J903343
2971.2E90178146J568604J715927J502457J350402J042901J677360J527977J278534
$$ plain form
2979 601842308 603718185 604981537 606029549 607020226 608332672 609632530 610108948 610951805 612103767
2987.6 612103767 612883034 613936539 615214729 615885468 616740494 617397881 617519722 617974167 618174324
2996.3 618174324 618263321 618686180 619259834 619222603 619076920 619115372 619011459 619661827 620035172 619647141
3006 619647141 619373322 619516487 619511566 619192734 618878899 618130684 617587204 617109375 616753159 616374664
3015.6 616374664 615800972 615539856 614817352 614270096 613828697 613209496 612625656 611660080 610770607 610158501
3025.2 610158501 609492798 608256607 607466316 607417145 607207832 606358910 604838333 603679161 603013725
3033.9 603013725 602804947 602020760 600382729 599054489 598289490 597750778 596678352 595573845 594712181
3042.6 594712181 594079666 593292198 592075195 591010132 589896584 589153404 588202171 586912880 585836792
$$ packed form
2979F01842308J875877J263352J048012R90677J312446J299858M76418Q42857J151962
2987.6F12103767P79267J053505J278190O70739Q55026O57387J21841M54445K00157
2996.3F18174324Q8997M22859N73654l7231j45683L8452j03913O50368L73345l88031
3006F19647141k73819J43165m921l18832l13835p48215n43480m77829l56216l78495
3015.6F16374664n73692k61116p22504n47256m41399o19201n83840r65576q89473o12106
3025.2F10158501o65703j236191p90291m9171k09313q48922j520577j159172o65436
3033.9F03013725k08778p84187j638031j328240p64999n38712j072426j104507q61664
3042.6E94712181o32515p87468j217003j065063j113548p43180r51233j289291j076088
$$ plain form
3051.3 585836792 584537735 583325615 582290764 581637840 581240692 580403442 578991203 577471619 575764122
3060 575764122 574396782 573905525 573239136 572368240 571202087 570313644 569582977 568130264 566984138
3068.6 566984138 565982552 565097504 564137535 562774010 561331825 560339317 560057487 559382401 558446541
3077.3 558446541 557099037 555480804 554319649 553535423 552878380 551764870 550748749 549326057 548011513
3086 548011513 547317009 546000443 545272217 544993591 543991203 542491417 540796852 539770813 539138603
3094.7 539138603 537634659 535897446 535185471 534788551 534063950 533093071 531906624 530815506 530015945
3103.4 530015945 528849945 527286148 526044388 524805450 523669395 522626572 521613083 521096115
3111.1 521096115 520836372 520233536 519187698 518343964 516808662 514943924 514191628 513204689 511706886
$$ packed form
3051.3E85836792j299057j212120j034851o52924l97148q37250j412239j519584j707497
3060E75764122j367340m91257o66389q70896j166153q88443p30667j452713j146126
3068.6E66984138j001586q85048r59969j363525j442185r92508k81830o75086r35860
3077.3E58446541j347504j618233j161155p84226o57043j113510j016121j422692j314544
3086E48011513o94504j316566p28226k78626j002388j499786j694565j026039o32210
3094.7E39138603j503944j737213p11975l96920p24601r70879j186447j091118p99561
3103.4E30015945j166000j563797j241760j238938j136055j042823j013489n16968
3111.1E21096115k59743o02836j045838q43734j535302j864738p52296r86939j497803
$$ plain form
3119.8 511706886 510987625 510552521 508957176 507332458 506783524 506124992 505087242 503939934 502894669
3128.4 502894669 501927490 500726624 499245758 498165703 497416992 496522636 495851135 495008354 494416809
3137.1 494416809 493728867 492407951 491388206 490471840 489230919 487614098 486496353 485759239 484853592
3145.8 484853592 484227448 483417015 482369041 481265335 480530357 480009537 479019279 478001022 477127342
3154.5 477127342 476110229 474901199 473820152 472990608 472061996 470991096 470385971 469712257 468675079
3163.1 468675079 467938957 467058754 466246948 465394974 464472961 463554192 462345695 461319962 460294189
3171.8 460294189 459649200 458997726 458145180 457335281 456363029 455856628 454970245 453835030 452976837
3180.5 452976837 452277069 451841583 451100998 450293350 449305153 448385582 447777939 446835251 445651016
$$ packed form
3119.8E11706886p19261m35104j595345j624718n48934o58532j037750j147308j045265
3128.4E02894669r67179j200866j480866j080055p48711q94356o71501q42781n91545
3137.1D94416809o87942j320916j019745r16366j240921j616821j117745p37114r05647
3145.8D84853592o26144q10433j047974j103706p34978n20820r90258j018257q73680
3154.5D77127342j017113j209030j081047q29544r28612j070900o05125o73714j037178
3163.1D68675079p36122q80203q11806q51974r22013r18769j208497j025733j025773
3171.8D60294189o44989o51474q52546q09899r72252n06401q86383j135215q58193
3180.5D52976837o99768m35486p40585q07648r88197r19571o07643r42688j184235
$$ plain form
3189.2 445651016 444946175 444648743 444046555 443124352 442171135 441751366 441108322 440012474 439267998
3197.9 439267998 438458900 437840576 437281532 436335487 435350380 434756508 434132080 433365440 432420120 431322212
3207.5 431322212 431150742 430730133 429939804 429240875 428347740 427911949 427014618 426380615 426171989 425864754
3217.2 425864754 425649719 424898758 424008713 422981796 422119560 421489868 420822182 420147743 419460754
3225.8 419460754 418698502 418043518 418218880 417997780 417108727 416317024 415906258 415411644 414159737
3234.5 414159737 413539391 413004494 412035484 411494751 411294937 410959892 410268517 409710922 409264221 409307060
3244.2 409307060 408893318 407838287 407192612 406588287 406212425 405723038 405084686 404300461 403900414
3252.8 403900414 403790932 403334274 403207321 402490196 401385460 400694733 400173988 399678574 399610901 399908981
$$ packed form
3189.2D45651016p04841k97432o02188r22203r53217m19769o43044j095848p44476
3197.9D39267998q09098o18324n59044r46045r85107n93872o24428p66640r45320j097908
3207.5D31322212j71470m20609p90329o98929q93135m35791q97331o34003k08626l07235
3217.2D25864754k15035p50961q90045j026917q62236o29692o67686o74439o86989
3225.8D19460754p62252o54984J75362k21100q89053p91703m10766m94614j251907
3234.5D14159737o20346n34897r69010n40733j99814l35045o91375n57595m46701M2839
3244.2D09307060m13742j055031o45675o04325l75862m89387o38352p84225m00047
3252.8D03900414j09482m56658j26953p17125j104736o90727n20745m95414o7673K98080
$$ plain form
3262.5 399908981 399228897 398616295 398349342 397571831 397026711 396967087 396868820 396405144 395929527 395387802
3272.1 395387802 394999580 394393501 393726883 393367767 392629929 392175140 391927567 391499901 390852776 390387993
3281.8 390387993 390215607 390054817 390087891 389530067 389055901 388882103 388691521 388562164 387983932 387558861
3291.4 387558861 387184944 386866302 386314545 385883789 386119270 385705032 385079269 384821434 384476089 383820724
3301 383820724 383353844 383371582 382948074 382388115 382143669 382036400 381711082 380773621 380099373 379923897
3310.7 379923897 379437027 378927536 378716125 378472137 378080444 377699318 377397156 376794395 376322365 376006927
3320.3 376006927 375564957 375206604 374633064 374291458 373896255 373394737 372895508 372141647 371899414 371654015
3330 371654015 371134758 370339279 369795685 370005264 370059814 369886932 369105682 368298302 368153419 367822495
$$ packed form
3262.5C99908981o80084o12602k66953p77511n45120n9624r8267m63676m75617n41725
3272.1C95387802l88222o06079o66618l59116p37838m54789k47573m27666o47125m64783
3281.8C90387993j72386j60790L3074n57824m74166j73798j90582j29357n78232m25071
3291.4C87558861l73917l18642n51757m30756K35481m14238o25763k57835l45345o55365
3301C83820724m66880J7738m23508n59959k44446j07269l25318r37461o74248j75476
3310.7C79923897m86870n09491k11411k43988l91693l81126l02162o02761m72030l15438
3320.3C76006927m41970l58353n73540l41606l95203n01518m99229p53861k42233k45399
3330C71654015n19257p95479n43594K09579N4550j72882p81250q07380j44883l30924
$$ plain form
3339.6 367822495 367165031 366450996 365652695 364866257 364358368 363856926 363755684 363543358 362886429 362508392
3349.3 362508392 361923370 361667480 361328697 360860481 360785370 360226517 359577408 358742905 358030968 357593689
3358.9 357593689 357251816 357314682 356856308 356281586 356040535 355680656 355209732 354657364 354188843 353374786
3368.6 353374786 352443123 352096138 351694336 351154213 351140747 350958557 350452118 350023232 349672050 349708023
3378.2 349708023 349360580 348633461 348028374 347190361 346906891 346973495 346709709 346589699 346340294 346095276
3387.8 346095276 345833969 345173454 344956360 344928017 344116631 343542862 344062805 344343796 343715096 343021812
3397.5 343021812 342890892 343320770 343352890 342852898 342506104 342391930 342395058 342111015 342174034 342556305
3407.1 342556305 342283058 341423607 340969353 341506538 341764145 341143608 340495300 340574684 340815811 340738907
$$ packed form
3339.6C67822495o57464p14035p98301p86438n07889n01442j01242k12326o56929l78037
3349.3C62508392n85022k55890l38783m68216p5111n58853o49109q34503p11937m37279
3358.9C57593689l41873O2866m58374n74722k41051l59879m70924n52368m68521q14057
3368.6C53374786r31663l46985m01802n40123j3466j82190n06439m28886l51182L5973
3378.2C49708023l47443p27119o05087q38013k83470O6604k63786j20010k49405k45018
3387.8C46095276k61307o60515k17094k8343q11386n73769N19943K80991o28700o93284
3397.5C43021812j30920M29878L2120m99992l46794j14174L128k84043O3019L82271
3407.1C42556305k73247q59451m54254N37185K57607o20537o48308P9384K41127p6904
$$ plain form
3416.8 340738907 340744438 340713806 341007576 340735092 340079269 340270615 340460205 340513878 340354538 340264168
3426.4 340264168 340241852 340304337 341067543 341363182 340720978 340608177 341336021 341730843 341792259 341558571
3436.1 341558571 341138268 341355438 342065392 342560120 342628746 343090973 343243141 343189507 343531723 343803062
3445.7 343803062 344855537 344748726 343987389 344394608 344662209 345411758 346016502 345994453 346369209 346773720
3455.3 346773720 347177086 347644577 347701035 347570190 347718430 348115845 348775177 349422112 350060005 350933266
3465 350933266 351997604 352402306 352012939 352030258 352311821 353053513 353766823 354086647 355098534 355984764
3474.6 355984764 355862350 355700340 356592827 357814331 358425980 358867798 359428101 359669533 359791451
3483.3 359791451 360667381 361082802 360861778 361371689 362459183 363466148 364221001 364803009 364979630
$$ packed form
3416.8C40738907N531l0632K93770k72484o55823J91346J89590N3673j59340r0370
3426.4C40264168k2316O2485P63206K95639o42204j12801P27844L94822O1416k33688
3436.1C41558571m20303K17170P09954M94728O8626M62227J52168n3634L42216K71339
3445.7C43803062J052475j06811p61337M07219K67601P49549O04744k2049L74756M04511
3455.3C46773720M03366M67491N6458j30845J48240L97415O59332O46935O37893Q73261
3465C50933266J064338M04702l89367J7319K81563P41692P13310L19824J011887Q86230
3474.6C55984764j22414j62010Q92487J221504O11649M41818N60303K41432J21918
3483.3C59791451Q75930M15421k21024N09911J087494J006965P54853N82008J76621
$$ plain form
3492 364979630 365406609 365769958 366265717 367529297 368006096 367999687 368732224 370075302 371081085 372119713
3501.6 372119713 373066864 372383804 371879616 372622299 373842163 375142708 376756020 377184219 376270447
3510.3 376270447 376821365 377724113 378682365 379710388 380639038 381539955 381866302 382210693 382707176
3519 382707176 383073540 383690987 385482826 386306267 385964775 387346916 388934174 389956894 390406265
3527.7 390406265 391446495 392036819 392634850 393597984 393599205 394610901 395481339 396643372 397202148
3536.4 397202148 396547165 397867050 399452477 400783081 401318932 402137794 403415451 404820518 405940895
3545 405940895 406064491 407856102 407523193 408019142 409991493 411489220 413328743 412317238 413009300
3553.7 413009300 414215202 415541916 417636070 418209457 419609756 420374947 421448746 422675591 424851532
$$ packed form
3492C64979630M26979L63349M95759J263580M76799o409P32537J343078J005783J038628
3501.6C72119713R47151o83060n04188P42683J219864J300545J613312M28199r13772
3510.3C76270447N50918R02748R58252J028023R28650R00917L26347L44391M96483
3519C82707176L66364O17447J791839Q23441l41492J382141J587258J022720M49371
3527.7C90406265J040230N90324N98031R63134J221J011696Q70438J162033N58776
3536.4C97202148o54983J319885J585427J330604N35851Q18862J277657J405067J120377
3545D05940895J23596J791611l32909M95949J972351J497727J839523j011505O92062
3553.7D13009300J205902J326714K094154N73387J400299P65191J073799J226845K175941
$$ plain form
3562.4 424851532 426494751 426549988 430718689 432177620 431656914 431650658 430389290 433893585 436309738
3571.1 436309738 437756233 439077454 440400200 442411079 444273453 445939484 446442108 449004974
3578.8 449004974 451129761 451554794 453025436 455031166 457051735 458942528 463611069 465365486
3586.5 465365486 462876205 463665314 462809105 466014595 469748497 473009567 474550171 475602303 479542084
3595.2 479542084 478120575 480130997 484268684 484703445 487431755 488357582 489338188 491823235 493450699
3603.9 493450699 495630760 498999977 501949043 501567650 505583115 505060616 503989601 511587715 512680397
3612.5 512680397 511243896 515365868 514723282 518960800 523629875 524607849 526136398 523847694 525024757
3621.2 525024757 528793678 531428947 533462563 536118088 538460884 540610161 548003311 547831573
$$ packed form
3562.4D24851532J643219N5237M168701J458931n20706o256j261368L504295K416153
3571.1D36309738J446495J321221J322746K010879J862374J666031N02624K562866
3578.8D49004974K124787M25033J470642K005730K020569J890793M668541J754417
3586.5D65365486k489281P89109q56209L205490L733902L261070J540604J052132L939781
3595.2D79542084j421509K010422M137687M34761K728310R25827R80606K485047J627464
3603.9D93450699K180061L369217K949066l81393M015465n22499j071015P598114J092682
3612.5E12680397j436501M121972o42586M237518M669075R77974J528549k288704J177063
3621.2E25024757L768921K635269K033616K655525K342796K149277P393150j71738
$$ plain form
3628.9 547831573 535007210 540533905 546289330 551850624 553058090 551288490 554041176 557460327
3636.6 557460327 559605179 559417076 560576363 563428268 566452332 567280235 567204170 570037231 574276848
3645.3 574276848 580874634 580002441 575793877 581675453 580892563 577288895 576608276 582382965 587296600
3654 587296600 591426468 595836372 586605797 588067932 593702812 595457497 596993027 597515411 599915276
3662.7 599915276 601481209 602781830 603842812 604473114 609810143 613166275 612431641 612799492 605640030
3671.4 605640030 607908325 616402931 625443535 623958244 603660431 608684196 618066330 622730637
3679.1 622730637 619534683 619595413 623051147 625016823 626799393 627268028 627535095 632527809 639917908
3687.8 639917908 630840988 626118584 634103851 628705521 628793259 634785500 636338654 638412781 638791351
$$ packed form
3628.9E47831573j2824363N526695N755425N561294J207466j769600K752686L419151
3636.6E57460327K144852j88103J159287K851905L024064Q27903p6065K833061M239617
3645.3E74276848O597786q72193m208564N881576p82890l603668o80619N774689M913635
3654E87296600M129868M409904r230575J462135N634880J754685J535530N22384K399865
3662.7E99915276J565933J300621J060982O30302N337029L356132p34634L67851p159462
3671.4F05640030K268295Q494606R040604j485291k0297813N023765R382134M664307
3679.1F22730637l195954O0730L455734J965676J782570M68635K67067M992714P390099
3687.8F39917908r076920m722404P985267n398330Q7738N992241J553154K074127L78570
$$ plain form
3696.4 638791351 638323898 639197540 639409180 642155304 645806046 641700821 639065361 643616028 645546417
3705.1 645546417 645586243 645512619 647874680 652482758 645709000 649796677 654016113 639485817 644681625
3713.8 644681625 649719238 650351944 651036453 653233643 654199142 650814514 653383408 659602737 655499878
3722.5 655499878 650731964 655869141 657592010 657477264 654960632 654410019 657780914 659254608 665284805
3731.2 665284805 662690048 655016632 664623413 666389389 656400681 657475967 660706253 660361176
3738.9 660361176 662296906 665532761 660902863 663302231 676137314 670083694 651949310 661257782
3746.6 661257782 667019730 673198853 671851807 662548141 674266052 667269211 659150543 665846558
3754.3 665846558 670093536 673195114 668202515 670671463 676653061 668054276 665868225 669976654
$$ packed form
3696.4F38791351m67453Q73642K11640K746124L650742m105225k635460M550667J930389
3705.1F45546417L9826p3624K362061M608078o773758M087677M219436j4530296N195808
3713.8F44681625N037613O32706O84509K197190R65499l384628K568894O219329m102859
3722.5F55499878m767914N137177J722869j14746k516632n50613L370895J473694O030197
3731.2F65284805k594757p673416R606781J765976r988708J075286L230286l45077
3738.9F60361176J935730L235855m629898K399368J2835083o053620j8134384R308472
3746.6F61257782N761948O179123j347046r303666J1717911o996841q118668O696015
3754.3F65846558M246978L101578m992599K468948N981598q598785k186051M108429
$$ plain form
3762 669976654 671302261 672071228 676371155 674364853 669543457 672684250 677853622 679098282 669716721
3770.7 669716721 670765152 674257507 674851761 675767822 675473022 676623535 677396393 680680542 681257172
3779.4 681257172 672888412 674775085 677319183 679135208 681478195 678144913 677066040 678480530
3787.1 678480530 679168091 679731369 680183716 680705490 680635300 681092834 681022339 683034134 687276917 682856522
3796.7 682856522 677166748 679994507 685844345 692546539 685323181 674286270 678269196 681528244
3804.4 681528244 686726379 692965469 683547821 678368073 683000336 685135727 685131760 685745010 686518707
3813.1 686518707 688281097 694058685 693379288 679491959 682993622 688873825 695102463 698023605
3820.8 698023605 679456406 680285034 685496216 687609482 690942688 691940460 687517548 686647797 688177795
$$ packed form
3762F69976654J325607P68967M299927k006302m821396L140793N169372J244660r381561
3770.7F69716721J048431L492355N94254R16061k94800J150513P72858L284149N76630
3779.4F81257172q368760J886673K544098J816025K342987l333282j078873J414490
3787.1F78480530O87561N63278M52347N21774p0190M57534p0495K011795M242783m420395
3796.7F82856522n689774K827759N849838O702194p223358j1036911L982926L259048
3804.4F81528244N198135O239090r417648n179748M632263K135391l967O13250P73697
3813.1F86518707J762390N777588o79397j3887329L501663N880203O228638K921142
3820.8F98023605j8567199Q28628N211182K113266L333206R97772m422912q69751J529998
$$ plain form
3829.5 688177795 692480316 694806900 685049515 687319031 695331116 689718246 688670883 697219543
3837.2 697219543 688280182 684996948 694642639 688423538 687336349 694623489 692952881 688596191
3844.9 688596191 690863724 692567978 693048096 695348969 693874741 695179672 702329025 697430649
3852.7 697430649 694776154 679283676 682815628 693536453 692479706 690322037 691945190 694490891
3860.4 694490891 698130798 692701569 692298279 701129761 696495590 688444595 692310867 698655853
3868.1 698655853 705775146 697978897 687255478 690968933 698418427 702781448 691916809 691972961
3875.8 691972961 695839081 695895081 697909698 703144684 698463440 689829025 695780334 697311630 699915237
3884.5 699915237 706173630 691206055 690758743 695467682 697328186 701631241 700741959 692360306
$$ packed form
3829.5F88177795M302521K326584r757385K269516Q012085n612870j047363Q548660
3837.2F97219543q939361l283234R645691o219101j087189P287140j670608m356690
3844.9F88596191K267533J704254M80118K300873j474228J304931P149353m898376
3852.7F97430649k654495j5492478L531952J0720825j056747k157669J623153K545701
3860.4F94490891L639907n429229m03290Q831482m634171q050995L866272O344986
3868.1F98655853P119293p796249j0723419L713455P449494M363021j0864639N6152
3875.8F91972961L866120N6000K014617N234986m681244q634415N951309J531296K603607
3884.5F99915237O258393j4967575m47312M708939J860504M303055q89282q381653
$$ plain form
3892.2 692360306 694310684 698558426 697297058 698362808 699125137 701972427 704673157 694281921
3899.9 694281921 699814453 701949463 696203537 702124329 698376694 695592041 695987167 696816940 699350967
3908.6 699350967 699259109 699698563 699934845 699900970 699759293 698894882 700052109 702721024 699538803
3917.3 699538803 696059952 701082916 701494293 697080917 698903885 700744171 702336578 700472107
3925 700472107 697205124 698754120 700636139 702894516 701963501 700696182 703602142 700820236 698080139
3933.7 698080139 700069962 700512161 700580444 700817566 700839081 700975418 700764923 702522659 704068069
3942.3 704068069 699671936 698230209 700191956 701610947 703260193 701746445 702000961 702044601 699066849
3951 699066849 701232529 702857361 701781311 701342392 701503143 702367249 702266617 702593842 702451019
$$ packed form
3892.2F92360306J950378M247742j261368J065750P62329K847290K700730j0391236
3899.9F94281921N532532K135010n745926N920792l747635k784653L95126Q29773K534027
3908.6F99350967r1858M39454K36282l3875j41677q64411J157227K668915l182221
3917.3F99538803l478851N022964M11377m413376J822968J840286J592407j864471
3925G00472107l266983J548996J882019K258377r31015j267319K905960k781906k740097
3933.7F98080139J989823M42199O8283K37122K1515J36337k10495J757736J545410
3942.3G04068069m396133j441727J961747J418991J649246j513748K54516M3640k977752
3951F99066849K165680J624832j076050m38919J60751Q64106j00632L27225j42823
$$ plain form
3959.7 702451019 702313004 702441025 701131287 701259613 702297440 702788544 702913208 703195877 703890076
3968.4 703890076 703723068 702644577 702386475 703045197 702779465 701965561 701873856 701684189 701352386 702406921
3978 702406921 703604126 703441849 702831573 702720795 703511963 703738785 703472748 703472977 703493347 703374557
3987.7 703374557 703165665 703675461 703594131 703216019 703330383 703792343 704414597 703676147 703446198 704049683
3997.3 704049683 703943863 703447342 703352966
4000.2 703352966
$$ packed form
3959.7G02451019j38015J28021j309738J28326J037827M91104J24664K82669O94199
3968.4G03890076j67008j078491k58102O58722k65732q13904r1705j89667l31803J054535
3978G02406921J197205j62277o10276j10778P91168K26822k66037K29K0370j18790
3987.7G03374557k08892N09796q1330l78112J14364M61960O22254p38450k29949O03485
3997.3G04049683j05820m96521r4376
4000.2G03352966
##END=$$ End of the data block
