##TITLE=$$ Begin of the data block
##JCAMP-DX=5.00 $$ ACD/SpecManager v 10.08
##SPECTROMETER/DATA SYSTEM=Varian
##DATE=20 Nov 2012 14:08:02
##DATA TYPE=INFRARED SPECTRUM
##DATA CLASS=XYDATA
##ORIGIN=
##OWNER=
##NPOINTS=3735
##FIRSTX=399.26403809
##LASTX=4000.35498047
##MAXX=4000.35498047
##MINX=399.26403809
##MAXY=77.90730286
##MINY=30.06813049
##XFACTOR=1.0000000000
##YFACTOR=0.000000100000000
##FIRSTY=52.62714005
##DELTAX=0.96440572
##XUNITS=1/CM
##YUNITS=TRANSMITTANCE
##XYDATA=(X++(Y..Y))
399.3 526271400 534210548 541428375 529925156 530325279 540267563 540863914 538740845 541954079 547951469
407.9 547951469 541557884 534230957 535569572 538620834 542610741 545309258 545965652 552498627 562076569
416.6 562076569 562829094 545417480 523955536 528433495 534559174 537415657 538209229 536349373
424.3 536349373 535573387 534166222 538523788 545954514 547088661 543027115 538121262 534799538 532245216
433 532245216 534200859 532042694 526941299 528366432 527479858 528161392 532311325 533472404 530033989
441.7 530033989 534445877 540487213 542176208 547431030 549403496 549065208 545655861 546306076 551859665
450.4 551859665 551996117 553773460 551755943 547503433 545197220 543964691 544971123 542144394 543032074
459.1 543032074 543366928 544909363 545901375 544806023 544780540 542630196 542601700 543420258 540384712
467.7 540384712 535666504 533119507 531857529 533306770 537659264 537485962 535427589 532970886 529728699
476.4 529728699 524083519 523391342 523681488 522059479 523853455 523875732 525287781 523857880 523668213
485.1 523668213 526573715 526730766 526113052 523278542 521675491 520969582 523318634 521896324 517732849
493.8 517732849 521164131 525536118 525734367 523241882 523644562 520005684 515744972 516794243 515714645
502.5 515714645 516565857 516572762 516079674 511063957 507513809 510504494 508867187 507315712 504544487
511.1 504544487 500735207 496913681 498048439 501520844 499415894 497309647 495262260 496111755 494231873
519.8 494231873 491455231 489756889 487430992 486365280 482200165 483154564 485420036 485681801 487598953
528.5 487598953 488463860 488913460 487400627 487087097 485369072 485308609 487737808 488291359 489909630
537.2 489909630 492202682 497041321 501622849 503080978 504063606 507118034 509500313 508180809 506714439
545.9 506714439 506094933 507330933 508881149 509131432 508603401 508108330 507198715 505653839 506785545
554.5 506785545 505399094 502097359 499325218 496643257 497138901 496716576 495555687 493603363 491477013
563.2 491477013 489094963 485986595 485492592 484455757 481570702 477636490 474827652 472635612 470829887
571.9 470829887 469106026 467709160 468898659 468330154 468209229 469514732 471197701 473112717 474648361
580.6 474648361 476607742 478180923 481282005 485643311 490118980 492797203 494585876 496332054
588.3 496332054 498121300 500031281 500378609 500393143 500635529 501335793 501530228 501875839 503304596
597 503304596 504187164 504246101 503617287 503529549 502316055 501808281 501354942 500423622 501810493 502028198
606.6 502028198 503715820 505148849 504767990 504776688 504081001 504491692 504182014 504587708 504420395 504259796
616.3 504259796 507058868 509135132 511164284 513091125 515098877 516613045 517944260 519275398
624 519275398 519634743 520965919 522312279 523297882 524675751 526882133 528171387 528911896 530713425
632.7 530713425 531448021 531659126 532136116 533290100 533165474 532281494 533268471 533776817 534130325 535387497
642.3 535387497 538002090 540151978 539942284 539682732 540551567 541681137 541469727 541493225 542594223
651 542594223 543198662 544226837 546223640 547135315 546814117 547738228 548673058 548304100 547674980 547065315
660.6 547065315 546503983 546162415 547386627 549022675 550620346 553185768 554392128 549293175 550258484
669.3 550258484 551798248 552512474 552634239 553278008 555017891 556067810 557864265 559190483 559077644
678 559077644 560267982 561271744 561695137 561384583 560442734 561412888 562092476 561276779 562066345 563774376
687.6 563774376 564385376 565007172 565988731 566762505 566138306 563993073 562779808 562566566 562070122
696.3 562070122 561815186 561241035 559498749 558315468 558307762 557699051 556706009 555915947 554030266 551414223
705.9 551414223 550276489 550818710 552081299 552714500 552749557 554324913 555716553 555856934 556839714
714.6 556839714 559142151 560962830 561749725 563051910 564352913 567583694 571556702 573708191 576316299
723.3 576316299 579031334 581473541 583526764 585354805 586523476 587685966 590091782 592663498
731 592663498 594603577 595511131 597350388 599235649 600790367 603460579 604509888 603600693 603277321
739.7 603277321 603917999 603739090 603951721 604535942 604524879 605769501 605764008 604142265 602929916 601371384
749.3 601371384 598987427 596084175 593926315 591776237 589973183 588713150 586794968 585387917
757.1 585387917 584160500 583339462 582648735 581009789 578011818 574447670 573089905 573383560 573874054
765.7 573874054 574198570 575668983 578714218 581237297 582826538 584185905 585953140 587480125 589375725
774.4 589375725 592419510 595429115 599165115 603200302 606332588 609324188 612607079 615999260
782.1 615999260 618378677 620861778 622926941 623423767 624711647 626494904 628343391 629691544 632194901
790.8 632194901 635548782 636660156 638438988 640603256 641898575 642534866 643167191 645264969 646198349
799.5 646198349 646203766 647924347 650553436 652916412 655316544 656500549 656876297 656747589 655984573
808.2 655984573 656033707 655402679 655739822 656122513 655275650 655574265 656275940 657170181 657043533 657140732
817.8 657140732 658173218 657929611 655622177 652779922 652177200 653150864 654416962 654172897 654037857
826.5 654037857 655409241 655571136 654584732 652409439 649830551 647303467 644675217 642235947 640110550
835.2 640110550 638879051 638393097 637968903 636356621 634178162 632236214 630732803 629449425 627440186
843.9 627440186 625734901 624189720 622526894 622104034 621793633 620080833 617939911 616203995 614780540
852.5 614780540 612630272 609368477 605972939 603210602 601996574 600343513 598225021 598320770 598892822
861.2 598892822 598753815 599599190 602110672 605308838 608271446 611337891 614633255 618774338 623529930
869.9 623529930 628596497 633261299 637439270 641973724 644703827 646317596 647287598 648192902 649602280
878.6 649602280 649874878 649275513 648206863 647624512 647219467 646533432 644739761 642457886 641065979
887.3 641065979 639104004 635764008 631763763 628719711 626095161 624142342 622717857 620780983
895 620780983 619367142 617877350 616752052 615519714 613059540 610315285 607442131 604914513 602670670
903.7 602670670 600584373 599231873 598121758 595821457 592800674 590138435 586442223 581739502
911.4 581739502 576925201 572589531 569016495 564971237 561172829 557415390 553739357 551498184
919.1 551498184 548560867 545986595 544600449 542702675 540513763 538644447 537500305 536799660 537186546
927.8 537186546 537697754 537703857 537867508 539016914 540359001 540676804 541423416 541801834 542368660 543357735
937.4 543357735 544318962 545992584 547705498 550154495 552283897 554014206 555785179 556271820 555444336
946.1 555444336 553498917 550922890 547735901 544040680 539841576 535770645 531850433 526681213
953.8 526681213 521150017 515697937 510186615 503432198 496289024 489802017 482787552 476072350
961.5 476072350 469479408 463302040 456752052 450755386 444423141 436519737 429037781 420999451
969.2 420999451 413552055 405608749 397745247 390342216 382581902 375135689 367382927 360679131
976.9 360679131 353361053 347153816 341379318 335660858 330155525 324294815 320536537 316310234
984.7 316310234 313519878 310778885 308332119 306582947 304918232 304621792 303415833 304006691 303489971
993.3 303489971 303160419 302859535 302135372 303125935 302772121 303839989 304089165 304953022 305827770 305811405
1003 305811405 306119709 304906406 304930973 304438190 304838886 304167690 303540859 303673725 302617073 302936840
1012.6 302936840 302136383 302674198 302186394 301728306 301469669 300681305 301762772 301614590 303174953
1021.3 303174953 304039021 305648994 306438065 307041607 309853516 310337334 311971512 312053013 313516521
1030 313516521 315389271 316248646 318313046 318711567 320405731 321230965 322787247 323313179 323430901
1038.7 323430901 324003220 323205910 323907471 323294678 323704605 323702049 324614372 325128250 324866982 326618462
1048.3 326618462 326651611 328540115 329184456 330459290 332326546 334048843 337110062 338421211 341321754
1057 341321754 343084831 346516953 350149460 353206978 356995888 359778137 364596024 367672691 371415901
1065.7 371415901 374555435 376054840 376666374 375871506 374830322 370748787 367178612 362539139 358279190
1074.4 358279190 354323425 350349350 348705139 346416779 346734772 346630211 347450600 348876610 350564232
1083 350564232 352700539 353495979 355816841 356338310 358285904 360697975 363667717 366129494 367135391
1091.7 367135391 371003952 373579369 376514664 378136292 379568977 381705704 383133736 384973030
1099.4 384973030 385275841 385991135 385025291 385454330 386431541 386657867 387616463 387442894 388908730
1108.1 388908730 389460907 390944443 392639999 394519539 397019730 398557892 401627045 403538322
1115.8 403538322 406374245 408861084 410574570 411850128 412185860 413692932 413710556 414342957 415300941
1124.5 415300941 416591377 418074951 419807320 422324142 423657188 426168175 428685417 431118164
1132.2 431118164 432272339 432607422 433647690 433878365 434305840 434012527 433376732 431905823 430270309
1140.9 430270309 427576065 423908424 420424080 415948372 413618851 410762444 407701645 405110931
1148.6 405110931 402730980 401205864 398945961 398369446 396884270 396516151 396234207 394980240 394540482
1157.3 394540482 393840981 394687309 394436417 395413742 396754074 398732910 402095337 404827423 408187256
1166 408187256 410874367 415501213 419306946 422956123 428010254 433146324 438846130 443792152 450403862
1174.6 450403862 456060600 460972748 466469345 472221909 478157349 482583885 487552605 492407799
1182.4 492407799 497055359 501976280 506641731 510643768 514750404 519737892 522950859 525032158
1190.1 525032158 527255783 529303131 531215782 532793579 533911743 534451218 535505714 536339493 536859627
1198.8 536859627 538153038 538796921 538519592 538562355 539081993 539350700 539471855 540224380 541851540
1207.4 541851540 543543739 544863472 546110039 547501183 549133873 550616150 551950150 552983475
1215.1 552983475 554229164 555953751 557445755 558585625 559503746 560671120 562010841 562460670 562205200
1223.8 562205200 562084961 561375771 560354805 559533348 558698387 557997589 557192955 556830978 556932869
1232.5 556932869 556865768 556472397 555660286 555031281 554063568 552780380 551909485 551322899 551127090 550992813
1242.2 550992813 551362953 551953392 552306137 552901382 553606720 554092255 554196663 554560165 554996643 555411606
1251.8 555411606 555833931 555940437 556700745 558253822 559431229 560229530 561157646 561619530 561844940
1260.5 561844940 561875191 561580276 561370735 561652489 562582169 563331833 564572296 566173172 567339439
1269.2 567339439 568792419 570006943 570773735 571255417 571337395 571276817 571342812 571640701 572318306 572616806
1278.8 572616806 572720680 573723755 574500847 574205284 573548431 573155289 572543716 572062759 571741371
1287.5 571741371 571180420 571401176 571581116 571595345 571955147 571951714 571454926 570714760 570227966 569125977
1297.1 569125977 567769318 567154617 566467819 565696793 565328827 565179443 564362373 563360901 562948685
1305.8 562948685 561379318 559306564 558957481 558558388 557444954 556850624 556351395 556123352 556077538
1314.5 556077538 555728722 555517311 555006027 554144096 552806969 551347618 550709877 550193176 549623184
1323.2 549623184 548890495 547790184 546515312 544982758 543566437 541927376 539790535 537513809
1330.9 537513809 535363083 533499756 531839905 530417023 529056282 528348808 527677650 527383041 527514534
1339.6 527514534 526903038 526564331 526344109 526263046 525614204 525344505 525868530 526527634 527095413 527025833
1349.2 527025833 527519951 527934303 528250847 528012505 527011223 526442986 525948677 525460434 524562263
1357.9 524562263 524007416 523707695 523325729 523506203 523744278 523203201 522346573 521949768 520790710
1366.6 520790710 520165215 519861526 519358749 519494286 519317245 520137405 521108246 521809654 521683159 521674767
1376.2 521674767 522583847 522950058 523549767 523545952 524009743 524773254 525297623 526428032 527681198 529793625
1385.8 529793625 531667099 532767601 533372192 534659538 535948563 536905670 538036613 538916397 539852905
1394.5 539852905 539112740 539236908 539662628 539597130 538129196 536852837 537001495 536384354 536296349 536053543
1404.2 536053543 534652939 533630180 533525467 533607025 532855263 532407341 531507339 530681992 529146271
1412.8 529146271 527749939 527655602 527247009 526958961 526317482 527311859 525580597 524575996 526165695
1421.5 526165695 525992393 525626488 524224510 524684181 525160332 524948120 525883980 526399078 527503014
1430.2 527503014 527573128 528892822 529793167 529763412 530886955 531664848 531693344 530460091 531841507
1438.9 531841507 532445450 533027191 534428444 535266495 536819077 537056885 537318802 537220345 537537689
1447.6 537537689 536739120 535914841 536737404 536203423 535987625 535175591 535585365 535570183 534502373 533760757
1457.2 533760757 530837173 533120804 532110252 533333740 533616982 533842926 535617790 535303383 537914886
1465.9 537914886 539472923 542425880 544677429 548160439 552217064 554577675 559905853 561633530
1473.6 561633530 566810303 570292282 574506416 578082542 581611443 585759506 588167076 592186928
1481.3 592186928 594342651 597155571 599265060 601278076 604673615 606519470 609778175 611358452
1489 611358452 614508400 615538864 617370338 619912682 621073494 623532028 624406242 624242325 625946503
1497.7 625946503 628026428 628713608 630601158 632712822 632335091 634034042 636034927 639130363 636348724
1506.4 636348724 628188477 634375534 636721497 638474503 639157486 641179886 641718445 643046951 644614563
1515.1 644614563 644890060 646623077 643633652 646481171 648969879 648879700 648540268 649244003 653057709
1523.7 653057709 654699249 655932693 655594177 655863342 655337524 654881058 656272507 656898880 658610992
1532.4 658610992 658769836 657674332 659143753 660619202 662468491 664060822 664193802 655216370 659319382
1541.1 659319382 660828400 660871735 663594208 664256363 663762970 664582901 666120148 667222595 667474594
1549.8 667474594 666374130 667059631 668402176 668994293 667852707 666938629 669947433 673310165 673310623
1558.5 673310623 673261108 665594330 669155655 670500565 670820465 670783005 668771057 668423157 668736420
1567.1 668736420 669152832 669938126 667769928 667674789 668507156 668345032 667740021 667458115 666791916 661799164
1576.8 661799164 661656113 661735229 660721359 659903564 659234924 659032135 658070145 656638031 654908829
1585.5 654908829 653086014 651104050 648757248 646937027 644686661 643457794 642036743 640940094
1593.2 640940094 640162659 638105888 635798187 633348808 631922607 629290199 626859589 624639893
1600.9 624639893 622285385 620881920 618699989 616959381 615095444 614100494 612243195 610561409
1608.6 610561409 608237839 604789276 603381500 600828629 599006042 596818810 596658974 597057610 589677887
1617.3 589677887 590117149 589943085 588974648 586715393 586224556 585418701 580808220 580276756 579819489
1626 579819489 580536728 578640594 577065201 577278099 577066956 576502914 575499191 576549568 577879868
1634.6 577879868 574411545 571266365 573569946 573686714 573613815 574698105 574669418 576126251 576392784
1643.3 576392784 577654953 579495163 579039307 579448547 578019676 579709129 581289177 584038773 586993065
1652 586993065 587891808 587396278 587962265 590718536 592486649 594082603 595219803 596677399 598426170
1660.7 598426170 600766296 603434029 604321556 606736603 609179916 611600037 613786812 616288338
1668.4 616288338 616689148 617948875 621672783 622810783 625141907 628588562 631198311 632112350 634806213
1677.1 634806213 637536087 639783516 642143860 642956924 645542984 648890533 649952469 648430634
1684.8 648430634 651474686 655753403 659027405 660657043 662772827 664260635 665135574 666643982
1692.5 666643982 667779617 670326233 673401489 671170502 673205261 676458817 681519089 686107559
1700.2 686107559 678428650 680406570 682906418 684044800 682963867 683235168 682261047 682924881 684910812
1708.9 684910812 685679932 686299744 687616043 689178391 690233536 689464645 688485718 691230087 693503189
1717.6 693503189 687210236 687683792 689715958 691361771 692743378 693813705 694024048 694472961 694897003
1726.3 694897003 694742661 695284348 696223068 695620193 694580154 696560974 699153214 698305969 696363525
1734.9 696363525 698380356 700835190 701610641 702853775 703337097 701254196 703153915 704777145 705132599
1743.6 705132599 706390610 708458786 709906998 711419830 713174057 713023834 715150528 715608063 715377197
1752.3 715377197 717986603 719626083 721326370 723562317 724263687 725143738 727208633 728795776 730821381
1761 730821381 730604172 729913559 731724548 732609100 733549042 734630737 735802307 735357132 736423798
1769.7 736423798 739093781 739670105 738803864 737357635 739690018 741160355 739929581 740613556 741255493
1778.3 741255493 742821121 743823395 743460770 744253006 745520248 746478653 746120682 745732651 745987244
1787 745987244 746695938 747193604 748208237 749012833 749531555 749273529 748708801 751087189 752260056
1795.7 752260056 751566315 751415710 752181473 752477417 751492157 752935638 753482132 754113159 755135193
1804.4 755135193 755636063 756605759 757020950 757048645 756984634 757764359 756957397 756460114 757117386 757218094
1814 757218094 758319244 758956909 759875107 760412369 760594482 760817261 760163269 760059891 759677734 760609131
1823.7 760609131 761725769 760583115 760397110 761696777 763743591 764641724 762072525 761662216 763137970
1832.3 763137970 763090210 762730484 762852859 763019180 763122940 762678146 763719788 764448929 765143585 765455246
1842 765455246 765885468 766586761 761922226 762196350 763747330 763935623 763739700 764234467 765286484
1850.7 765286484 765252914 765705338 765823135 765809402 765734177 765600357 765873947 765248871 764863281 764907227
1860.3 764907227 765545959 765684357 766091003 766605530 766536026 767271805 767001877 767185745 766814346 765108948
1869.9 765108948 765020065 765669479 766519775 766804733 767533875 768038406 768192902 767743988 767541580 767646179
1879.6 767646179 767038956 767384720 767321320 767450256 767593842 767773819 768599319 768785400 769512482 769085999
1889.2 769085999 767789841 768090439 768532867 768560715 768758545 768871460 768249969 768802032 769301987 769743347
1898.9 769743347 769934158 769685516 769676590 769076385 769106827 768823853 768523483 768730087 768904648 769333572
1908.5 769333572 769890060 770188522 769534607 769875336 769874115 769524536 769389267 769082489 769940109 769097443
1918.2 769097443 768521957 769514389 770367050 771322632 771165771 770427399 770462189 770644379 769968567 769420013
1927.8 769420013 769122849 769289474 769912033 770160599 770578308 770407333 770477066 770464478 770538254 770509415
1937.5 770509415 769793243 770022583 769958725 770550308 771035004 770168839 770684509 771349411 771402588 770772781
1947.1 770772781 770490341 770238876 769972534 770216904 770265274 770236588 770440369 771068954 771343155 771473999
1956.7 771473999 771370163 771399384 771621628 771212311 770789337 770274658 770330658 770495224 770771408 771586914
1966.4 771586914 772026825 772070999 771905136 771969681 771641541 771509705 771397324 770730591 770464172 770563889
1976 770563889 771179352 771508026 771792297 772177658 772528381 772646866 772020035 771531906 771274185 771414413
1985.7 771414413 771103439 770855713 771095734 771177368 772021561 772730865 772719498 772266922 772067947 771714325
1995.3 771714325 771236343 771282272 771008606 770983734 771134949 771327591 771419678 771590958 772286224 772599716
2005 772599716 772296753 771765060 771606293 770930557 770236740 769859467 769618225 770302734 770803680 771088028
2014.6 771088028 771164474 771228561 770858231 770215073 770081940 769521027 768961105 768474884 768571625 769001541
2024.2 769001541 769416275 769658356 769536972 769854736 769386368 768817139 768277359 767765350 767680130 767338181
2033.9 767338181 767540665 767430191 767556076 767989120 767722397 767500992 767554703 767183380 766455688 766394043
2043.5 766394043 765888824 765937500 766554337 766513596 766822662 766958313 766945572 766503754 766461563 766728668
2053.2 766728668 766268234 765832367 765305939 765286942 765516357 765895844 766352768 766643982 766808090 766666794
2062.8 766666794 766950531 766527328 765520248 765299911 765378189 765451431 765768509 766171265 766511612 766773148
2072.5 766773148 766741714 767251434 767371368 767211685 767289047 766712036 766303177 765687714 765614243 766261292
2082.1 766261292 766812439 767269287 767220917 767407303 767427673 767140961 766868668 766678009 766394958 765957947
2091.7 765957947 765875854 765971756 766440430 766884995 767354431 767626190 767564621 767469940 767093353 767008362
2101.4 767008362 766791382 766604462 766652756 767000427 767493820 767567978 767811508 768164139 768637009 768642197
2111 768642197 768095551 767326736 766843185 766979752 766933212 767117462 767380753 767852554 768288651 768506775
2120.7 768506775 768608093 768293915 768110962 767461929 767258301 767407837 767509155 767817154 767449646 767590637
2130.3 767590637 768117294 768334045 768293228 768392181 768558350 768147812 767714844 767466660 767550812 767568741
2140 767568741 767968750 768406830 768445892 768677826 768468933 768341217 768259354 768057022 767625732 767084503
2149.6 767084503 766896133 766992645 767683945 768309708 768853455 769129715 769188309 769079132 768799438 768659210
2159.3 768659210 768004684 767615738 767644424 767993469 768098907 768365936 769434433 769899063 770357285 770497742
2168.9 770497742 770215302 769744720 769243774 769158096 768942413 769213638 769416504 769735260 770323029 771093369
2178.5 771093369 772004471 772203522 772137985 771653061 771547546 771513214 771187668 771135178 771055298 771222458
2188.2 771222458 771572189 772470779 772991333 773087234 773147659 773008499 773046951 772826920 772700119 772457809
2197.8 772457809 772760086 773180084 773187790 773432236 773471832 774075699 774609070 774571457 774337463 774314499
2207.5 774314499 774315491 774085236 774289856 774282608 774447174 774581528 774983215 775568085 775418930 775343933 775318604
2218.1 775318604 775504837 775335922 775349655 775486221 775378189 775855103 775891876 775921631 775995331 776049957
2227.7 776049957 776020203 775784149 775757904 775531235 775800323 776244278 776725922 777120438 777202377 777251511
2237.4 777251511 777155991 777027054 776525269 776346893 776236420 775999222 776240768 776803207 776959915 776870956
2247 776870956 777471161 777700500 777728806 777394791 776969376 777049484 776922226 777042694 776550674 776534042
2256.7 776534042 777373199 777648773 777687759 777891083 777960510 777414169 777471542 777460785 777292480 777308960
2266.3 777308960 777122498 777374878 777282486 777562180 778015976 778152237 778249664 778253937 778139343 777584839
2275.9 777584839 777513428 777475891 777565918 777530823 777467117 777898865 778119431 778520126 778695908 779073029
2285.6 779073029 778926468 778253479 778104935 777981262 778086472 777769852 777697830 777772980 778062439 778259735
2295.2 778259735 777897720 778205185 778238220 778157883 777806244 777620926 777487564 776907272 777088547 777232208
2304.9 777232208 777507324 777479172 777653351 777827835 777539139 777604065 777252884 777620926 777672424 777450180
2314.5 777450180 777441101 777054367 777032166 776790619 776489410 776360855 776999207 776208725 775353928 776045609
2324.2 776045609 775899429 775902939 775394516 774859314 773930740 774202805 775462799 775196152 774646454 773609314
2333.8 773609314 774363861 774258499 773559494 774540558 775078735 775687027 775333176 774899902 774295731 773930359
2343.4 773930359 772649689 771518784 772952881 773757477 774640503 775721130 776066132 775027618 774122314
2352.1 774122314 774271317 773529053 773392334 773792267 773002777 771394501 770749588 770306168 770966492
2360.8 770966492 771314545 770532227 772217712 771763687 770356064 770018463 770317459 770542831 770213394
2369.5 770213394 771879654 772105942 771442795 771854858 772191238 772123032 772324753 773000488 773012543 773162994
2379.1 773162994 773096542 772621002 772001572 771720428 771875992 771761322 772126617 772430344 772727814 772848282
2388.8 772848282 772501526 772368774 772212143 772160645 771687851 771250000 771073761 771088409 771211548 771005020
2398.4 771005020 771006622 771051559 771480484 771493225 770958710 770591965 770259857 770260925 769968033 769702225 769529419
2409 769529419 769419479 769344254 769210510 769232483 768903580 768706284 768318481 767787018 767555542 767528381
2418.7 767528381 767642975 767671967 767746735 767457199 767069473 766597443 766341248 766193542 765804520 765643768
2428.3 765643768 765254440 765204544 765263748 765076828 764786377 764488373 764653168 764582596 764224548 763605347
2438 763605347 763328018 763384933 762973175 762563553 762415619 762248764 761824493 761839523 762309570 762617874
2447.6 762617874 761870041 760662003 760197678 759762878 759530563 759215546 759297714 759600983 759395676 759641495
2457.2 759641495 759544220 759297714 759156647 758739624 758438187 758056641 757381210 756609268 756215134 756164398
2466.9 756164398 756454468 756851807 757329330 757241898 756861191 756699982 755960770 755708313 755233002 754386139
2476.5 754386139 754057159 753876114 754355240 754751968 754976959 755114670 754971161 754371567 753691940 753627472
2486.2 753627472 753323898 752844086 752233124 751954346 752051773 752180176 752508850 752626038 752717896 752478180
2495.8 752478180 752310181 751871414 751103439 750896988 750496902 750197372 750392990 750716400 750939026 751248550
2505.5 751248550 751172409 750658493 750496292 750136032 749524155 748995514 749007721 749089355 748953171 749040375
2515.1 749040375 749034348 749123306 748913116 748562164 748236160 747897034 747580490 747267914 747265472 747120819
2524.7 747120819 747203140 746952972 746686630 747304535 747534714 747092743 746429672 746025620 745800247 745580826
2534.4 745580826 745199509 744774399 744436340 744247818 744546432 744279938 743981476 744008560 743763199 743576126
2544 743576126 743172073 742530670 741837082 741790695 742057877 742056503 741949844 741844635 741749878 741506500 741316986
2554.6 741316986 740426941 739541321 739277115 739108887 738998489 738831558 739128494 739271698 739141312 738761673
2564.3 738761673 738653336 738665161 737637863 737261124 737315216 737017746 736724091 736191864 735979156 736333694
2573.9 736333694 736602402 736370468 736284866 735961304 735512924 734766235 733995972 734050064 733585739 733313980
2583.6 733313980 733307114 733225403 733488312 733420105 733410110 733279190 733000946 732617722 731973724 731270905 731183701
2594.2 731183701 731348648 730806503 730760193 731232834 731502075 731291428 730830460 730444641 730093689 729852066
2603.8 729852066 729088287 728816299 728985901 728617859 728155060 728039169 728538437 728673935 728294830 727979202
2613.5 727979202 727632751 726950073 726409149 726219101 725701523 725138626 724763947 724674759 724376602 724027100
2623.1 724027100 723881531 723800888 723728943 722792587 722104797 721788864 721178436 720579529 720212555 720508270
2632.8 720508270 720454865 720064697 719539795 719075165 719054718 718588333 717643509 716706161 716141357 715882416
2642.4 715882416 715763397 715681381 715469513 714638748 713989716 714021835 713501205 713150253 712663116 711987000
2652 711987000 711590042 710917740 710764084 710698853 710325241 709775925 709567566 709049301 707728653 707393417
2661.7 707393417 707533340 707380600 706984558 706760406 706774216 706372910 705878983 705452805 705248032 704993820
2671.3 704993820 704713440 703981857 703070984 703017578 703146133 703008347 702667542 702617798 702315216 701490250
2681 701490250 700806656 700481796 700407867 699804001 699445801 699299774 698848572 698442612 697966690 697682648
2690.6 697682648 697512741 697281418 696758575 696692810 696953201 696622620 696044312 695599365 695438995 694897308
2700.3 694897308 694297104 693837967 693512268 693301086 692675095 692158356 691552887 691307602 691350784 690961914
2709.9 690961914 690453186 689802933 689349823 689088287 689038239 688960419 688457642 688087387 687901306 687160416
2719.5 687160416 686682739 686658630 685955048 685738525 685748749 685495071 685244980 684571304 684133453 683689423
2729.2 683689423 683548355 683412704 683005219 682684326 682102203 681699829 681255417 681135559 681258316 681072540
2738.8 681072540 680640564 680428009 680458832 679833069 679533844 679253235 678738327 679006042 679206696 678908386
2748.5 678908386 678583603 678208923 677726974 677552109 676932678 676413116 676296692 675759430 675775528 675804825
2758.1 675804825 675537949 675064774 674811783 674858856 674361038 674455414 674401245 673838425 673722229 673511353
2767.8 673511353 673421631 673501053 673239899 673095627 673079453 672378922 671809235 671394577 670731506 670304260
2777.4 670304260 669892578 669765625 669807053 669821243 669615631 669059448 668332062 667843323 667698288 667392120
2787 667392120 666892624 666184845 666213913 665989990 664886856 664245529 663851547 663751602 662952271 662161331
2796.7 662161331 662133560 661516266 660486298 659763412 659526825 658607559 657687988 657140732 656613007 656454620
2806.3 656454620 655941391 655596085 654807510 653668747 652752686 651829071 651159821 649959946 648747482
2815 648747482 647916794 647449036 647105637 646416245 645702820 644883804 644283905 643760223 642431946 640636749
2824.7 640636749 639609222 638731537 637812614 637082634 635897331 635062485 634123383 632989845 632289047
2833.3 632289047 631537628 630313225 628858681 627741470 626317024 624895744 623461380 621852226
2841.1 621852226 620273132 618619232 617272072 615494614 613735046 611944847 609710884 607646255
2848.8 607646255 605673065 603997993 602465210 600849953 599094620 597994957 597271461 596699257 596282959
2857.4 596282959 595342636 595126305 594523926 593133698 592139091 591270027 590183907 588487625 587263985
2866.1 587263985 585734711 583518486 581799049 580313339 578582306 576496887 574624481 572580872
2873.8 572580872 570685158 568976097 567161026 565648651 564204826 562784653 560612221 558732910
2881.6 558732910 557684212 556399040 555331268 554207420 552797470 551804123 551662025 551419411 550854645
2890.2 550854645 550367851 549714508 549127998 548466873 548129005 547925758 547632713 547268372 546751709 546533966
2899.9 546533966 546116028 545817108 545865707 545512047 544691849 544079552 543280792 542195091 541682205 540484390
2909.5 540484390 538967857 538001862 536758537 535280571 533589211 531814995 530205498 528794174
2917.2 528794174 526955109 524778481 522568550 520532608 518926811 517603378 517193451 516455040 515765305
2925.9 515765305 515963974 515612144 515132866 514813614 515100517 515576210 515852089 516698418 517802849
2934.6 517802849 519091034 520592651 522624664 524579353 525897560 527607880 529948425 532071609
2942.3 532071609 534014587 536208382 538439102 540738678 542782784 544893265 547215385 549567108
2950 549567108 551847343 553752022 556074562 557939644 559028206 560724487 563108444 565577126 567833252
2958.7 567833252 569929123 572120361 574700890 576635132 578180046 579755859 581346436 583402977
2966.4 583402977 584847031 586361847 588486137 590475426 591967278 593488388 595580368 597247238
2974.1 597247238 598424950 599455490 601086693 602758980 604117737 605829964 607133713 608469467
2981.8 608469467 609473763 610337296 611699219 612899055 613764229 614353333 615501671 616629028 617479362
2990.5 617479362 618465881 619284210 619978218 620246201 620483170 620782928 621017838 621435661 621978645 622346535
3000.2 622346535 622388535 622550316 622770500 622608147 622095528 621985626 622407455 622477455 622060547 621730385
3009.8 621730385 621308212 620906334 620735321 620061150 619456139 619203758 619117393 618872032 618014603 617496262
3019.5 617496262 617139664 616752892 616188278 614956779 613711433 612862396 612099266 611084747 610709572
3028.1 610709572 610704422 610163994 609355316 608440247 607551804 606616631 605720596 604532204 603250046 602260208
3037.8 602260208 601581345 601022606 600060005 599077530 598086243 597451782 596756248 595172195 593693886
3046.5 593693886 592871628 592265854 591276093 590314713 589378090 588432617 587305298 585593262 584697342
3055.1 584697342 584019623 582532921 581432419 580596390 579355278 578344841 577549248 576762123 576156425
3063.8 576156425 574954720 574023895 573279114 571778412 570560493 569467850 568410149 567571068 566465569
3072.5 566465569 564963264 563509750 562548370 562298775 561797371 560467529 559571991 558422623 557235718
3081.2 557235718 556125031 554648552 554098091 553363495 552290649 551236687 550126114 549361229 548136635
3089.9 548136635 546452484 544960670 544083023 543053818 542039871 541042252 539803505 538897285 537772636
3098.5 537772636 537306900 536736832 535343895 534248619 532991447 531670837 530507355 529507637 528436508
3107.2 528436508 527384109 526314049 525368919 524696388 523753662 522932968 521835442 520806084 519760818
3115.9 519760818 518286209 517289772 516064224 514609833 513658638 513146973 512113571 510678940 510108566
3124.6 510108566 509602966 508455849 507213364 506381950 505372009 504029617 502845078 501676788 500556564
3133.3 500556564 499998016 499739418 498503304 497035484 495893822 494771690 493906631 492876892 492116165
3141.9 492116165 491178932 489957695 489051208 487913170 486598320 485732460 485401573 484621429 483500900
3150.6 483500900 482680550 481908417 480978661 479922066 478797951 477565269 476398697 475312691 474703751
3159.3 474703751 474246483 473531799 472534103 471273079 470323334 469225082 468408699 467657585 466665611
3168 466665611 466198044 465494576 464525375 463405342 462491264 461640854 460466576 459772682 459370117 458856354
3177.6 458856354 457890778 456858253 456011925 455176544 454305344 453090019 452028084 451317902 450779381
3186.3 450779381 450118675 449312019 448269005 447276611 446920700 446352158 445380745 444497337 443602867
3195 443602867 442655716 442006836 441215858 440203857 439718323 439323845 438628731 437424088 436491089 436018448
3204.6 436018448 435762558 435529022 434474602 433654251 432685623 431681137 431223373 430529022 429824715
3213.3 429824715 428576279 427699661 427311707 427040672 426908989 426371307 426001778 425057259 423926735
3222 423926735 423332787 422995377 422359581 421028709 420243874 419965248 419574318 418945465 418373413 417941246
3231.6 417941246 417261238 416535568 415728378 415006599 414543533 414227638 413935013 413753281 413067932 412188988
3241.3 412188988 411635437 411127548 411307526 410889091 410036125 409348946 408313866 407755318 407174683
3249.9 407174683 406901588 406473351 405762634 405275993 404549942 403774376 402752724 402678299 402811241 402185402
3259.6 402185402 401309242 400537872 400370216 399771919 399727631 399762039 399108200 398774490 398088188 397981453
3269.2 397981453 397977257 397231750 396664810 396088295 395370903 395139046 395278168 394572144 393955688 393829384
3278.9 393829384 393049927 392251778 391667976 391467552 391609764 391197090 390654678 390558434 390370293 389667740
3288.5 389667740 389187813 389289436 389017754 388400879 387820015 387280312 387192192 387100067 386434135 385781631
3298.2 385781631 385910568 385831375 385137825 384835320 384383659 383863831 383760414 383436928 382695847 382304001
3307.8 382304001 382376938 382257233 382166977 381604614 380792160 380252686 379600945 378860092 378162308 378144493
3317.4 378144493 377976608 377313080 376871223 376659813 376644783 376154099 375438576 374791451 374463997 374298553
3327.1 374298553 373661041 373171692 372770920 372126884 371393280 370944328 370558319 370068893 369828300 369337044
3336.7 369337044 368550644 368104439 368064804 367533951 366798096 366523933 366258698 365905533 365055771 364187546
3346.4 364187546 364176941 364249763 363661079 363453751 363558884 362703094 361536140 360788536 360451050 359901161
3356 359901161 359444542 359466286 359161835 358599892 357977257 357533073 356923714 356500282 356366653 356071472
3365.7 356071472 355581245 354267044 353768120 354008141 353556480 352781372 352168121 352496681 352716827
3374.3 352716827 352147331 351150894 350357437 350117874 349543610 348545570 347914314 348083687 348195152 348101654
3384 348101654 347264977 346252937 346493416 346437798 346455154 346954765 346920929 346366501 345357513 344712029
3393.6 344712029 344724426 344817848 344492950 343916893 343553200 343703079 343801651 343361664 343123817 343117561
3403.3 343117561 343029060 342806206 342980194 342991791 342353058 341763153 341132393 341203117 341770782 341854477
3412.9 341854477 341654129 341632462 341721306 341442490 341123047 341094589 341106834 341039009 341546898 341617584 341106720
3423.5 341106720 341119728 340775223 340855942 341481590 341432381 341228218 341580467 341798286 341396065 341514473
3433.2 341514473 341921539 342105064 341898613 341915359 342493668 342786903 342928047 343157196 343456650 342839699
3442.8 342839699 342756119 343484688 344028168 345059128 344737282 344400864 344693871 344833679 345407677 346155281
3452.5 346155281 347228012 347581367 347874489 348205643 348252335 348480721 348520699 348473091 348469658 349773521
3462.1 349773521 350759544 351004868 351542206 351880341 352596931 352723389 352737885 353087997 353767014 354365387
3471.7 354365387 354802780 355720253 355799942 356043854 356701012 357122993 357590561 358460236 359502144 359454193
3481.4 359454193 359389915 359893532 361067810 361651840 361842041 362832870 362886467 363149376 364038925 364819298
3491 364819298 365400467 365802650 366300697 366815643 367653542 367514610 367456665 368529778 369631386 370550575
3500.7 370550575 371595154 372801628 372789497 372588768 373396568 374245567 375232086 376936111 377135658
3509.4 377135658 376351776 377943802 379133492 379479294 380078392 380822334 381584587 382059631 383146973
3518 383146973 383633690 383945122 385200844 386947517 387611923 386898460 387993774 389270515 389635925
3526.7 389635925 390227737 391091843 391629410 392506561 393581734 394332542 395519943 396270142 397386360
3535.4 397386360 397635422 397857628 399856834 400724831 401193504 401856537 403251915 404383240 405533905
3544.1 405533905 406696510 406749687 408480873 408328056 408950615 410556602 412423477 415105133 414305573
3552.7 414305573 415074005 416096573 417444038 419217491 418873672 420259590 421492844 422799683 424176750
3561.4 424176750 426173325 427339973 428084488 432557755 432111893 431477318 432885132 432149544 435450745
3570.1 435450745 437632599 439364281 441028595 442525787 443610764 444841537 447569580 448597603
3577.8 448597603 450535088 452265167 452781067 454432297 457020531 459384079 460155029 463885384 466234207
3586.5 466234207 464950714 466814384 466511192 469196777 472357330 475180740 476554832 476920013 480318108
3595.2 480318108 479782524 481934357 486004372 487048531 490283203 491403198 492005310 494313698 495662308
3603.9 495662308 497736168 501215477 504035835 503849449 507687340 507454987 506981583 514566879 515454712
3612.5 515454712 513743553 518444595 517541313 520689201 524710312 525092812 527094078 525583344 526906891
3621.2 526906891 531380463 534323654 536149597 538793488 541568298 544608307 551947098 551350060
3628.9 551350060 539286728 544242783 549511452 554708557 555538330 553867989 556728096 559885063
3636.6 559885063 562169952 562823792 564257889 566788216 568883324 569185486 569666214 572879829 577269402
3645.3 577269402 583011436 581424751 578076744 583761253 584632072 581462708 579662056 584648437
3653 584648437 589187737 593883820 599051247 590143127 591200562 597099152 599194069 600339317 600316391
3661.7 600316391 601689949 602915115 605145683 607032890 607309380 611982536 615890427 615694504 615947647
3670.4 615947647 608350258 610292473 619045601 628683052 627924042 606418266 611109238 619850464
3678.1 619850464 624489212 622369385 622714348 626211815 627710762 629196320 630044518 630877419 636101608
3686.8 636101608 642500305 632865181 629120560 637981911 631884918 630634727 636415482 637700920
3694.5 637700920 640285034 640888901 640260162 641884003 642126541 644431992 647517090 643537521 642065735
3703.2 642065735 646362534 647741699 648328400 648983917 651569748 655976639 647113800 650611115 658415909
3711.9 658415909 645112381 648080521 652286453 652651749 653514099 656135559 657790298 654421310
3719.6 654421310 656074905 662632141 659126892 653538437 658873978 660773773 659959717 656616211
3727.3 656616211 656387711 660486984 661889343 667852859 665111313 657234879 667309418 669866028
3735 669866028 661128922 660932236 662445221 662135010 664677505 668140945 663777008 666687698 678678284
3743.7 678678284 669011536 654167709 664179764 669498978 675769882 673614731 664235382 676967316
3751.4 676967316 670496979 661926346 667826462 671746902 674873657 669799271 672671204 679600143
3759.1 679600143 671643677 668806458 672864609 674385529 674960937 679585724 677560196 671859283
3766.8 671859283 675048599 680556107 682239304 673683014 674813690 677727661 677845535 678824081 678217850
3775.5 678217850 678817673 679657288 683163071 683712540 675791397 678361816 680703049 681666336 684151230
3784.2 684151230 681026840 679350204 680650940 681819763 682851715 682991257 683077850 682873917 683523178
3792.9 683523178 683927689 685811157 690002060 686289291 680697403 683128204 688861389 696202164
3800.6 696202164 689779892 677677917 681204147 684976120 690767441 696638794 685024643 679677505
3808.3 679677505 685121307 687301178 687039185 688036728 689254837 690794525 696142502 694069138 679100418
3817 679100418 684380646 692047882 698917542 701576157 681868057 682229004 687559967 690329056 693933716
3825.7 693933716 694183807 689052200 688661880 691132889 696021500 698857803 688752899 689983826
3833.4 689983826 697332840 692305603 691896439 700279007 691913528 687688675 696313553 690514755
3841.1 690514755 689624863 696643753 694160538 690382004 693208389 694293137 694661560 697425995 696826935
3849.8 696826935 698440628 704384613 699671707 701489258 685675735 685500107 695416870 694141083
3857.5 694141083 692731247 695377045 697749100 700730591 695043640 695245819 704499588 698416061
3865.2 698416061 690622787 695622559 702499161 709970093 702083130 690611725 693040314 699589615
3872.9 699589615 704350052 694185028 694143295 697823944 697986450 700473557 705803375 700787582 691976547
3881.6 691976547 698345413 700481567 702776718 708754578 694419785 694461441 698705597 699777069
3889.3 699777069 704458771 703613968 694935303 696931763 700908279 699989929 701073532 701867981 704668503
3898 704668503 706115799 695329514 701758728 705398331 700068130 704954224 700885696 698487091
3905.7 698487091 699215775 699956818 702237167 702271042 702537460 702058563 701957092 702327957 702161484 703769379
3915.3 703769379 705514145 701417694 698748856 703879013 703791656 699817734 702077026 703943634 705641022
3924 705641022 703551331 699690628 700989456 702726212 704608612 704063721 703148041 705087891 702449112
3932.7 702449112 700510483 702598801 703289948 703577118 703816147 703211975 702704086 702674332 705281830
3941.4 705281830 707297897 703035736 701848221 703081284 704234085 705784378 703265076 703423233
3949.1 703423233 704309692 702583618 704615631 705355835 704571381 704909515 705272827 705398788 704841003
3957.8 704841003 705555344 705476990 704950562 704804916 703057709 702914047 704490128 705167084 705216827 705426254
3967.4 705426254 705277023 704773178 704748383 705465851 705935364 705555954 705066605 705145569 705254669 704545441
3977.1 704545441 705370178 706615372 705990219 705570450 705682068 706079483 706350250 706741180 706636276
3985.7 706636276 705645981 705673447 705968933 706350861 706481094 706257935 706355667 706528168 706709518 705992661
3995.4 705992661 706223297 707200928 706918564 706275177 705723419
4000.2 705723419
##END=$$ End of the data block
