##TITLE=$$ Begin of the data block
##JCAMP-DX=5.00 $$ ACD/SpecManager v 10.08
##SPECTROMETER/DATA SYSTEM=Varian
##DATE=20 Nov 2012 13:54:56
##DATA TYPE=INFRARED SPECTRUM
##DATA CLASS=XYDATA
##ORIGIN=
##OWNER=
##NPOINTS=3735
##FIRSTX=399.26403809
##LASTX=4000.35498047
##MAXX=4000.35498047
##MINX=399.26403809
##MAXY=80.34934998
##MINY=40.03783035
##XFACTOR=1.0000000000
##YFACTOR=0.000000100000000
##FIRSTY=62.03912735
##DELTAX=0.96440572
##XUNITS=1/CM
##YUNITS=TRANSMITTANCE
##XYDATA=(X++(Y..Y))
399.3F20391273j7335090j51558J480598k133102M20151k28958O19888l951111M881554
$$ 620391273 603056183 602904625 604385223 602252121 602672272 602443314 603063202 599112091 603993645
407.9F03993645P603149m542427m734154r92698K063903j022529j083298P209587L838768
$$ 603993645 611596794 607054367 602320213 601327515 603391418 602368889 601285591 608495178 612333946
416.6F12333946p152900j0277825J6212235M330062q346290o321564M426460N224381
$$ 612333946 605181046 594903221 611115456 615445518 607099228 600777664 605204124 610428505
424.3F10428505k612000o321678m346962J547852N148773J70937m398117m846039k205887
$$ 610428505 607816505 601494827 597147865 598695717 603844490 604015427 599617310 594771271 592565384
433E92565384N515366L135108p833595P18384R135666Q0795m248276k814903k621345
$$ 592565384 598080750 601215858 593382263 594100647 603236313 603317108 599068832 596253929 593632584
441.7E93632584N748672O121788J515656K380943j40228J725197L786659J935882K316475
$$ 593632584 599381256 605503044 607018700 609399643 609259415 610984612 614771271 616707153 619023628
450.4F19023628J087151p94869o90384J27640k636871m040680J428718L465119m38690
$$ 619023628 620110779 619315910 618625526 618753166 616116295 612075615 613504333 616969452 616530762
459.1F16530762j971627k059516R06791m314728q486785l245011J844750J872978N07431
$$ 616530762 614559135 612499619 613406410 609091682 600604897 597359886 599204636 601077614 601585045
467.7F01585045J365967K293167l505364k759895J187096k441216J624642J766471
$$ 601585045 602951012 605244179 601738815 598978920 600166016 597724800 599349442 601115913
475.5F01115913l135185m808159J000366J741372N4702N337944k663993n214158O13022
$$ 601115913 597980728 593172569 594172935 595914307 595969009 601306953 598642960 593428802 594041824
484.1E94041824j300354O22254l36113R70535L445244j81847m501190k716942K044068
$$ 594041824 592741470 593363724 593027611 593998146 597443390 597261543 592760353 590043411 592087479
492.8E92087479r76906j071625j576805k493782Q56590J680794J231041O59637L78533
$$ 592087479 591110573 590038948 588462143 585968361 586824951 588505745 589736786 590396423 590774956
501.5E90774956j265297N90591K359619k190322k144013j501846l552819q83674N4474
$$ 590774956 589509659 590100250 592459869 590269547 588125534 586623688 583070869 582187195 582241669
510.2E82241669n05677j331253l383484j853523m92973j044045k234878k168121k78054
$$ 582241669 581735992 580404739 577021255 575167732 574674759 573630714 571395836 569227715 568949661
518.9E68949661j535988o52656l84216j085015j397972j927338m19654N98640J513481
$$ 568949661 567413673 566761017 566376801 565291786 563893814 561966476 561546822 562145462 563658943
527.5E63658943p44819o41137R84269J47399O55213j178208L36838J003876k05689
$$ 563658943 562914124 562272987 563257256 563404655 564059868 562881660 563218498 564222374 564016685
536.2E64016685K249833K428093K406845L371162L044510J83334n57365J631584J434555
$$ 564016685 566266518 568694611 571101456 574472618 577517128 577700462 577143097 578774681 580209236
544.9E80209236O65856Q29696P08885j420784j291465K244033J008721k106896k301178
$$ 580209236 580875092 581704788 582413673 580992889 579701424 581945457 582954178 580847282 578546104
553.6E78546104N80826J791535k028084k763519l58849k80418J85203j226234m200249
$$ 578546104 579126930 580918465 578890381 576126862 575768013 575487595 575672798 574446564 570246315
562.3E70246315k077942p90253k143516j117554j291199k862167j813278p20863k053109
$$ 570246315 568168373 567378120 565234604 564117050 562825851 559963684 558150406 557429543 555376434
570.9E55376434j437034j455498r79080l15666j668892P44934J414032P16018J521416
$$ 555376434 553939400 552483902 551504822 551189156 549520264 550265198 551679230 552395248 553916664
579.6E53916664L362885L401870K539559K687378J683654J763573J210633J004219
$$ 553916664 557279549 560681419 563220978 565908356 567592010 569355583 570566216 571570435
587.3E71570435m57077J112823L938980Q23860R88541K539101J217193k36854j170655
$$ 571570435 571113358 572226181 576165161 576989021 577977562 580516663 581733856 581497002 580326347
596E80326347m64363M01993k25906j715622J42898K116127J050110o64978j40304M36134
$$ 580326347 579861984 580263977 580038071 578322449 578465347 580581474 581631584 580966606 580826302 581262436
605.6E81262436p46307m0169o68106o49948Q24279M58260N66788J542434J946297J59874
$$ 581262436 580516129 580475960 579807854 579157906 579982185 580440445 581007233 582549667 584495964 584655838
615.3E84655838j15967k72522j65291J658860J249008J065445J581344K761765K251663
$$ 584655838 584539871 584267349 584102058 585760918 587009926 588075371 589656715 592418480 594670143
624E94670143J019478J455002J202736O08444M23279J223106M93622P0457Q22640J139374
$$ 594670143 595689621 597144623 598347359 598955803 599379082 600602188 601095810 601166267 601988907 603128281
633.6F03128281K151641Q69599j83830R13963J94397q91571j0109J087570J966362
$$ 603128281 605279922 606149521 605965691 606879654 607074051 606182480 606172371 607259941 609226303
642.3F09226303J731033M11950P29293L88413m1123n13610J61552J409912p15904N67398
$$ 609226303 610957336 611369286 612098579 612486992 612445869 611932259 612093811 613503723 612787819 613355217
651.9F13355217K264595O74858Q86803J662178J305275p55654j008491j82266n65987
$$ 613355217 615619812 616294670 617181473 618843651 620148926 619393272 618384781 618202515 617636528
660.6F17636528k46735N5809Q95081Q95615J420669L190041K765007n239220j4076
$$ 617636528 617389793 617445602 618340683 619236298 620656967 623847008 626612015 621372795 621358719
669.3F21358719J775246r63326j550636N67817K295075J642418J814041J342430j228485
$$ 621358719 623133965 622170639 620620003 621187820 623482895 625125313 626939354 628281784 627053299
678F27053299n7030J259728R2697m60167q43353M77256K615395K380981j95503n92804
$$ 627053299 626996269 628255997 628348694 627888527 627045174 627522430 630137825 632518806 632323303 631730499
687.6F31730499J540604R05914q36715p99218n36422m02031Q6860L5820l17840j93215
$$ 631730499 633271103 634177017 633340302 632541084 632004662 631602631 631689491 631725311 631407471 631214256
697.3F31214256m06608j128121j657676o28739q96454k699775j492310M04015O96296
$$ 631214256 630807648 629679527 628021851 627393112 626496658 623796883 622304573 622708588 623404884
705.9F23404884J39580J23558J67656J0185L21503n7907P64542J270294R73205J724587
$$ 623404884 623544464 623668022 623835678 623845863 624167366 624109459 624874001 626144295 627117500 628842087
715.6F28842087J455765J546554J765556J769944J701431J101570J915054J853028
$$ 628842087 630297852 631844406 633609962 635379906 637081337 638182907 640097961 641950989
723.3F41950989J686020J819000J380234K151336K637864K503051J912842J079331
$$ 641950989 643637009 645456009 646836243 648987579 651625443 654128494 656041336 657120667
731F57120667M61349O13937J247483J871414J641159N36041N73273O35834J121292
$$ 657120667 657582016 658195953 659443436 661314850 662956009 663492050 664065323 664701157 665822449
739.7F65822449M272q76694o43234j148681J979217J752777j827469j745605j90430
$$ 665822449 665826721 664950027 664306793 663158112 665137329 666890106 665062637 663317032 663126602
748.4F63126602k1362j186066q99582j385269r06143j197128k588883l95508k66647
$$ 663126602 663105240 661919174 661019592 659634323 658728180 657531052 654942169 654546661 654280014
757.1F54280014k304459k932891j891251q32138q77152r69619j088944k56805J05972
$$ 654280014 651975555 649042664 647151413 646319275 645442123 644472504 643383560 643126755 643232727
765.7F43232727M79965J206665J300431R44137L74832J597443J626739R31397K247925
$$ 643232727 643712692 644919357 646219788 647163925 647538757 649136200 650762939 651694336 653942261
774.4F53942261L721237M186783L050689K241059K181549K465973K548218J778869
$$ 653942261 657663498 661850281 664900970 667142029 669323578 671789551 674337769 676116638
782.1F76116638O45981J088104J618576J561051K547912J868668K145691K464905J351623
$$ 676116638 676762619 677850723 679469299 681030350 683578262 685446930 687592621 690057526 691409149
790.8F91409149L81928m70353M94233J174469J769714J197968K164535L121491R62066
$$ 691409149 691791077 691320724 691814957 692989426 694759140 695957108 698121643 701243134 702205200
799.5G02205200J209183Q10394R9488l50800n49698L54920J125717K296066J604767
$$ 702205200 703414383 704224777 704324265 703973465 703423767 703778687 704904404 707200470 708805237
808.2G08805237Q14056K60315o4545l67889m00696k90374j437912j318589m46777J218796
$$ 708805237 709619293 709879608 709815063 709447174 709046478 708756104 707318192 705999603 705552826 706771622
817.8G06771622J657562J203995Q80890p76368j471023j241455p84531j306763j751174
$$ 706771622 708429184 709633179 710514069 709737701 708266678 707025223 706240692 704933929 703182755
826.5G03182755j674576N2032N35050r88083J91955m66537j570282k757111l427658
$$ 703182755 701508179 701560211 702095261 701107178 701299133 700832596 699262314 696505203 693077545
835.2F93077545j214294r24301j036454o72073l35541n25894k95258p64846k482453
$$ 693077545 691863251 690938950 689902496 689230423 688894882 688368988 688073730 687308884 684826431
843.9F84826431j860428k079773j804428p77511r40399q26798l04184K05841j002807
$$ 684826431 682966003 680886230 679081802 678304291 677363892 676537094 676232910 676438751 675435944
852.5F75435944j827088j992111j638718j991806k904281j619339j062546j268692
$$ 675435944 673608856 671616745 669978027 667986221 665081940 663462601 662400055 661131363
860.3F61131363j096573J096878L472824K588577K031022J697845K143860K306976
$$ 661131363 660034790 661131668 664604492 667193069 669224091 670921936 673065796 675372772
868F75372772K141648M059219N180893M457321L108902L096161K523117J290512P14035
$$ 675372772 677514420 681573639 686754532 691211853 694320755 697416916 699940033 701230545 701944580
876.7G01944580K75803K88696M21677M88739N83953K96174p59354j074753j745758
$$ 701944580 702220383 702509079 702930756 703419495 704003448 704299622 703540268 702465515 700719757
885.3G00719757k718048l022003k645874k204972k597045k110672j297684r97009j331635
$$ 700719757 698001709 694979706 692333832 690128860 687531815 685421143 684123459 683126450 681794815
894F81794815j111755j367722k726974k919388k987290j783676q50143j231537j361389
$$ 681794815 680683060 679315338 676588364 673668976 670681686 668898010 668047867 666816330 665454941
902.7F65454941j953812j597061j748047k785797k519302k701874l469772l555069
$$ 665454941 663501129 661904068 660156021 657370224 654850922 652149048 648679276 645124207
910.4F45124207l834458l137779k686577l194733k747688l005562l509025l657646
$$ 645124207 641289749 638151970 635465393 632270660 629522972 626517410 623008385 619350739
918.1F19350739l419495k817841k151985j738930j112823M38080J8654n45998K1095
$$ 619350739 615931244 613113403 610961418 609222488 608109665 608547745 608566399 608020401 608041496
926.8F08041496m04548l47863l47137o68259j2207J109619K016907J928787J675301
$$ 608041496 607636948 607289085 606941948 606273689 606261482 607371101 609388008 611316795 612992096
935.5F12992096J463127O09932M48227M47006Q84247J441956J203155J941567K100753
$$ 612992096 614455223 615065155 615513382 615960388 616844635 618286591 619489746 621431313 623532066
944.2F23532066O26297j72844q46634k171630k575417k763977l181915l280449l490296
$$ 623532066 624158363 623985519 623138885 620967255 618391838 615627861 612445946 609165497 605675201
952.8F05675201l867492m192391m353256m650764m975243m984360o150551o466178
$$ 605675201 601807709 597615318 593262062 588611298 583636055 578651695 572501144 566034966
960.6E66034966n920449o412010n469666n773315n641823n243034o594391p101059
$$ 566034966 560114517 553702507 548232841 542459526 536817703 531574669 524980278 517879219
968.3E17879219p759170p002221p366523p654381p185364o900864o191520o906624
$$ 517879219 510120049 503117828 495751305 488096924 480911560 474010696 467819176 460912552
976D60912552o396179o150933n644073o324997o003532n109406n325584l556176l147659
$$ 460912552 454516373 448365440 442721367 436396370 430392838 425283432 419957848 416401672 413254013
984.7D13254013j954613k493629j535339r09768k070694j109085j747131l90320l82461
$$ 413254013 411299400 408805771 407270432 406360664 404289970 403180885 401433754 401043434 400660973
993.3D00660973N989k88658N7830J280632J09711J527672j97106J87417O77032J44157
$$ 400660973 400666962 400378304 400436134 401716766 401826477 403354149 403157043 403344460 404021492 404165649
1003D04165649M32778o82869J240806K84501M22020J76963j89666n53933j784095l63999
$$ 404165649 404598427 403915558 405156364 405440865 405862885 406039848 405850182 405296249 403512154 403148155
1012.6D03148155j256180O20690K59323q5640N81017J76429J676750M9706O48880L29513
$$ 403148155 401891975 402512665 402771988 402686348 403267365 403443794 405120544 405170250 405819130 406148643
1022.3D06148643Q97599J028785L87269J597328R80034K175636R64508J824150K206650
$$ 406148643 407046242 408075027 408462296 410059624 411039658 413215294 414179802 416003952 418210602
1031D18210602J172600J191406K14500J028786K42157P91435j66855R37157P42188
$$ 418210602 419383202 420574608 420789108 421817894 422060051 422851486 422684631 423621788 424363976
1039.6D24363976j185456Q21953j037483J25541L98217m58336r35402l53775K172508
$$ 424363976 423178520 424000473 422962990 423088531 423486748 423028412 422093010 421739235 423911743
1048.3D23911743J79444J000061J009101J473313J519584J322670J950722R30710L199654
$$ 423911743 424091187 425091248 426100349 427573662 429093246 430415916 432366638 433297348 436497002
1057D36497002K487144L255921L471031K759933L349915L030357M188805K700844K697067
$$ 436497002 438984146 442240067 445711098 448471031 451820946 454851303 459040108 461740952 464438019
1065.7D64438019K218971K170448J485405l59840q58727l508262l320236m256897m214669
$$ 464438019 466656990 468827438 470312843 469953003 469094276 465586014 462265778 458008881 453794212
1074.4D53794212l092193k748833j547623j788749K59628M50935J481362J133880O44799
$$ 453794212 450702019 447953186 446405563 444616814 444876442 445327377 446808739 447942619 448587418
1083D48587418J091957J185608K119140L04528K579994K486191J809463K891731K684441
$$ 448587418 449679375 450864983 452984123 453288651 455868645 458354836 460164299 463056030 465740471
1091.7D65740471L615532K158012K197457J638259J794281J100579j32714L71781M64516
$$ 465740471 469356003 471514015 473711472 475349731 477144012 478244591 478111877 478483658 478948174
1100.4D78948174J798362N03922N63736o87218j025467O71005j53198O51665R7847
$$ 478948174 480746536 481250458 481814194 481126976 480101509 480772514 480619316 481270981 481368828
1109.1D81368828J670990K469864K598152L149376J835098J219482K14768J491318
$$ 481368828 483039818 485509682 488107834 491257210 493092308 494311790 494526558 496017876
1116.8D96017876J281166J148414J157380P31582J814346J033288J259498Q98781Q19549
$$ 496017876 497299042 498447456 499604836 500336418 502150764 503184052 504443550 505342331 506161880
1125.5E06161880Q50297K61802K38533J159058K020416J322517K651597K263717K040367
$$ 506161880 507012177 507273979 507512512 508671570 510691986 512014503 514666100 516929817 518970184
1134.1E18970184J180687n64651j1177p56417j013488j909142j539879k153015k642746
$$ 518970184 520150871 519586220 519575043 518818626 517805138 515895996 514356117 512203102 509560356
1142.8E09560356p46765j311264j336632k749061k873154l220291l063965j310616
$$ 509560356 508813591 507502327 506165695 503416634 500543480 497323189 494259224 492948608
1150.5D92948608j850509j92147m82978l85704o21567k32048O50215j070061J79253
$$ 492948608 491098099 490905952 490422974 490037270 489415703 489183655 489833870 488763809 488943062
1159.2D88943062R1476K50740Q85392K203598K698135K172813L698388L577957L776588
$$ 488943062 489034538 489285278 490170670 492374268 495072403 497245216 500943604 504521561 508298149
1167.9E08298149K609291L296166M060821L706284N012398M497337M812889N184898
$$ 508298149 510907440 514203606 518264427 521970711 526983109 531480446 536293335 541478233
1175.6E41478233N480385N405159N200424M483223L883972M164887L227501L499298
$$ 541478233 546958618 552363777 557564201 562047424 565931396 570096283 573323784 576823082
1183.3E76823082M020462M379997M440766M287567L735275K620087K277031J613807
$$ 576823082 580843544 585223541 589664307 593951874 597687149 600307236 602584267 604198074
1191F04198074J437950Q34923M58298J083298J682129K253112J461678O49605O9999
$$ 604198074 605636024 606470947 606929245 608012543 609694672 611947784 613409462 614059067 614129066
1199.7F14129066k97737k0713K11143J93405J35689Q93936J211167J313781J216507
$$ 614129066 613831329 613810616 614021759 614215164 614350853 615244789 616455956 617769737 618986244
1208.4F18986244P14836J139450J651879J489563Q92257M29039N55382J529579K105065
$$ 618986244 619701080 620840530 622492409 623981972 624874229 625303268 625858650 627388229 629493294
1217.1F29493294J731949J589546J503258O74209J48201n2566o88095m87633j81542
$$ 629493294 631225243 632814789 634318047 634992256 635140457 635087891 634399796 633912163 633730621
1225.8F33730621J5297j17302p7896O34079l43323q51783m18053j041374j281166q59795
$$ 633730621 633745918 633628616 633550720 634184799 633841476 632989693 632571640 631530266 630249100 629389305
1235.4F29389305k00043k16713m35905R7847K38342p4043m34036o39382n16548j82152
$$ 629389305 629189262 628972549 628536644 628634491 628872833 628798790 628364754 627725372 627208824 627026672
1245F27026672k16446L9940R05533J066094R28955Q34770N28564M24080N09567Q2512
$$ 627026672 626810226 626850166 627755699 628821793 629750748 630585518 631114082 631538162 632047729 632130241
1254.7F32130241L02391M51432l7308L86085L62587N45311Q01545N74035N58281j63040
$$ 632130241 632432632 632884064 632846756 633232841 633595428 634140739 634942284 635516319 636074600 635911560
1264.3F35911560j59340M69132O89888N75180Q33854J544991J463928J037827P32727
$$ 635911560 635752220 636221352 636911240 637486420 638320274 639865265 641329193 642367020 643099747
1273F43099747O40258l6392r0713K63977k22855J55030M37164P9956P3547k1591L1509
$$ 643099747 643740005 643703613 643612900 643876877 643654022 643809052 644246216 644326172 644399719 644378128 644409637
1283.6F44409637p9040j97373j48391l75824k19498k21939M6616M53796J6251j65329
$$ 644409637 644330597 644133224 643984833 643609009 643389511 643167572 643214188 643667984 643684235 643518906
1293.3F43518906n70298r65881r75647j058617j133995o48269k6779l88413l94211
$$ 643518906 642948608 641982727 641007080 639948463 638814468 638166199 638139420 637751007 637356796
1301.9F37356796o54106o89773o16799q60061r12400k652168j969833p8507m37279
$$ 637356796 636702690 636012917 635396118 634536057 633623657 630971489 629001656 628923149 628485870
1310.6F28485870k55623k53982k29340o01539j251221q81309o61240m81262p11251
$$ 628485870 628230247 627976265 627746925 627145386 625894165 625012856 624351616 623870354 623159103
1319.3F23159103p89070j39694j17340o43921r19533p33947j076394j922950k057801
$$ 623159103 622370033 622230339 622112999 621469078 620549545 619815598 618739204 616816254 614758453
1328F14758453j902313j530380j334725j401214r88274j078491j025925j075859j287346
$$ 614758453 612856140 611325760 609991035 608589821 607601547 606523056 605497131 604421272 603133926
1336.7F03133926q41407n64614r01413q07876L35006L02926M21180Q23098M41780P5874
$$ 603133926 602292519 601727905 600826492 600018616 600353622 600656548 601077728 601900826 602342606 602418480
1346.3F02418480J48125j82305o01158m72145j53198M93507L54195r1248j28059Q9264
$$ 602418480 602566605 602384300 601783142 601310997 601157799 601651306 602005501 601914253 601786194 601875458
1355.9F01875458K33345m92668r34410r04084p26204o13174n62592q9912N16930O91719
$$ 601875458 602108803 601616135 600681725 599777641 599051437 598438263 597875671 597785759 598302689 598994408
1365.6E98994408j92337J44424l95355j220818l5248k59590M85573N65529l25203O28166
$$ 598994408 598802071 598946495 598551140 597330322 597295074 597035484 597521057 598086586 597761383 598389549
1375.2E98389549J427536R30710q0490K73094K65236J97373J09405J45950N34745P47108
$$ 598389549 599817085 600747795 600667305 600940399 601205635 601403008 601512413 601658363 602193108 602940216
1384.9F02940216J520233J265183J330757J826324J610604P83767N49851N11627L27759
$$ 602940216 604460449 605725632 607056389 608882713 610493317 611277084 611826935 612338562 612666321
1393.6F12666321J50566l49770Q58155J72538l88870j540451j015510Q7356p93533
$$ 612666321 612816887 612467117 613325272 613497810 613108940 611568489 610552979 610640335 609846802
1402.2F09846802k66114n94978j302261l79524J67923l3455j034661o61735q38814
$$ 609846802 609580688 608985710 607683449 607303925 607471848 607438393 606403732 605741997 604903183
1410.9F04903183p03506p62635q71506m34761m99458m4365m18892j20620j917649N09568
$$ 604903183 604199677 603437042 602565536 602130775 601631317 601586952 601168060 601047440 599129791 599639359
1420.6E99639359J243667m06570J97220q35076J41831Q33473M00886J183243N24216
$$ 599639359 600883026 600476456 600673676 599838600 599980431 600813904 601214790 602398033 602922249
1429.2F02922249p0992j16234P29142K7961Q2894J190338L77808j557312N29975K707825
$$ 602922249 602851257 602735023 603464165 603492126 603575020 604765358 605143166 603585854 604115829 606823654
1438.9F06823654J117287L78151O33774N15899Q08411l58963K84881j91307j29470
$$ 606823654 607940941 608319092 608952866 609468765 610277176 609918213 610203094 610011787 609882317
1447.6F09882317j41755M10157J113853o44150n45921r63554j28632n28679j849480
$$ 609882317 609740562 610150719 611264572 610620422 610074501 609110947 608982315 608453636 606604156
1456.2F06604156k903099j878814L292236J056824K062340K68287N72853J825219j290284
$$ 606604156 603701057 601822243 605114479 606171303 608233643 608501930 609074783 610900002 609609718
1464.9F09609718J282730J244851K653312J955872K320671K958450J698151L285026
$$ 609609718 610892448 612137299 614790611 616746483 619067154 622025604 623723755 627008781
1472.6F27008781J481934N458794K874603J965103K897644K684021K693100J741333
$$ 627008781 628490715 633949509 636824112 638789215 641686859 644370880 647063980 648805313
1480.3F48805313L303757K422561L015900K434540J981506K566376N12161J357880
$$ 648805313 652109070 654531631 657547531 659982071 661963577 664529953 665042114 666399994
1488.1F66399994R91592J388398P21740K341767K596359J553345K538681Q15506j433258
$$ 666399994 667391586 668779984 669501724 671843491 674439850 675993195 678531876 679347382 677914124
1496.7F77914124J101837O92596n6763J865769J704559N48630J724014J102906J581878
$$ 677914124 679015961 679708557 679651794 681517563 683222122 683770752 685494766 686597672 688179550
1505.4F88179550k257843n619354L677292J668548J694870J170273J029968O3019J871567
$$ 688179550 685921707 680302353 683979645 685648193 687343063 688513336 689543304 689606323 691477890
1514.1F91477890J223679l42865k38724k119446L834457K387162k110215l232803J019821
$$ 691477890 692701569 692358704 692119980 690000534 693834991 696222153 694111938 690879135 691898956
1522.8F91898956L970108J387101O1187N52140J561355j85013K4338J249848L04489
$$ 691898956 695869064 697256165 697317352 697869492 699430847 699245834 699270172 700520020 700824509
1531.5G00824509J249313j887283j344681K469482J279908J661987J689911O28662
$$ 700824509 702073822 700186539 698841858 701311340 702591248 704253235 705943146 706571808
1539.2G06571808q883591K476273J974334O50788J947098j205445L04489K711487J747360
$$ 706571808 697688217 700164490 702138824 702789612 704736710 703531265 703835754 706547241 708294601
1547.9G08294601O70548p75681j525268J067962J160203J94854j489029Q22220L870850
$$ 708294601 708965149 708189468 706664200 707732162 708892365 709087219 707598190 708420410 712291260
1556.5G12291260K794800o191025l825989N09415L431472J422501J046600K85645j257553
$$ 712291260 715086060 708895035 705069046 705578461 709009933 710432434 711479034 711764679 710507126
1565.2G10507126L09982J048966J201400P9422m319000K69318J098861m31289m50974
$$ 710507126 710817108 711866074 713067474 713146896 708827896 709097214 710196075 709764786 709313812
1573.9G09313812N89524j160737o012115K462463K025910m7531m34571q43734q12760
$$ 709313812 709903336 708742599 702730484 705192947 707218857 707171326 706736755 705893021 705080261
1582.6G05080261j042328j174163j355286j115646k82059o02799r70306j385269j065827
$$ 705080261 704037933 702863770 701508484 700392838 700110779 699507980 698537674 697152405 696086578
1591.2F96086578j429824j501999j741562j768570p20215j292191j204452j591492
$$ 696086578 694656754 693154755 691413193 689644623 688924408 687632217 686427765 684836273
1599F84836273j275863j379242j457825j467209k384338j136475j242905j325912j973572
$$ 684836273 683560410 682181168 680723343 679256134 676871796 675735321 674492416 673166504 671192932
1607.6F71192932j157760j566391k591935q62350j678391j112442j869201o52161j188431
$$ 671192932 670035172 668468781 665876846 665014496 663336105 662223663 660354462 659702301 658513870
1616.3F58513870r129104Q67233J29013o44989j489410j28327j411056m415665M17023
$$ 658513870 649384766 650251999 650381012 649736023 648246613 648118286 646707230 642291565 642708588
1625F42708588j68076J6098l559608k112046L18909o73828o00357j111717M20570m09279
$$ 642708588 642540512 642556610 638997002 636884956 637203865 636530037 635929680 634817963 635238533 634829254
1634.6F34829254n202713j451835J447982J050949P82242Q82721l66821Q15353p4806
$$ 634829254 629626541 628174706 629622688 630673637 631455879 632338600 631971779 632787132 632712326
1643.3F32712326J241531J337929k406692o8360l36647K464295J505623J915054K597542
$$ 632712326 633953857 635291786 632885094 632816734 632480087 634944382 636450005 638365059 640962601
1652F40962601l686981o237488N228195M282761K069625J614991Q96606J231461J414337
$$ 640962601 637275620 631038132 636266327 640549088 642618713 644233704 645130310 646361771 647776108
1660.7F47776108J019821M78897K97394K621231J815872J636887J959457J717911n68695
$$ 647776108 648795929 649274826 649572220 652193451 654009323 655646210 657605667 659323578 658754883
1669.4F58754883Q87756K492447Q45032K849426L207016J423798p18842K505951L127136
$$ 658754883 659642639 662135086 662980118 665829544 669036560 670460358 669741516 672247467 675374603
1678F75374603J963654J718979J368103L643875L803940J251602k227554K282104M679794
$$ 675374603 677338257 679057236 680425339 684069214 687873154 689124756 686897202 689179306 693859100
1686.7F93859100K759018J482239K339630K061539K668381K572250J933289K599411
$$ 693859100 696618118 698100357 700439987 702501526 705169907 707742157 709675446 712274857
1694.4G12274857J871566l523407L297043M144440M156036J091767n024262M764481
$$ 712274857 714146423 710623016 713920059 718064499 722220535 723312302 718288040 723052521
1702.1G23052521L637466J536331j28021O91757K02637J064835J944732Q54340M8981
$$ 723052521 726689987 728226318 728098297 728790054 728992691 730057526 732002258 732856598 732905579
1710.8G32905579J181106J568375J382675j60828q64715K006454m37317m442062L435287
$$ 732905579 734086685 735655060 737037735 736876907 736012192 738018646 737581329 733139267 736574554
1719.5G36574554K827683J181869L12348J81732j26114J248093J159134j18866L83911
$$ 736574554 739402237 740584106 740896454 741078186 740952072 742200165 743359299 743240433 743624344
1728.2G43624344N78155j165008n89295K294159J825791l338471l143081L714294K689896
$$ 743624344 744202499 743037491 742448196 744742355 746568146 743229675 740086594 743800888 746490784
1736.9G46490784M25033J198578o14471j542359K215500Q60596o01883P25403K319565
$$ 746490784 746915817 748114395 747499924 745957565 748173065 749033661 748431778 749157181 751476746
1745.5G51476746J314926O86264R76715l21732J808167p44782l79791K811508J712418
$$ 751476746 752791672 753477936 754454651 754132919 755941086 755196304 754816513 757628021 759340439
1754.2G59340439J689606J315078q80432P18308J830749J446304J610566j352692O10
$$ 759340439 761030045 762345123 761464691 762182999 764013748 765460052 767070618 765717926 765718536
1762.9G65718536K165299O88858Q15201J437454J264419j344223J258469K535553o52389
$$ 765718536 767883835 768572693 769387894 770825348 772089767 770745544 772004013 774539566 773887177
1771.6G73887177j884995q18253L123017J498489q34656J529313Q46557R80911k8228
$$ 773887177 772002182 771183929 774306946 775805435 774970779 776500092 777346649 778327560 778299332
1780.3G78299332q99964Q11920J264115J159744j040344p86057Q60672O79627O06384
$$ 778299332 777399368 778211288 779475403 780635147 779594803 778808746 779669418 780349045 780955429
1788.9G80955429J128616K23389j63727j791992n71213K510529K46277m50058J256332
$$ 780955429 782084045 782307434 782143707 780351715 779780502 782291031 782537308 782087250 783343582
1797.6G83343582J090546j98517r61075J214066m2420O76346R82208o10885L07464
$$ 783343582 784434128 784235611 783274536 784488602 784446182 785122528 786104736 785493851 785801315
1806.3G85801315L87879j16425L02658M82254p68661M96673J218720L09753M58374
$$ 785801315 786189194 786072769 786375427 786857681 786089020 786585693 787804413 788114166 788572540
1815G88572540k16140j53046j93253O38199M51203l55912M69895k13852Q45871O65130
$$ 788572540 788356400 788203354 788010101 788648300 789099503 788743591 789213486 788999634 789845505 790510635
1824.6G90510635k025833M27552J552429R35974o30646k995987Q14209K434845M36478
$$ 790510635 788484802 788912354 790464783 791400757 790770111 787774124 788588333 791023178 791459656
1833.3G91459656j85242K34375Q2550j55182m54178M23890K1362L66058L01056P03659
$$ 791459656 791274414 791508789 791591339 791436157 790981979 791405869 791427231 791793289 792094345 792798004
1842.9G92798004R1171l520584J776657J559906k27356o6528J89362J0071k30332N31235
$$ 792798004 792889175 789368591 791145248 792705154 792477798 792411270 792600632 792610703 792380371 792911606
1852.6G92911606l1586J3962n9662K19040M64478l66745J13830k20108R0637p5988
$$ 792911606 792880020 792893982 792834320 793053360 793517838 793151093 793264923 793044815 793135452 793059464
1862.2G93059464J61743O50940P3700K82669m38309m6768r66873o88019R55200L20816
$$ 793059464 793221207 793872147 793945847 794228516 793790207 793743439 792776566 792088547 793043747 793364563
1871.9G93364563N27802K61993N0354q9798K59094K36893j40152J28479L9215K21329
$$ 793364563 793892365 794154358 794204712 794114914 794374008 794610901 794470749 794599228 794638443 794859772
1881.5G94859772q4992J19553l51334k10800O91605J25045N53666p6981r45816N55954
$$ 794859772 794774780 794894333 794542999 794332199 795023804 795148849 795702515 795625534 794679718 795235672
1891.2G95235672O76651p9880L1281l61405q98513M77294O17066L57056J30538j2130
$$ 795235672 795912323 795832443 795863724 795502319 794603806 795081100 795698166 796055222 796185760 796173630
1900.8G96173630L3188r8343J97830k31781j20545k4414O8894J02005J19171J75705
$$ 796173630 796206818 796108475 796306305 796074524 795953979 795929565 795998459 796100464 796219635 796395340
1910.4G96395340j41678N09338k56958m37088l63922J32447Q72726j834335m78745
$$ 796395340 796253662 796763000 796506042 796068954 795705032 795837479 796710205 794875870 794397125
1919.1G94397125J496125J072921K32086j270523n29403P47451Q30231j30310m01153
$$ 794397125 795893250 796966171 797198257 795927734 795398331 796145782 796976013 796845703 796444550
1927.8G96444550l14789K60238N86701O4392P7591k71225O2103k33307q9493J30845
$$ 796444550 796129761 796389999 796976700 797041092 797118683 796847458 796909561 796676254 796586761 796717606
1937.5G96717606k23313J04447j74179P62863l73078j381302R00956N85861j06430
$$ 796717606 796494293 796598740 796424561 797187424 796814346 795433044 796334000 796919861 796813431
1946.1G96813431l96881L6239J60141K51084K07443j96838O5612J14594J67389j53046
$$ 796813431 796416550 796452789 796612930 796864014 797071457 796874619 796940231 797054825 797222214 797069168
1955.8G97069168M2801j04218j79672J11923j58844K00119K32773M15039r6359k39029
$$ 797069168 797111969 797007751 796828079 796940002 796781158 796981277 797214050 797629089 797532730 797293701
1965.4G97293701o6376o01654L74604J08032m11148K5482M76913N90363M09317J43509
$$ 797293701 797227325 796625671 797000275 797108307 796697159 796722641 797199554 797789917 798199234 798342743
1975.1G98342743n01175k24228m7760q7509K670k4566j38169j74026L26233J08947
$$ 798342743 797841568 797617340 797569580 797482071 797484741 797460175 797322006 797147980 797474213 797583160
1984.7G97583160k8991n2109M2190O3477j91574J96915j07880m85764J6556L96729
$$ 797583160 797554169 797502060 797544250 797607727 797416153 797613068 797505188 797019424 797035980 797432709
1994.3G97432709J28402P2403J00708k06909q1100l05710n2338j82113l00751J91116
$$ 797432709 797561111 797633514 797734222 797527313 797446213 797140503 797088165 796906052 796605301 796796417
2004G96796417J77994N67627L86505k74811o82220n15213j84937K15531L73459l36762
$$ 796796417 796974411 797542038 797928543 797653732 796971512 796456299 796271362 796486893 796860352 796523590
2013.6G96523590k51923K78931L14331n46341l98102J8769k81677P3699l12118k36054
$$ 796523590 796271667 796550598 796864929 796318588 795920486 795939255 795657578 795731277 795419159 795183105
2023.3G95183105p934K00577J79748j36261L33328m15802m89730k77939k39639K8915
$$ 795183105 795175171 795375748 795555496 795419235 795752563 795336761 794847031 794569092 794329453 794358368
2032.9G94358368k21100J00479j47552r3613q8272j90735j08108j2589O1112o28663
$$ 794358368 794137268 794237747 794090195 793996582 793908310 793717575 793609467 793596878 793657990 793029327
2042.6G93029327m2343R0409k11411M8828K25983M89578K2507j81351m56924j97678
$$ 793029327 792986984 793077393 792865982 792914810 793140793 793630371 793652878 793471527 793014603 792816925
2052.2G92816925J41449j90506l04565r8114K63519N6152M39682j3504n35126J9227
$$ 792816925 792958374 792767868 792463303 792365189 792628708 792684860 793124542 793111038 792575912 792595139
2061.9G92595139P2708J79672m20532j18409N76554K77023J46332P0648j38321l69568
$$ 792595139 792667847 792847519 792426987 792308578 792885132 793162155 793308487 793379135 793240814 792871246
2071.5G92871246J31684N7983j45340j32751k54593J52969J03226K21939R3918j85013
$$ 792871246 793002930 793060913 792915573 792782822 792528229 792681198 792784424 793006363 793100281 792915268
2081.1G92915268Q3313J44577J52969O0120j40305j83639Q8119L28904K63519K6779
$$ 792915268 792998581 793143158 793296127 793356247 793215942 793032303 793120422 793449326 793712845 793739624
2090.8G93739624m5776l88184l63693M9133N0430L13340N3253Q1482P8964j9989K38495
$$ 793739624 793693848 793305664 792941971 792991104 793041534 793354874 793408127 793489609 793568573 793548584 793787079
2101.4G93787079k67792k5558J91574L58352J81427l55453L1509K56882N12924M4403
$$ 793787079 793519287 793493729 793685303 794043655 794225082 793869629 793901138 794158020 794670944 794715347
2111G94715347k89001l24326k63443J09482j05667n4245m1504M84390M02832m5089
$$ 794715347 794426346 794102020 793838577 793948059 793842392 793788147 793746643 794231033 794633865 794588776
2120.7G94588776M8217j36871p4310k70920p2784k33536r2545J22147R8343N89218
$$ 794588776 794636993 794500122 794425812 794154892 794082108 793848572 793756027 793878174 793976517 794565735
2130.3G94565735K01797K69928k82364m86145k14233n18723M9363J32522M84543L99704
$$ 794565735 794767532 795037460 794755096 794268951 794054718 793535995 793585358 793717880 794202423 794602127
2140G94602127J92871L1967l60870r3994k14234L5553m3411j49994l59421l051O42700
$$ 794602127 794794998 794826965 794466095 794372101 794157867 794193420 794150009 794000015 793640594 793637543 794280243
2150.6G94280243J71432M67148J67084m6997q3389m78363j95847N9967J64795j62964
$$ 794280243 794451675 794918823 795085907 795038910 794955521 794477158 794281311 794341278 794506073 794343109
2160.2G94343109M26254P37839K78778j23062k19040J06278k14920q1253k41929l8909
$$ 794343109 794769363 795507202 795785980 795662918 795443878 795550156 795335236 795253983 795012054 794973145
2169.9G94973145L76739M00925O34384K60315K86178L1891q9416l15323k59934K26593
$$ 794973145 795349884 795750809 796385193 796645508 796931686 796963577 796874161 796558838 796298904 796525497
2179.5G96525497r7503j9837J11695R50317P89414k3575r5597n01556k49405l65524
$$ 796525497 796427994 796408157 796519852 797470169 798259583 798236008 798140411 797638855 797389450 797023926
2189.1G97023926k52533Q8119O13785O98700K89154L84064j91040M05655J60141p71714
$$ 797023926 796771393 796859512 797473297 798171997 798461151 798845215 798654175 799059830 799219971 798448257
2198.8G98448257k13317j3810K22702K67792L58353M41742M54483J53808k42996l26462
$$ 798448257 798234940 798221130 798443832 798711624 799069977 799511719 799966202 800120010 799877014 799550552
2208.4G99550552m77447j14670j72424R8190L93982M41818P25937L17383J01089O6071
$$ 799550552 799073105 798958435 798786011 798884201 799278183 799720001 800445938 800763321 800864410 800930481
2218.1H00930481p2250m54331m71496l09144J47858P92618K71606N5314L88793M85535
$$ 800930481 800858231 800403900 799932404 799623260 799771118 800563736 800835342 800890656 801279449 801764984
2227.7H01764984k38647n40696r7656j76239n2032j66931L34701P01447L93066L03116
$$ 801764984 801526337 800985641 800887985 800711746 800659714 800492783 800827484 801528931 801921997 802225113
2237.4H02225113n4855k75116n08194j43204M0588m54025l71399L92304N34744K91672
$$ 802225113 802170258 801895142 801386948 801243744 801284332 800830307 800458908 800851212 801385956 801677628
2247H01677628M01687R2316L05328k441l21427j91803n59463k67334L6240N84259L86581
$$ 801677628 802079315 802171631 802476959 802474518 802153091 801961288 801401825 801134491 801170731 801754990 802141571
2257.6H02141571J80206M14963j10702n42527m86679L53775o1187p7439L24631l8605
$$ 802141571 802321777 802736740 802626038 802083511 801596832 801950607 801889420 801811981 802136612 802098007
2267.3H02098007M03519K81677K88696J0529j93787k49557l41034r5139k32696K46811
$$ 802098007 802501526 802783203 803071899 803082428 802888641 802639084 802298050 802202911 801970215 802217026
2276.9H02217026k5254L129L38668M94995M64936l77274l17764n05371n1422L45001
$$ 802217026 802191772 802194901 802533569 803028564 803493500 803116226 802798462 802293091 802241669 802586670
2286.5H02586670K39715K16523r5749K56653k55585q4229N7526j85089j01166l26843
$$ 802586670 802826385 803042908 802947159 803203812 802948227 802863998 802921524 802736435 802635269 802308426
2296.2H02308426r842j01166M29688K13470J51520K44064k47345P5989o03790k99378
$$ 802308426 802298584 802197418 802627106 802840576 802992096 803236160 802988815 803064804 802461014 802161636
2305.8H02161636l32870m0207O84814J71967N10254j67465k09198l89939k31933L02353
$$ 802161636 801828766 801788559 802473373 802645340 803155594 802988129 802778931 802388992 802157059 802459412
2315.5H02459412l53928L79028j11694j13068O87714k45819r08508J02386J024094
$$ 802459412 802105484 802484512 802372818 802259750 802947464 802701645 801793137 801895523 802919617
2324.2H02919617J48315o16379j048202J89209J99280m32206L58124J39008N13153
$$ 802919617 803067932 802451553 801403351 801592560 801791840 801359634 801717758 801856766 802369919
2332.8H02369919l83835l56445L97567l13720l08609j20697k25983M91562J216354
$$ 802369919 801986084 801629639 802027206 801713486 801404877 801284180 801058197 801549759 802766113
2341.5H02766113k03247l59649n35279p47909L3111j330185p98340J358643J891556
$$ 802766113 802562866 802203217 801667938 800920029 800953140 799622955 798824615 800183258 802074814
2350.2H02074814q7357j234817j27793N82428q3007j418992q77380q06427J597061
$$ 802074814 801987457 800752640 800624847 801207275 801124268 799705276 798827896 798021469 799618530
2358.9G99618530K853775p67898j893006L13187J076813j127014m9286R80301J0986
$$ 799618530 802472305 801704407 799811401 800124588 801201401 800074387 800025101 801005402 801016388
2367.6H01016388j529388j758500N94483M33197J25427l1052m09088k63748N4779J37253
$$ 801016388 799487000 797728500 798322983 798756180 798881607 798850555 798441467 798177719 798232498 798369751
2377.2G98369751n24750L78647N56870k13929k22168p7819K64663L64762K94876q9722
$$ 798369751 797845001 798223648 798780518 798566589 798344421 798266602 798531265 798896027 799190903 799101181
2386.8G99101181k40326l69873k70691p5378m47922l26920J93940P73239K50168l48893
$$ 799101181 798860855 798490982 798220291 798144913 797696991 797370071 797564011 798337250 798587418 798238525
2396.5G98238525k06527k13547r9564n16205m73785j1291r7657n33828j27488N69840
$$ 798238525 798031998 797818451 797718887 797202682 796728897 796717606 796619949 796086121 795958633 796528473
2406.1G96528473L1586o9275K18124K06833m48837q23822m27704m11987o4011K63443
$$ 796528473 796560059 796490784 796708908 796915741 796466904 795643082 795215378 794803391 794739380 795002823
2415.8G95002823L67508J58844K8915l11966o13785k44140m71802k36435p1564q926
$$ 795002823 795370331 795529175 795558090 795246124 794632339 794388199 793916397 793679962 793608398 793599472
2425.4G93599472K1668j77231J32599l34626l64761k23541j52817R8495k31781l76358
$$ 793599472 793621140 793443909 793576508 793241882 792877121 792653580 792500763 792599258 792367477 791991119
2435.1G91991119n57632k73972o179J68991L00369k52915n76858l27225L0060n0125
$$ 791991119 791433487 791159515 791153336 791322327 791622696 791369781 790792923 790465698 790495758 790445633
2444.7G90445633l37830l77273J78222j5487o54297m19769L9215K72827k37961j13220
$$ 790445633 790107803 789730530 789908752 789893265 789238968 788819199 788858414 789131241 788893280 788780060
2454.3G88780060k5025j53961l21045p97119O3858m3106k70920K28882n6305k63366
$$ 788780060 788755035 788601074 788280029 787482910 787546768 787503662 787232742 787461624 787405319 787141953
2464G87141953k56730k26059o91146j22147J95312m06723j66168M2725m044k01721
$$ 787141953 786885223 786659164 785968018 785845871 786041183 785634460 785468292 785511017 785506973 785305252
2473.6G85305252J98975O6299l70102l86123m91105l20816m92935j86920j84326j37329
$$ 785305252 785504227 785570526 785200424 784814301 784323196 784002380 783509445 783322525 783138199 783000870
2483.3G83000870J94626J73645K15225l13416k27050l49503n82581l37448J12000L24859
$$ 783000870 783195496 783369141 783584366 783270950 783043900 782694397 782111816 781774368 781886368 782211227
2492.9G82211227m11300J5640M59976Q9035m01535m35409J8539j42822j78986n86166
$$ 782211227 781799927 781815567 782275543 782364578 781963043 781527634 781546173 781403351 781224365 780638199
2502.6G80638199m40140o9199J33439P26013M14276j24741o51931l91846k46964n15365
$$ 780638199 780198059 780128860 780262299 780988312 781402588 781277847 780625916 780234070 779987106 779471741
2512.2G79471741L1051j907k16675n6457K87094M12979o1646n07431l21579l47671
$$ 779471741 779502792 779500885 779284210 779227753 779514847 779927826 779866180 779358749 779037170 778689499
2521.9G78689499p03659k25449J46637K95944J89515o8436j72958j39618J23596n30014
$$ 778689499 777985840 777760391 777907028 778202972 778392487 778324051 778151093 778011475 778135071 777605057
2531.5G77605057q94470p31354k23313N17044k1820l86962O4926J64718j31302j14822
$$ 777605057 776710587 775979233 775755920 776272964 776251144 775864182 775929108 776093826 775962524 775847702
2541.1G75847702k97546n26123l74070n03006k33154q469Q0796J08261N9357L57971
$$ 775847702 775550156 775024033 774649963 774146957 773913803 773905334 773986130 774094391 774153748 774511719
2550.8G74511719r0256q25348r20029o72302m14581O4621L57513P324p3547J32294
$$ 774511719 774421463 773596115 772676086 772003784 771589203 771653824 772011337 772018661 771945114 772077408
2560.4G72077408m1504j45569j93710o62079m50974m03289o02112k3957K13089K79999
$$ 772077408 772035904 771890335 771696625 771034546 770583572 770180283 769578171 769554214 769767303 770047302
2570.1G70047302j89056k46430p553k84271j44501m93621m63639k18811j16958L0365
$$ 770047302 769858246 769611816 769604263 769319992 769175491 768681870 768218231 767999420 767882462 767912827
2579.7G67912827j15891O4316o1646j18103l06320n05066n07202n82352k87475j9074
$$ 767912827 767796936 767861252 767799606 767681503 767375183 766870117 766362915 765780563 765493088 765474014
2589.4G65474014K87323K94724J41525j87225k43225q1482k35825l45154o51931o9657
$$ 765474014 765761337 766056061 766197586 766010361 765767136 765685654 765449829 765104675 764452744 764383087
2599G64383087K39182m120J15204j16272k11716k17972j4572m91333o58569K746m7607
$$ 764383087 764622269 764618149 764733353 764617081 764405365 764187393 764172821 763681488 763022919 763025665 762978058
2609.6G62978058l75061o63757k60010j33744j67312K62832J78986l81851p06711k47498
$$ 762978058 762602997 761939240 761679230 761545486 761378174 761641006 761819992 761438141 760731430 760483932
2619.3G60483932m20608n12314r2697k69699l75137p6523K2049n01480m38233m30984
$$ 760483932 760063324 759551010 759458313 759188614 758813477 758736954 758759003 758257523 757819290 757388306
2628.9G57388306o63910n00260l06549J23368J35269R7046k06299o45294o88172n23681
$$ 757388306 756724396 756224136 755917587 756040955 756176224 756273270 756066971 755421677 754733505 754209824
2638.5G54209824m23661m65088k40631o35528k59476M32205k02713o62918n87616l82843
$$ 754209824 753786163 753321075 753080444 752444916 752185440 752617645 752414932 751752014 751164398 750781555
2648.2G50781555l59802j17569l63464m05503K05002k13165p13959m71268p2250l07922
$$ 750781555 750421753 750304184 749940720 749535217 749740219 749527054 748813095 748341827 748269577 747961655
2657.8G47961655l90931n31616o13708k90528l45611K35748r8266n07050k06604l44543
$$ 747961655 747570724 747039108 746425400 746134872 745789261 746025009 745926743 745419693 745213089 744868546
2667.5G44868546l00141o78329j64185N2490o46896n15442m9515J85929o2867j23062
$$ 744868546 744568405 743890076 743725891 743778381 743131485 742616043 742566528 742752457 742689590 742566528
2677.1G42566528k46734m86069q33054o03027k00729l92533j27868j22300R7046j34964
$$ 742566528 742319794 741833725 741000671 740397644 740196915 739804382 739676514 739554214 739651260 739516296
2686.8G39516296n66024n43518n11551K70614q2550o45294n07584k84576J29623R8572
$$ 739516296 738950272 738406754 737895203 738165817 738083267 737437973 736930389 736645813 736775436 736874008
2696.4G36874008l10211o06003l3569k84348m36248l30201p48901k39258k63367k26898
$$ 736874008 736563797 735957794 735924225 735639877 735203629 734873428 734124527 733885269 733621902 733395004
2706G33395004l82614k64740J56174o87409p93380m78516K823p4616m62493k48414
$$ 733395004 733012390 732747650 732903824 732216415 731423035 730944519 730947342 730872726 730410233 730161819
2715.7G30161819m67529k365q9035p11822k66953n9738l95661m46472p2632n5770l08381
$$ 730161819 729694290 729691925 729602890 728891068 728624115 728564377 728168716 727722244 727649612 727593842 727285461
2726.3G27285461k38952k59629k21939K5788l49579m69360l56980p93915n10864K94190
$$ 727285461 727046509 726786880 726564941 726590729 726241150 725771790 725414810 724620895 724110031 724404221
2735.9G24404221M50363n71747o96564l357k07748J83868j20010p06482l10516j53809
$$ 724404221 724854584 724282837 723586273 723582916 723375168 723559036 723439026 722732544 722422028 722268219
2745.6G22268219m3411j52970k18658j30386R3612j82876p00913l19290o3553l49045
$$ 722268219 722224808 722071838 721853180 721722794 721816406 721633530 720932617 720613327 720549774 720200729
2755.2G20200729o94885k80685J52511j88141j67617K60391M12216k32162p82624o92672
$$ 720200729 719505844 719225159 719377670 719189529 719021912 719282303 719694519 719462357 718679733 717987061
2764.9G17987061m40140J01547J41449k65121n0507P9880P858m6539n68314m64630
$$ 717987061 717546921 717648468 717789917 717524796 717474289 717554169 717562027 717515488 716947174 716482544
2774.5G16482544k68860o33316m43420O2408J04752l50571k42386l47748q47854o13404
$$ 716482544 716213684 715580368 715136948 715199356 715304108 714953537 714711151 714363403 713515549 712902145
2784.2G12902145l58886k02561k97317j21384K69394J49002l77045j240844j230774
$$ 712902145 712543259 712340698 712043381 711921997 712191391 712340393 711963348 710722504 709491730
2792.8G09491730n73654q4763P2784n0964j78299o60934q47397m55246k97928p21054
$$ 709491730 708918076 708833313 708906097 708855133 708676834 708015900 707168503 706713257 706415329 705694275
2802.5G05694275r83887n15899Q8424k31018q24203k89994l30352j049347r08738m90646
$$ 705694275 704710388 704194489 704282913 704051895 703227692 702937698 702607346 701557999 700649261 700158615
2812.1G00158615l37601o24237o70395o94885q61053n65338n11094o99234q22906o63757
$$ 700158615 699821014 699196777 698526382 697831497 696970444 696405106 695894012 695194778 694371872 693708115
2821.8F93708115o26984j021271p14111n93338j105957r70459o10123m91104n92575
$$ 693708115 693081131 692059860 691345749 690752411 689646454 688675995 688065872 687574768 686982193
2830.4F86982193n54886q23974r90983m08096j035995j420822r31626r78241r28726
$$ 686982193 686427307 685603333 684612350 684204254 683168259 681747437 680815811 679837570 678908844
2839.1F78908844j159134r02710j026459j342620j233140j574478j194305j527710
$$ 678908844 677749710 676847000 675820541 674477921 673244781 671670303 670475998 668948288
2846.8F68948288j620102j145096j436691j259766j641769j350708o29730q94699r62449
$$ 668948288 667328186 666183090 664746399 663486633 661844864 660494156 659864426 658969727 658007278
2855.5F58007278q63494l87421l64456q27408o20499l83911r29336j175385p89185
$$ 658007278 657143784 656756363 656391907 655564499 654944000 654560089 653630753 652455368 651666183
2864.2F51666183p30743j001434j603318j711120j370087j292419j495209j488876
$$ 651666183 650935440 649934006 648330688 646619568 645249481 643957062 642461853 640972977
2871.9F40972977j067505j017075j047020j645241k039451j687050j665344j377373
$$ 640972977 639905472 638888397 637841377 636196136 634156685 632469635 630804291 629426918
2879.6F29426918j188393j332016j391220m98924N608q96378q07686p87544r59435
$$ 629426918 628238525 626906509 625515289 625016365 625021973 624125595 623317909 622530365 621570930
2888.3F21570930m67491l67889l40233k17590J01433o0425n56221l94364k09770p14149
$$ 621570930 621103439 620735550 620395317 620177727 620279160 620218735 619662514 619268150 619058380 618344231
2897.9F18344231o39611P9575k52647m65355n7259O7978l59154p16820m75692q19855
$$ 618344231 617704620 617784195 617531548 617066193 617008934 617076912 616717758 616000938 615525246 614705391
2907.6F14705391j163902r37310o42814p57599j042099q09860r37271j118622j287880
$$ 614705391 613541489 612604179 611961365 611203766 610161667 609351807 608414536 607295914 606008034
2916.3F06008034j768379j727944j319427j245041j400872j114845q65631q68263q14896
$$ 606008034 604239655 602511711 601192284 599947243 598546371 597431526 596565895 595697632 594882736
2925E94882736m94537J0643j7281k52838l65143q7166L90397K86064K88276P36733
$$ 594882736 594388199 594398842 594381561 594128723 593763580 593676414 594066811 594352875 594641151 595377884
2934.6E95377884P93800J096077J604691J465950J471977J572762J826629J895561
$$ 595377884 596171684 597267761 598872452 600338402 601810379 603383141 605209770 607105331
2942.3F07105331J701470J843605J582146J529197J670304J649284J546631J446152
$$ 607105331 608806801 610650406 612232552 613761749 615432053 617081337 618627968 620074120
2950F20074120J633567J619416J719894J665154J667289J729279J357307J256218J845932
$$ 620074120 621707687 623327103 625046997 626712151 628379440 630108719 631466026 632722244 634568176
2958.7F34568176K238770J556740J395187J379280J177139J426697J177139J401749
$$ 634568176 636806946 638363686 639758873 641138153 642315292 643741989 644919128 646320877
2966.4F46320877J529389J154861J363449J439819J421280J469879J248551J239395
$$ 646320877 647850266 649005127 650368576 651808395 653229675 654699554 655948105 657187500
2974.1F57187500R40399M92249J030807J118393P32575J039199J346665J082611O35223
$$ 657187500 658127899 658620148 659650955 660769348 661501923 662541122 663887787 664970398 665605621
2982.8F65605621J077347J373291P64160M79126O49109K75650L32108J012497L64608
$$ 665605621 666682968 668056259 668820419 669299545 669948654 670224304 670556412 671568909 671933517
2991.5F71933517L69034R91135M49448p3548j48620M57229L77197j77688J30844J76086
$$ 671933517 672302551 673293686 673743134 673669586 673520966 673978195 674355392 674177704 674308548 674484634
3001.1F74484634n874M34646M48075l92838m57916l24631m44336j27105J97982o485
$$ 674484634 674478760 674913406 675361481 674968643 674510727 674186096 673741760 673614655 673812637 673806152
3010.8F73806152n52215p45850n96466k2736j10702m87595m88815n62820l19367o97861
$$ 673806152 673253937 672508087 671911621 671888885 671778183 671290588 670801773 670238953 669919586 669221725
3020.4F69221725m15496j25733q92029q48617o20499n96542q69446o47812l54996o24237
$$ 669221725 668806229 668680496 667788467 666939850 666319351 665722809 664853363 664205551 663850555 663226318
3030.1F63226318n11932p29218r14001r35593p01065l79333m76608o24466o99387o16455
$$ 663226318 662714386 661985168 661071167 660135574 659434509 659055176 658578568 657954102 657254715 656638260
3039.7F56638260r24606q87223q46176j047974q33892j031723r62754n78308n30014
$$ 656638260 655713654 654826431 653980255 652932281 652098389 651066666 650103912 649525604 648995590
3048.4F48995590o08063q41980j305542j202316n84717p88879q88824o50025o32019
$$ 648995590 648387527 647545547 646240005 645037689 644452972 643664093 642775269 642125244 641493225
3057.1F41493225o28815o90155o80542j026611j123466q31490r44748j116829r38797
$$ 641493225 640864410 640174255 639493713 638467102 637343636 636512146 635567398 634450569 633511772
3065.7F33511772n74722l81279q85468j507454q27102j18332p31583j190758r92164
$$ 633511772 632937050 632555771 631670303 630162849 629335747 629217415 628485832 627295074 626302910
3074.4F26302910r84001r78585l99551k91977r86633j205406p84836n19715p26699
$$ 626302910 625318909 624340324 623940773 623648796 622662163 621456757 620671921 620152206 619425507
3083.1F19425507p97120o19316p41233r46579j049118r77364o25305p99027r96399
$$ 619425507 618628387 618009071 617267838 616321259 615272141 614294777 613669472 612870445 611874046
3091.8F11874046r84268j208877n83153n57938j123466p39479r19991j343346j104698
$$ 611874046 610889778 609680901 609097748 608539810 607416344 606676865 605756874 604413528 603308830
3100.5F03308830m80194n33104j201210q63228l96461p51839q42056q24051j267776
$$ 603308830 602828636 602295532 601094322 600231094 599834633 599082794 598240738 597416687 596148911
3109.1E96148911j062661p89985o06995k40135n75485o45905j130524j272506l57857
$$ 596148911 595086250 594296265 593689270 593449135 592873650 592227745 591097221 589824715 589466858
3117.8E89466858q27789j434822q58384p88993j375008q20770j91307p88193r02367
$$ 589466858 588639069 587204247 586345863 585556870 584181862 583361092 583169785 582381592 581479225
3126.5E81479225q05855j104812p89337n74494j078110r52758q61397q58536m55933
$$ 581479225 580673370 579568558 578779221 578204727 577126617 576173859 575312462 574453926 573997993
3135.2E73997993p80220n05409n56068j282311j253090j122474q29544r07135m90456
$$ 573997993 573217773 572712364 572156296 570873985 569620895 568498421 567668877 566761742 566271286
3143.9E66271286l33252j031570r16634q24776o28891m01649o44074j199646j346130
$$ 566271286 565938034 564906464 563989830 563165054 562536163 562134514 561490440 560290794 558944664
3152.5E58944664p74956o63337n99976n53322q71239j133766q26339l62740o29349
$$ 558944664 558169708 557506371 556906395 556353073 555481834 554348068 553521729 553158989 552529640
3161.2E52529640r91707q86917m92439m44298q66813j174622p01637n02434p73163
$$ 552529640 551537933 550651016 550158577 549714279 548847466 547672844 546971207 546468773 545695610
3169.9E45695610m50973q46367j036911n84870m78248o80771r43146n19600q38051
$$ 545695610 545244637 544398270 543361359 542776489 542298241 541617470 540674324 540154724 539316673
3178.6E39316673q35762m76684j114426p45544k81563o42281r74464o83594n18036
$$ 539316673 538480911 538004227 536889801 536144257 535862694 535220413 534245949 533562355 533044319
3187.3E33044319j012649n02015j18713o42548o76612q70285j239396o81343k54631
$$ 533044319 532031670 531529655 531410942 530768394 530091782 529221497 527982101 527300758 527046127
3195.9E27046127o05850p31697q57964r33837m83361m40674p99179n70144n96352o13365
$$ 527046127 526440277 525708580 524850616 523916779 523433418 522992744 522193565 521623421 521027069 520413704
3205.6E20413704m41246p79762n47066q08029r75762j51214k24953l04031m08097o71882
$$ 520413704 519972458 519192696 518645630 517837601 516861839 516710625 516485672 516181641 515773544 515101662
3215.2E15101662m25644m05884m61235p12776j114960q89130l11813l0861n33943j205139
$$ 515101662 514676018 514270134 513808899 513096123 511981163 511092033 510780220 510749359 510215416 509010277
3224.9E09010277p11708m57382o80924o1150Q660n77889q25462k48756j72272p49741
$$ 509010277 508298569 507841187 507160263 507099113 507107773 506529884 505704422 505455666 505283394 504533653
3234.5E04533653l45344l73993o72608p71331r97620o67458k14843j28594k65732m30488
$$ 504533653 504188309 503814316 503141708 502370377 501372757 500705299 500490456 500361862 500096130 499665642
3244.2D99665642j142197r44290J15738j06239p01828m45404j12153m20990k67410
$$ 499665642 498523445 497579155 497694893 497588654 496886826 496441422 496329269 495908279 495640869
3252.8D95640869p65571j110573J01166l08075r46961n16968k09846k76909n30891
$$ 495640869 494875298 493764725 493865891 493557816 492610855 492093887 491884041 491607132 491076241
3261.5D91076241m4899n11017r05876m6235k34527n36308l06206m98963l07235n6153
$$ 491076241 491031342 490520325 489614449 489568214 489333687 488797379 488491173 487992210 487684975 487628822
3271.2D87628822k37159l60947q28095q57887n17807j99890K88963j47895o51398o09703
$$ 487628822 487391663 487030716 486202621 485344734 484826927 484627037 484916000 484768105 484116707 483507004
3280.8D83507004k86713l7460o08444n53704J82991Q240m53606m83818m78897l15933
$$ 483507004 483220291 483182831 482574387 482020683 482203674 482211914 481758308 481274490 480795593 480479660
3290.4D80479660l29857n87730l40157j65329n16052o93321l66364l00674m66347k58980
$$ 480479660 480149803 479562073 479221916 479056587 478540535 477847214 477480850 477180176 476713829 476454849
3300.1D76454849j02157P5988P5913n44930p24983k36397l30085n15404o21376q29926
$$ 476454849 476352692 476428680 476504593 475959663 475234680 474998283 474668198 474152794 473531418 472701492
3309.7D72701492n73921m77333k59628k25296k05612J98402j84326o87752n39818l10783
$$ 472701492 472127571 471650238 471390610 471165314 470959702 471158104 470973778 470286026 469746208 469435425
3319.4D69435425q26836q24776k79731m20265k89536m72717m02108j53388o94390r59778
$$ 469435425 468608589 467783813 467504082 467083817 466794281 466321564 465919456 465766068 465071678 464111900
3329D64111900o33812k21481o32477p37724m29840m02413l55491n60684m70238l45497
$$ 464111900 463478088 463256607 462624130 461886406 461456566 461054153 460698662 460137978 459667740 459322243
3338.7D59322243l91999n67512k96097k36320j052437j047783n55801l51105m01039
$$ 459322243 458930244 458362732 458066635 457830315 456777878 455730095 455174294 454823189 454422150
3347.3D54422150l30811l29323l71628m76226p62673m09279n87501l73726l53928j205063
$$ 454422150 454091339 453762016 453390388 452914162 452151489 451742210 451154709 450780983 450427055 449221992
3357D49221992o09054k00043k45094p38525j052399m74854o82640l88412Q3275n14603
$$ 449221992 448612938 448412895 448167801 447429276 446376877 445902023 445219383 444830971 444914246 444399643
3366.6D44399643j121178o30684l7269l29895j59073l33214p76062k93083k47154p51000
$$ 444399643 443278465 442647781 442610512 442280617 442121544 441788330 441012268 440719185 440472031 439721031
3376.3D39721031n41878k84652p84226p58323j97525m73328p75223l01475o9962k83394
$$ 439721031 439179153 438894501 438110275 437351952 437154427 436681099 435905876 435604401 435534439 435251045
3385.9D35251045k90603p3319k22282o97022p45659l00750j11084n05906j76544J12458
$$ 435251045 434960442 434887123 434664841 433967819 433222160 432921410 432810326 432304420 432127876 432240334
3395.6D32240334l10860m63753l24554j9493k35405n0698o5155l18603J3847l97262
$$ 432240334 431929474 431465721 431141167 431121674 430886269 430835571 430770416 430451813 430465660 430068398
3405.2D30068398j28594l47443n22079J46866j56670j78222k43912j01853m14352k45209
$$ 430068398 429939804 429592361 429070282 429217148 429060478 428882256 428638344 428536491 428122139 427876930
3414.8D27876930L28064o25725m45556K98614M24042k73781l70674L54805j16272P897
$$ 427876930 428204994 427579269 427133713 427432327 427856369 427582588 427211914 427566719 427450447 427458344
3424.5D27458344J52397M158o8856J46637J82686m01077M425K37999L06702J50642
$$ 427458344 427610741 427614899 427546043 427692680 427875366 427474289 427478714 427716713 428023415 428174057
3434.1D28174057k37045k1210l8681j26991L7727N41229O27632J77956k365N07431
$$ 428174057 427937012 427915802 427877121 427750130 427787857 428329086 428956718 429134674 429132309 429639740
3443.8D29639740L51334J78642N26810m65889N226O16379L92951M18053O11M02259
$$ 429639740 429991074 430169716 430696526 430230637 430235863 430852242 431245193 431663246 431663857 432066116
3453.4D32066116Q45642J030388M23241j17989K52152M11911N49202L2043j73874O6605
$$ 432066116 432911758 433942146 434365387 434247398 434499550 434911461 435460663 435492706 435318832 435385437
3463.1D35385437P92503P69234K55623Q55637N78880N03502N01365L73078M38041j411
$$ 435385437 436177940 436947174 437202797 438058434 438637314 439140816 439642181 440015259 440453300 440451889
3472.7D40451889M11949R05304O30837L58314O50368O04973P78465O03523l27759l13262
$$ 440451889 440863838 441769142 442399979 442758293 443408661 444013634 444792099 445395622 445067863 444754601
3482.3D44754601N51948J695366L97911k18811J209641N15060K26517Q29925P52564
$$ 444754601 445306549 447001915 447399826 447181015 448390656 448905716 449132233 449962158 450714722
3491D50714722L84559N53170N12466O37703Q88023J75476P15142O33812N07240R13505
$$ 450714722 451099281 451652451 452164917 452802620 453690643 453866119 454581261 455215073 455722313 456635818
3500.7D56635818Q31528O07224l72467L90243J079331J086197R44328P91969r5711
$$ 456635818 457467346 458074570 457702103 458092346 459171677 460257874 461202202 461994171 461898460
3509.4D61898460l58276J812592R28802J62392P11212M17480P00798M65393Q84018
$$ 461898460 461540184 463352776 464281578 464443970 465155182 465572662 466273460 466738853 467622871
3518D67622871Q49381N00946J240044J753883M85649p89680K24800P88726J480523
$$ 467622871 468472252 468973198 470213242 471967125 472452774 471663094 471887894 472676620 474157143
3526.7D74157143J094780N48591N57976J148796R34563j12725J034432O48727J131745
$$ 474157143 475251923 475800514 476358490 477507286 478441849 478329124 479363556 480012283 481144028
3535.4D81144028R07135n84984J218033J102867Q75931R73243J126252Q34961Q43505
$$ 481144028 482051163 481466179 482684212 483787079 484663010 485636253 486762505 487597466 488440971
3544.1D88440971O32477q4572J564713m77257J265984K635193J609993J667709j607208
$$ 488440971 489073448 488988876 490553589 490076332 491342316 493977509 495587502 497255211 495648003
3552.7D95648003Q02497J803704J129188J329766M82597J962509R72939M34150K23847
$$ 495648003 496450500 498254204 499383392 500713158 501195755 503158264 504131203 504565353 504789200
3561.4E04789200J460152J353874J100845M526100M35829q38546o37894k63252L734588
$$ 504789200 506249352 507603226 508704071 513230171 513666000 512827454 512189560 511926308 515660896
3570.1E15660896J763687J526947J110383J088867J433372J831970K021294M6463K044373
$$ 515660896 517424583 518951530 520061913 521150780 522584152 524416122 526437416 526483879 528528252
3578.8E28528252J711235Q24127J452370K233085K246437N50309M039611J602097k199059
$$ 528528252 530239487 531063614 532515984 534749069 536995506 537545815 541585426 543187523 540988464
3587.5E40988464J794625m56429K544899K792206K652855Q20541J227837M057426j422119
$$ 540988464 542783089 542326660 544871559 547663765 550316620 551137161 552364998 556422424 555000305
3596.1E55000305J930046K953186L31345L116760J15853R8266K846794K358551K060738
$$ 555000305 556930351 559883537 560214882 563331642 563447495 563545761 566392555 568751106 570811844
3604.8E70811844L208656K037125j007080M283409j212235q11729P755585P0572k765542
$$ 570811844 574020500 576057625 575050545 579333954 578121719 577309990 585065575 585136147 582370605
3613.5E82370605L914376m18205L475532L722649J62925J031609r50890K149201L472023
$$ 582370605 586284981 585866776 589342308 593064957 593227882 594259491 593308601 595457802 598929825
3622.2E98929825K528534K500648K440338J333237J763611N666237m000855j0291404
$$ 598929825 601458359 603959007 606399345 607732582 609496193 615162430 611161575 600870171
3629.9F00870171O251182O056366N853233L6431l042870K650528L807564K617760Q48694
$$ 600870171 607121353 613177719 619030952 619067383 616024513 618675041 622482605 625100365 625949059
3638.6F25949059J173439J577339K338943Q21038l43895J850509L279724N487938j830444
$$ 625949059 627122498 628699837 631038780 631859818 631515923 633366432 636646156 642134094 640303650
3647.3F40303650m169273M944572r01032l753929J424752O560516M082947L404541
$$ 640303650 636134377 641078949 640177917 636423988 637848740 644409256 648492203 651896744
3655F51896744L066864q197174K418365M705887Q07571O35300N87769K584533Q87146
$$ 651896744 654963608 646766434 649184799 653890686 654698257 655333557 655921326 658505859 659393005
3663.6F59393005P43103J595536J341247M299011J856690j852264j838837o809921
$$ 659393005 660136108 661731644 663072891 667371902 669228592 667376328 665537491 658727570
3671.4F58727570M146118R320373Q292542m280853j8684235N222320Q620835M612579
$$ 658727570 662873688 672194061 680486603 676205750 657521515 662743835 671364670 675977249
3679.1F75977249k696380N34896L548813J875611J257095l13644J43737M430542M974976
$$ 675977249 673280869 673815765 677364578 679240189 680497284 680183640 680327377 684757919 689732895
3687.8F89732895r977951j871948P118606o068191J646194N755081R86634J624603
$$ 689732895 679754944 677882996 685001602 678933411 680579605 686334686 687321320 688945923
3695.5F88945923n4321l16239Q90427N79986L138504K069092n875015n83649N084152
$$ 688945923 688891602 688575363 689465790 690045776 693184280 695253372 689378357 688794708 693878860
3704.1F93878860J167374O1417K08282L024903M412918p782975K921524K061234j2630768
$$ 693878860 695046234 695107651 695315933 698340836 702753754 694970779 697892303 699953537 687322769
3712.8F87322769O239853M846954L89939P33185K588501J456604l993683Q91952N914917
$$ 687322769 693562622 698409576 698799515 699532700 702121201 703577805 699584122 700476074 706390991
3721.5G06390991l719864m549179M801331N25360q33893k227631P80106L641510J749191
$$ 706390991 702671127 698121948 702923279 703448639 702614746 700387115 701167221 704808731 706557922
3730.2G06557922N694733m857101n984040J0073166O71616r802170l36914K729263
$$ 706557922 712252655 707395554 701411514 711484680 712156296 702354126 702017212 704746475
3737.9G04746475N50614L023529K817382m169235M196244J1027984j3955765j2827682
$$ 704746475 705297089 708320618 711138000 706968765 711165009 722192993 708237228 695409546
3745.6F95409546J1534119O272049N077590n768508q617096J1732482p113876n844726
$$ 695409546 706943665 713215714 718293304 712524796 703907700 715640182 708526306 702681580
3753.3G02681580O941223M952011K677231n610504K484664M876786p590790J67923
$$ 702681580 709622803 714574814 717252045 711641541 714126205 719002991 711412201 711580124
3761G11580124M674225P52105J29090L014984l313522m310685L809357N264664q77533
$$ 711580124 716254349 717006454 717135544 720150528 716837006 712526321 716335678 721600342 720722809
3769.7G20722809q472595L380584L538590L55606M98505n73502J079636J110229K590866
$$ 720722809 712250214 715630798 719169388 719524994 720023499 719449997 720529633 721639862 724230728
3778.4G24230728k227173p448425L542557K301712J226120J691360k797088j26114
$$ 724230728 722003555 714555130 718097687 720399399 721625519 723316879 720519791 720393677
3786.1G20393677J196518N62591N77622Q2702N18875k26287J72958N8289J417923K323989
$$ 720393677 721590195 722152786 722730408 722813110 723331985 723105698 723278656 723336945 724754868 727078857
3795.8G27078857m432754k176437L843154M772644M377518r763336q936996M737625
$$ 727078857 722646103 720469666 724312820 729085464 733462982 723699646 714762650 719500275
3803.5G19500275L455276M930649M291840j0163117k549286N366135K079620J22071
$$ 719500275 722955551 727886200 732178040 722014923 719465637 724831772 726911392 727033463
3811.2G27033463M78439Q87298J342926L685379n148315j1830521P936402O428909
$$ 727033463 727511902 728399200 729742126 733427505 728279190 716448669 724385071 730813980
3818.9G30813980L923416j62048j7476273L374482O014404K542190K541504k60009
$$ 730813980 734737396 734575348 717099075 720473557 726487961 729030151 731571655 731311646
3826.6G31311646l838273K59781J825333L403244J193085q323670L720169O653061
$$ 731311646 727473373 727733154 729558487 732961731 734154816 725831146 729551315 736204376
3834.3G36204376o722030P48062P300186j0757294k640686P585449m890442J973191
$$ 736204376 729482346 730230408 737530594 726773300 724132614 731718063 726827621 728800812
3842.1G28800812N590973m629822k348175L434067J370620N32914K365188n77087J848144
$$ 728800812 734391785 729761963 727413788 730847855 732218475 732751389 735116577 734539490 736387634
3850.7G36387634N007935o953659k429733j6925736P023315J1506501j999131q07876
$$ 736387634 741395569 734441910 732012177 715086441 722109756 733616257 731617126 730809250
3858.4G30809250K612915K310257K274704o136856J138916O479873p887497l945617
$$ 730809250 733422165 735732422 738007126 731870270 733009186 739489059 731601562 727655945
3866.2G27655945N335922N448914M816894r795532p856598M332657O634979L097534
$$ 727655945 732991867 738440781 743257675 733462143 725605545 729938202 736573181 739670715
3873.9G39670715j0879440K010498M993439O45599K678528L372726o986007o154785
$$ 739670715 728791275 730801773 735795212 736440811 739119339 742492065 735506058 729351273
3881.6G29351273O333007J142273J078873L054047j2779389L031006M716339J042938
$$ 729351273 735684280 736826553 737905426 740959473 728180084 731211090 735927429 736970367
3889.3G36970367M315262k271118p964020L624420L431855j650009Q77380N49850K538758
$$ 736970367 741285629 739014511 731050491 734674911 738106766 736456757 737334137 737883987 740422745
3898G40422745N98373r666748N933991N99517m991607O523895k168884j766510j21231
$$ 740422745 741021118 731354370 737288361 737887878 732896271 739420166 737251282 735484772 735363541
3906.7G35363541K57034K142792L15323N50384j30920q4687k0065J68381J693115J150284
$$ 735363541 735620575 737763367 738078690 738629074 738498154 738413467 738393402 738561783 740254898 741405182
3916.3G41405182m086685k613602M777985N8670l517685J948242Q94546O00892j689301
$$ 741405182 737318497 734704895 739482880 739541550 736023865 737972107 738866653 739467545 737778244
3925G37778244j791306K513505J616058L29742j840210k42691K116089k248764o20575
$$ 737778244 735986938 738500443 740116501 740446243 738606033 738363342 740479431 738230667 737610092
3933.7G37610092J232453m42658K95334M36401R36814Q32443n02243J805191J007385
$$ 737610092 738842545 738399887 738695221 739131622 740068436 740900879 740398636 742203827 743211212
3942.3G43211212m769287k76947J750641M57992O90384j769714N07660p40128k070541
$$ 743211212 738441925 738164978 739915619 740373611 741063995 739294281 739801941 739061813 736991272
3951G36991272K644119J108475J41754N35355j93100k75879o47583N79376Q39K82975
$$ 736991272 739635391 740743866 740885620 741420975 741227875 740951996 740304413 740883789 740884628 741167603
3960.7G41167603J0604j176452R28039N56412n77469l1586N11628N43441r74044q87986
$$ 741167603 741178207 740001755 740929794 741486206 740908737 740877151 741388779 741932220 740958176 740070190
3970.3G40070190P95289J20315k20795M46930K67182L13644p55768j98898R26590L12881
$$ 740070190 740865479 740985794 740764999 741211929 741479111 741792755 741036987 740838089 741764679 742077560
3980G42077560M17710k30637j130905n49698Q39691M52118m73861J58691K96249K68097
$$ 742077560 742495270 742264633 741133728 740584030 741423721 741875839 741401978 741560669 741856918 742125015
3989.6G42125015l14026j75399l3265k27661L69644m90341r6359J454163R87243k69317
$$ 742125015 741810989 741635590 741602325 741374664 741744308 741253967 741157608 742611771 743599014 743329697
3999.2G43329697n03998
$$ 743329697 742825699
4000.2G42825699
$$ 742825699
##END=$$ End of the data block
