##TITLE=$$ Begin of the data block
##JCAMP-DX=5.00 $$ ACD/SpecManager v 10.08
##SPECTROMETER/DATA SYSTEM=Varian
##DATE=20 Nov 2012 13:54:50
##DATA TYPE=INFRARED SPECTRUM
##DATA CLASS=XYDATA
##ORIGIN=
##OWNER=
##NPOINTS=3735
##FIRSTX=399.26403809
##LASTX=4000.35498047
##MAXX=4000.35498047
##MINX=399.26403809
##MAXY=80.42748260
##MINY=40.05716324
##XFACTOR=1.0000000000
##YFACTOR=0.000000100000000
##FIRSTY=62.38788986
##DELTAX=0.96440572
##XUNITS=1/CM
##YUNITS=TRANSMITTANCE
##XYDATA=(X++(Y..Y))
399.3 623878899 599317856 611111526 625969810 618673630 602294426 599514542 608058968 616809425
407 616809425 615254555 613702011 618527756 612406044 606868362 613727646 613050003 601926765 604019928
415.7 604019928 616291466 618001709 617634964 618208275 612011414 611703072 607711754 605642662 610296402
424.3 610296402 608947601 604190025 604813805 605940742 607029686 608563995 608271637 606576614 601283264
433 601283264 600174522 602897568 597098160 592281265 599709778 608607635 608225899 603980331 602746315
441.7 602746315 604386787 607666817 611144257 614007378 616659355 616720772 614012718 615170670 618492126
450.4 618492126 618370323 615094872 614260712 623000984 627497253 623640823 617272491 605611191 605878220
459.1 605878220 607145386 610740509 616944389 611952209 601818047 599405708 604977570 605843353
466.8 605843353 606188164 608891029 606280823 604653053 603915787 602363892 599844246 597227783 597222443
475.5 597222443 596190414 592733994 592336197 595803909 597861557 596161270 595583916 595538788 592295456
484.1 592295456 592284851 593484459 594111824 596138268 597740402 599380417 596764030 591846962 590520935
492.8 590520935 590217705 590047340 589500122 590639343 592304420 592430191 591489830 593132515 594975739
501.5 594975739 588142319 583706322 584095459 584043961 584695816 586467552 586936836 585261688 585611954
510.2 585611954 585827255 583354797 580299759 576186829 574032707 574580803 573062325 569371185 568795967
518.9 568795967 569671555 568904953 566996841 566565132 566585655 565665092 564225426 562383499 564205780
527.5 564205780 565219231 564651833 564727898 564274673 564205475 562700310 562234344 563567047 565348282
536.2 565348282 567924957 570274811 572677689 574734917 576403122 577624702 579302635 581014023
543.9 581014023 581264534 580398369 581657066 584136696 583155785 582771378 584286804 583649025 581946640
552.6 581946640 581202774 581155891 579661942 577896271 576703033 577054939 576583481 574179687 574347000
561.3 574347000 573131180 571282272 570654335 567425346 563471603 560027695 557896347 557776489 558766479
570 558766479 556454468 553632889 552485542 551343918 551462860 550021019 549163628 549671898 551783066
578.6 551783066 555621834 558838348 562349396 564787102 566627502 568813400 570274277 571096687 571727486
587.3 571727486 572132072 573925819 575694313 575882111 578219986 580953331 581778908 581812286 580461807
596 580461807 578910408 579235878 580420456 580872231 580785179 581218262 582084351 581087990 579501305 578510361
605.6 578510361 578305511 579401016 578851776 578249321 578742447 580929756 583946266 584116936 584848289
614.3 584848289 585881386 585390015 584247818 584157600 586419563 588054008 589200249 590777931 593690224
623 593690224 596628799 597253113 597392426 598008499 598082390 598115768 599227066 599995842 600660896 602139816
632.7 602139816 603900871 605985718 606851311 606444855 606252861 606615639 606892166 607309418 608476677
641.3 608476677 609753265 611406212 612756271 613210297 613034515 613166237 613497009 613175888 613279839
650 613279839 613835831 615059166 616289406 617014122 618301353 619481201 619668808 618361168 617866020
658.7 617866020 618432312 616951561 616238861 617202377 618223801 620042191 621802101 623371086 623712234
667.4 623712234 618106346 620570107 622951126 623525352 622697792 622473259 624750061 626619110 627816620
676.1 627816620 628564110 628057060 628082047 628600311 628810081 628909340 628719788 628352928 629940262 632458687
685.7 632458687 632929993 633306732 633666496 633467560 633548737 632752113 632332420 632376595 632020645 631675797
695.3 631675797 631240654 631632576 631644096 630415459 629022675 628079033 627147598 625193710 624452858
704 624452858 624784546 624720993 625399246 625258484 624131432 624052887 625169449 625831375 625300369 626032600
713.7 626032600 627770004 628745079 630207672 632740784 635379601 637059250 637859459 639059525 641595306
722.3 641595306 643510437 644005051 645607147 648148422 650235825 652308960 654572525 656099091 657172089
731 657172089 658227463 658804016 659763412 661393051 662435837 663493652 664573135 664399185 664735565
739.7 664735565 664600601 664167099 665729294 667397308 668225403 667280197 665760956 664809952 664084778
748.4 664084778 663483047 662254868 661487350 660285263 658692703 656485214 654294815 654319077 653607941
757.1 653607941 651673203 650235138 649112015 648112564 646893921 645439301 643668518 643115997 644310226
765.7 644310226 645352325 646178589 647457352 648241730 648761520 650432358 651852493 652190247 654033585
774.4 654033585 658086777 661557999 664172974 667234116 670149460 672741623 674542389 676057663
782.1 676057663 676859589 677812881 679893112 681608200 683880234 686585846 689166260 690593872 691390686
790.8 691390686 691856003 691819763 693498001 694555359 694736786 695777664 698337173 701134109 702153473
799.5 702153473 703336258 704052734 704124146 704101181 704529724 705190735 705780792 707706451 709117966 709221268
809.1 709221268 709243088 709809113 709782257 709386292 709089584 708227310 706914978 705600891 707188721 709244843
818.8 709244843 709532700 709940720 709714355 709010925 708186874 707133865 705263672 703450775 702756500
827.5 702756500 703031158 702732086 702151566 702515182 701666794 699903564 696895905 694058838 692584763
836.1 692584763 690759506 689724274 689794159 689891891 688540955 688384781 688299561 685237427 682996750
844.8 682996750 681333313 679829254 678639603 676945801 676001282 676200485 676136932 674886856 673855362
853.5 673855362 672192459 670057831 667938843 665325241 663456726 662139435 661339722 661436462 662571869
862.2 662571869 664375305 666791992 669521866 671301956 673261414 675274658 677570801 681575775
869.9 681575775 686437073 690354385 693809509 697968063 700505829 701492615 702232285 703211746 703537369
878.6 703537369 703305283 703828354 704426346 705162811 704202423 701990585 699849396 697616501 695577927
887.3 695577927 693176651 690744019 688360367 686624374 685167236 682925415 680819931 679974747 678638763
895.9 678638763 676145325 674090424 671410446 668778687 667475815 666668701 665140076 663290634 662311554
904.6 662311554 660417633 657393875 654771957 652125092 648440933 644870605 642100906 638976250
912.3 638976250 636159439 633550301 630127335 626338654 622568359 619001236 615975761 613425751
920 613425751 611837234 610256920 608640709 608587914 608752327 608653564 608831253 608527756 607587662 606748390
929.7 606748390 606272163 605996857 606368866 608121719 610898781 612827644 613917999 614730186 615420380
938.4 615420380 616541557 617427750 618220291 619380188 620703545 622522774 624097328 624497910 624342270
947.1 624342270 623222008 620153427 616496506 613147469 609134254 604987907 600749435 596143265
954.8 596143265 591930809 587902870 583023262 577580566 571785927 565900955 560311966 554084549
962.5 554084549 548305321 542594376 536940422 531636276 525389290 518016815 509822159 502587967
970.2 502587967 495363159 488469963 481473389 474191895 467587967 460590439 454492722 448112259
977.9 448112259 442405319 436352119 430419769 425646629 420319061 416593056 413584061 411421089
985.6 411421089 408430862 406594238 405508804 403792839 403522301 402050972 401740456 400987244 400835571
994.3 400835571 401133270 400571632 401340866 401693192 403586388 404047127 404069977 404542274 404405022 404525375
1004 404525375 403988762 404577713 404711189 405897255 405876884 405342827 405508728 404517937 404202766 402476463
1013.6 402476463 402562675 402483559 402509537 403521919 403448524 404648514 405060234 406240578 406313286 406789627
1023.2 406789627 407863541 408342972 410314636 411454086 413660355 414927597 416124802 417175446
1031 417175446 418092232 420086975 420852165 422096825 422318230 422833023 423425140 424578133 425004768
1039.6 425004768 424167938 424771042 423686829 423517647 422923851 422901955 423543091 423116646 423986511 423992081
1049.3 423992081 425184021 425850029 426690979 427692566 429086876 432291718 435037117 438335724 440050278
1058 440050278 442668495 445648155 449126053 453244667 456011238 459618416 462396965 465020790 466418571
1066.6 466418571 468342094 470128860 470018272 468913651 465498505 462987022 459121284 454770317
1074.4 454770317 451089783 448598022 447489967 445244560 445529556 445888290 446613121 447377548 449137497
1083 449137497 451093636 451746330 453977814 454534492 456735954 459004440 461100731 463334999 464906197
1091.7 464906197 469083023 471834297 474421310 475851479 476577034 477338486 477693253 479086800 479092827
1100.4 479092827 480108490 480779228 482594833 485327606 484406738 481781197 480807228 481791191 481821213
1109.1 481821213 483155823 485233803 488066025 490769882 491854439 493745155 495138779 496902122
1116.8 496902122 497751770 498897934 500313873 500843315 502143440 502991562 504656563 505442390 506056061
1125.5 506056061 507083282 507846260 508669052 509202042 510995750 512350922 514424362 516857185 519073944
1134.1 519073944 520711098 520721779 520505447 519343338 518077965 515697861 513606644 512247009 510271187
1142.8 510271187 508737106 506776276 505444565 502975235 500337753 497743034 495512352 494240685
1150.5 494240685 491863441 490951653 489861641 489386673 489041443 489083366 489661369 488764153 489340744
1159.2 489340744 489372826 490250740 491160355 492253342 495142021 497622833 500791588 503932190 508350258
1167.9 508350258 511974373 514889259 518824081 522991371 527558899 531677895 536954460 542259216
1175.6 542259216 547378349 552437019 557305336 562268486 566438560 570355225 573551674 577191162
1183.3 577191162 581728592 586217232 590589790 594314995 597165947 599977951 602697525 604462967
1191 604462967 605551453 606046486 606847839 608188324 609583511 611161346 612606583 614199333 614823875
1199.7 614823875 614319801 613913078 613818817 614006310 614161491 615004921 616127472 617519264 619457016
1208.4 619457016 620447426 621257629 622577858 623784370 624607735 624920654 625914459 627962685 630173759
1217.1 630173759 631765633 632581329 633823586 634919090 635190430 635189400 634759674 634563637 634507828 634176407
1226.7 634176407 633875046 634006081 634328308 633804550 632953682 632476158 631699600 630628242 629838219
1235.4 629838219 629274216 628732376 628260460 628172722 628161316 628122978 628248100 627833748 627075996 626947327
1245 626947327 627094841 627074356 627488251 628291245 629317665 630671310 631301537 631222534 631580315 632213974
1254.7 632213974 632775116 632878189 632999992 633523865 633769379 634228172 635208702 635902710 635899925 635843315
1264.3 635843315 636126633 636455421 636849442 637511978 638784599 640422592 641856003 642693100 643231659
1273 643231659 643614807 643469162 643563385 643949280 644114609 644084473 644193878 644229813 644364548 644660339
1282.7 644660339 644471130 644218674 643995819 643805923 643224258 642713699 642896423 643237457 643531570 643523636
1292.3 643523636 643675308 642960739 641807632 641158752 639941635 638815422 638409615 638376122 637871094
1301 637871094 637472420 636975365 636112328 635760231 635524826 634309349 630625381 628517189 629036140
1309.7 629036140 628483963 628013039 627700272 627159882 626743279 626267738 625698700 625007095 624520721 623312950
1319.3 623312950 622384529 622110977 621814270 621651688 620923767 619963837 618706322 616932831 615095749
1328 615095749 613128777 611489754 610172920 608964691 607874985 606742821 605999947 605139275 603853226
1336.7 603853226 602505951 601501999 600802155 600108376 600411301 601193848 601854439 602263184 602550392
1345.3 602550392 602556686 602710381 602558060 601819344 601683769 601589737 601717606 602241440 602399330 602123451
1355 602123451 601978302 602062836 601773796 601286240 600401840 599302063 598504410 598331642 598349228 598220406
1364.6 598220406 598646049 598637581 598850365 598594513 597813988 598103294 597815781 597700920 597526245 597431488
1374.3 597431488 598195000 599342766 600643730 601127014 601607666 601544724 601621590 602015305 602067680 602398109
1383.9 602398109 602802315 604041214 605480347 607095032 608851814 610398483 611422310 612095222 612698631
1392.6 612698631 612742729 611890717 611687622 612984886 613333206 613260841 612148209 611175461 611132164 610315323
1402.2 610315323 609973564 609301529 607762680 607442017 607601471 607500725 606825256 606207466 605237770
1410.9 605237770 604426231 603614845 602788506 602350769 602012024 601832504 601403580 601755753 599872093
1419.6 599872093 599648323 601009369 601394081 601387138 599649391 599917526 601096764 601676598 602349052
1428.3 602349052 602406387 602925911 603285103 603661041 603599701 603885498 604798508 605105171 604097023 604882774
1437.9 604882774 607325363 608098030 608694191 609350662 609539261 610122185 609745369 610259933 610267296 610133667
1447.6 610133667 609761772 610173531 611214104 610561943 610332451 609398499 609263268 608857155 607090263
1456.2 607090263 604234200 601967545 605288811 606080322 608109550 608865166 609479866 611148376 610198593
1464.9 610198593 611695747 612822380 614986458 616762505 619192047 622111588 623734512 627205887
1472.6 627205887 629497223 634540977 636942635 639057198 642113876 644942322 647901840 649962006
1480.3 649962006 653267822 655325928 657997055 660230789 662444382 664934158 664569778 665703888
1488.1 665703888 667145309 668178787 668816833 672364883 675602112 676866913 678788528 679607391 678842316
1496.7 678842316 679645844 679776535 679600296 681728058 683610458 684145432 685496216 686310120 688804932
1505.4 688804932 689395981 683024979 685011978 685731354 687421417 688601608 689355164 689599075 691776733
1514.1 691776733 693020325 692846603 693562088 690585632 693324814 694792709 691615067 689234467 692268524
1522.8 692268524 696947937 698104858 697288895 697733994 699581528 699103088 698827972 699949951 700048599
1531.5 700048599 701477814 700250320 699372177 701658707 702645340 704257584 706309204 708083496 700536575
1540.1 700536575 703733673 704190445 702418289 704606094 703874130 703980331 706526566 708425751 709255829
1548.8 709255829 708521347 707161484 707985840 709215775 709832382 708132019 708335419 711717453 714325562
1557.5 714325562 712142715 710295868 705835953 709184341 710926590 711931915 712060089 710755539
1565.2 710755539 711237488 712184906 712970581 712799683 709389954 710029526 711110382 710875931 710320969
1573.9 710320969 710646439 709821320 703840637 705950623 707999954 708074265 707472534 706375656 705306931
1582.6 705306931 704075165 703335953 702199097 700921097 700453110 699587860 698706894 697372742 696398621
1591.2 696398621 695314789 693864594 692156448 690360565 689286804 687925034 686920700 685284805
1599 685284805 683926620 682674866 681191788 679708557 677693710 676595459 675126419 673529892 671290359
1607.6 671290359 670380249 668954391 666381454 665508881 663470535 662319107 660463028 659657364 658406525
1616.3 658406525 649761124 651143951 651426239 650796890 649114685 648542709 647040176 642557602 642747955
1625 642747955 642147675 641786499 639239578 637881660 637756081 636755524 636036110 635174980 635961761
1633.7 635961761 636048470 631217003 629551239 631064796 631766586 632718430 633448868 632666054 633474541
1642.4 633474541 633274994 634612427 636289864 634111176 633262634 633029022 636122513 637670555 639440956
1651 639440956 641735764 642341766 634498787 636909218 641138763 642924728 644425201 645636520 647044601
1659.7 647044601 648465958 650089722 651215134 650608063 652890625 654425888 655807571 657735596
1667.4 657735596 659621429 659448166 660159607 663124542 663976669 666676636 669818192 670474777 670172424
1676.1 670172424 673183823 676417236 678155594 679667892 681099167 684968262 689099884 688509140
1683.8 688509140 686536407 690347366 694600220 697127151 698807373 701518555 703374329 705674515
1691.5 705674515 708220520 710296783 713117447 715542526 712561798 715083237 718791046 722751007
1699.3 722751007 724414597 719131851 723233032 727052383 729212341 729441986 729963074 729667816 730757751
1707.9 730757751 732788086 733727493 733792801 734798050 736355438 737478561 737368927 737267838 739579391
1716.6 739579391 739978180 734835892 737336426 739812088 741081924 741828003 741904678 741557617 742481155
1725.3 742481155 743446045 743514938 743901978 744509201 743201065 742807693 745670395 747926254 744527512
1734 744527512 741360779 745101776 747585754 747903137 749064865 748012619 746177216 748647079 749953918
1742.7 749953918 749480515 750083313 752345886 753381348 753668442 754617920 754682159 756384735 755330200
1751.3 755330200 755303421 758477859 759962387 761242752 762900543 762167511 762443466 764266586 765634689
1760 765634689 767318420 766738815 766722870 768404388 768865891 769844589 771210022 771886673 770680084
1768.7 770680084 772341995 774818344 774219666 772849731 771902847 774543991 776065598 775329361 776703720
1777.4 776703720 777762909 778941498 779138718 778278503 778911896 780127487 780643158 779134369 779163361
1786 779163361 780664902 781508179 781912460 782638245 782512589 782232895 780858154 780531006 782948685
1794.7 782948685 783456497 783090515 783850098 784696503 784501877 783438339 784748154 784740143 785174484 786386719
1804.4 786386719 786145477 786244278 786523132 786625061 787030106 787639847 787020111 787439957 788432846 788701859
1814 788701859 789049606 788605576 788635025 788427582 788966370 789657822 789411774 789970551 789626694 790182114
1823.7 790182114 790757141 788980484 789617920 790994873 791969986 791626740 788895645 789574127 791424713
1832.3 791424713 791764374 791890106 792171631 792495346 792539749 791633453 791710815 791842346 792106934 792231216
1842 792231216 793169022 793572235 789861221 791467361 793139572 792973938 792798004 792975006 793040390 792721939
1851.6 792721939 793280106 793384628 793273621 793274841 793687668 794109955 793607407 793756638 793884354 793924408
1861.3 793924408 793402786 793523865 794235458 794247284 794530563 794039612 794060745 793126755 792486572 793936844
1870.9 793936844 794486389 794646301 794400330 794312592 794390182 794688339 794879150 794894257 795322647 795420456
1880.6 795420456 795435486 795066833 795328140 795414734 795024948 795527039 795900879 796701050 796439896 795049362
1890.2 795049362 795666809 796367950 796308823 796291580 795922852 795359344 795889511 796355591 796650162 796813965
1899.8 796813965 796767654 796702576 796426620 796624985 796648865 796666718 796593170 796144104 796089096 796545944 796795654
1910.4 796795654 796797485 797349243 797020340 796440353 796214600 796550140 797381821 795906143 795444565 796612320
1920.1 796612320 797229080 797127228 796213531 796285706 797234268 797662964 797006378 796568375 796462250 796660538
1929.7 796660538 797217865 797318726 797292709 797258759 797470245 797303162 797303696 797399445 797022934 796823807 796927872
1940.3 796927872 797928925 797327042 796002274 796961136 797444763 797248383 796894073 796830826 796908417 797105484
1950 797105484 797320251 797375717 797594452 797845078 797920837 797683411 797745895 797422791 797259903 797359238 797098846
1960.6 797098846 797392654 797649689 798049774 798119736 798227310 798450775 797724915 797456131 797564087 797720184
1970.2 797720184 797637177 797829590 798248596 798372345 798732910 798525543 798005981 797573700 797404785 797254105
1979.9 797254105 797207794 797556000 797729874 798168640 798386459 798565216 798690491 798395157 798065186 797618866
1989.5 797618866 797804871 798029327 797486115 797506256 798009033 797987900 798121262 798360367 798044662 797761536
1999.2 797761536 797428970 797476044 797495041 797324982 797366409 797327499 797621613 797925491 797966614 797558060
2008.8 797558060 797220459 797106934 796953125 797047882 797029648 797190552 797397385 797299805 796603928 796291962
2018.5 796291962 796457443 796066055 795987930 795994644 795833817 795586014 795761566 796152725 795777817 795691452
2028.1 795691452 795722885 795590210 795240402 794787140 794580612 794422150 794561462 794565659 794377518 794070129
2037.7 794070129 793987045 794049225 794300003 794489822 793869095 793857651 793770676 793206558 793396912 793771286
2047.4 793771286 793871002 793876038 793830719 793523483 793307953 793213043 793132782 792877960 792705536 792854843 793106079
2058 793106079 793811111 793946457 793867035 793816071 793269958 793023300 792961578 793214645 793274841 793435059 793796616
2068.6 793796616 793792419 793705978 793488388 793490143 793296967 793212891 793408813 793468475 793386078 793238449 793517456
2079.2 793517456 793651123 793832855 793964310 793774872 793544693 793320694 793436737 793403320 793547287 794016495
2088.9 794016495 794242477 794174652 794150238 794120865 793944855 793768463 793415756 793620987 793972244 794163055
2098.5 794163055 794496765 794537888 794268036 793936386 794276886 794347382 794229202 794466553 794553146 794793930
2108.1 794793930 794798660 794918594 794887619 794541473 794290161 794224243 794262772 793982620 793992996 794237289 794857559
2118.7 794857559 795296097 795204010 795268707 795184708 795028381 794909439 794941864 794588013 794353867 794383469
2128.4 794383469 794580688 795478897 795816040 795776215 795389709 794992981 794687958 794036331 793923569 793957901
2138 793957901 794621201 795307922 795117798 794730225 794780731 795292206 795308990 795081253 794833145 794730759
2147.7 794730759 794337387 794197464 794808884 795064087 795385666 795505753 795721054 795744019 794981766 794562683
2157.3 794562683 794752808 794981766 794707260 795204544 796190414 796337509 795967026 795810928 796142349 795967865
2167 795967865 795667648 795537567 795597382 795981903 796361465 796887512 797440872 797711029 797293091 797006226
2176.6 797006226 796919708 796778030 796791763 796711731 796892776 797178879 797805481 798448334 798822937 798678970
2186.3 798678970 797999878 797902679 797774506 797444611 797608414 798488159 799208679 799400558 799602585 799531937
2195.9 799531937 799700546 799681549 799213104 798799210 798556824 798722305 799096985 799484482 799971542 800575409
2205.5 800575409 800604553 800465698 800188751 799876938 799859619 799546738 799762039 799957199 800262985 801010513
2215.2 801010513 801338120 801478119 801382446 801317520 800924454 800397720 800046234 800121689 800554504 801008453
2224.8 801008453 801851120 802155838 802312622 802223358 802131195 802238007 801492920 801179962 801236115 801511154
2234.5 801511154 801847916 801980133 802409668 802704926 802639465 802173157 801940918 801436996 801098480 801366272
2244.1 801366272 801411285 801799622 802355423 802810745 803035583 803043442 802685165 802169800 801827087 801686783
2253.8 801686783 801862869 801751404 802346802 803231812 803499527 803541031 803285294 802851028 802286148 802333603
2263.4 802333603 802233353 802117538 802262421 802507172 803327637 803734741 803979111 803749237 803428192 803243484
2273 803243484 802910843 802816925 802549362 802965469 803103561 803129730 803718796 803977737 803842239 803304214
2282.7 803304214 803193665 803004837 802932968 803125458 803402176 803706741 803575287 803726959 803739471 803870163
2292.3 803870163 803757858 803710175 803796082 803039932 802790222 802905579 803466949 803851242 803908005 803831787
2302 803831787 803274231 803231735 803132706 803035202 802200089 801971664 802972260 803479309 804136429 804193726
2311.6 804193726 804135666 803514023 803523941 804274826 803286896 802826691 802456818 802469559 803154144 802638016
2321.3 802638016 801855087 802155380 803293610 803138199 802617340 801734085 801063995 801688538 802015381
2329.9 802015381 802611694 803066101 802800903 802013931 801635208 801757812 801021576 800425644 800409241 800331421
2339.6 800331421 801318512 802664032 802638702 802926941 802747650 801907730 801666489 801358032 801445389 801787796
2349.2 801787796 802122345 801913986 801149521 800504303 800754166 801343613 800825653 800855179 801086960 801083145
2358.9 801083145 800235138 799651947 799039841 797916489 799784851 800617065 800052643 800523834 801352310
2367.6 801352310 800686569 797900696 797252426 798522797 799748764 799881973 799605179 799888840 799639511
2376.2 799639511 799454803 799537354 799567413 799266968 798846130 798764267 798991318 799199905 799149246 799277954
2385.9 799277954 799323196 799378052 799234848 798618164 798253021 798232269 798393707 798477936 798790817 798992767
2395.5 798992767 798723831 798527145 798244324 798003006 797595901 796935349 796954041 797335052 796934891 796680145
2405.2 796680145 797196121 797554169 797576828 797333221 797097168 796685486 796430359 796382599 796036301 796088028
2414.8 796088028 796339874 796422958 796040115 795551987 795456238 795109787 794725266 794505463 794291077 794194717
2424.5 794194717 794395142 794427795 794329987 794283066 793984604 793875732 793603439 793219833 792930450 792730942
2434.1 792730942 792469177 791932449 791936035 792184067 792589951 792772446 792291336 791737213 791315155 791350250
2443.7 791350250 791181259 790586624 790109940 790002747 790104141 789957733 789489059 789177704 789689484 789824219
2453.4 789824219 789231415 788878098 788706207 788388596 788180466 788468552 788257675 787982254 788268967 788399963
2463 788399963 788267670 787796478 787302399 786786346 786386871 786214600 786101303 786046829 786116714 786109238 785865860
2473.6 785865860 786172943 786260834 785730591 785359879 784958572 784448318 784368134 784975128 784895859 784366760
2483.3 784366760 784388504 784416275 784113541 783843231 783876801 783260727 782723541 782698059 782510376 782391891
2492.9 782391891 782180252 782581711 783101654 782984848 782844467 782639313 782246323 782034836 782075729 781780243
2502.6 781780243 781460495 781338043 781387939 781844025 782259903 782052689 781395645 781142426 780792236 780101395
2512.2 780101395 780058365 780506058 780517120 780390320 780591888 780551224 780462799 780286942 780018768 779543076
2521.9 779543076 778755035 778513184 778506165 778670959 778993378 779196472 779282074 779139557 778870850 778316269
2531.5 778316269 777898026 777244873 776624985 776909256 777072678 776849213 776795044 777024612 777067184 776743851
2541.1 776743851 776524429 776092148 775375824 774960175 774678879 774619446 774918365 774878235 774735413 774679108
2550.8 774679108 774631882 774402008 773729553 773147659 772555847 772373505 772481689 772325058 772570801 772957153
2560.4 772957153 772821350 772330017 771982040 771592941 771110535 770564957 770342484 770693817 770572128 770338593
2570.1 770338593 770292740 770280685 770332718 770240479 770154648 769508133 768890915 768741608 768639908 768613815 768323593
2580.7 768323593 768233795 768579712 768630905 768172073 767676544 767231827 766582642 766120300 766204376 766247025
2590.3 766247025 766375656 766881256 767022247 767190628 767142868 766583176 765938110 765165253 764957657 764924088
2600 764924088 764888535 765022964 765077667 765089798 765010834 764905777 764343948 764021759 764067001 764039993 763767090
2610.6 763767090 762974625 762550430 762297134 762278519 762424545 762159958 761734467 761166534 760864182 760787354
2620.2 760787354 760658264 760268326 759867477 759652710 759670868 759786072 759332733 758951111 758539200 757784882
2629.9 757784882 757054062 756607056 756947174 757416763 757179108 756591034 756165771 755604172 755233612 754545593
2639.5 754545593 753654633 753598404 753262100 753208008 753649139 753511963 752710953 751989517 751802292 751203918
2649.1 751203918 750817795 750466461 750247803 750498276 750075455 749474487 749134598 749189987 748870468 747958069
2658.8 747958069 747180710 746964493 747023010 746557007 746632996 746623535 746204147 746080780 746057816 746125107 745217056
2669.4 745217056 744356995 744080582 743684464 743606110 743655396 743735504 743696213 743440628 742955322 742433929
2679 742433929 741809998 741299133 741156387 740982437 740766602 740348587 740077820 739916840 739799347 739573364
2688.7 739573364 739093246 739101028 738880539 738413391 738337402 737787170 737067642 737428894 737698441 737267761
2698.3 737267761 737024765 736478043 736016312 735315704 734630661 734513168 734178848 734068222 733588104 733382950
2708 733382950 733458252 732899094 732511139 731879807 731636200 731538925 730911713 730444641 730099869 730254669
2717.6 730254669 730461655 730129700 729717255 729497757 729236450 728901520 728712769 728476944 728170547 727870865
2727.3 727870865 727455368 727213593 727473907 727501297 726825790 726017761 725660095 725433426 725140991 725180969
2736.9 725180969 724877930 724462662 724479599 724748535 724954300 724484253 724137115 724104691 723797073 723200607
2746.5 723200607 722634583 722460861 722494278 722451324 722032394 721395569 720708389 720729370 721006012 720703964
2756.2 720703964 720689316 720554962 720453491 720485687 720354156 720246735 719793320 719438171 719164200 718920593
2765.8 718920593 718798981 718602295 718242874 717999725 717896042 717761307 718098145 717996826 717535553 717106171
2775.5 717106171 716452332 716138458 715909882 715824890 715385590 715042038 715139084 714665298 714111938 713760986
2785.1 713760986 713419189 713022385 712995300 712902908 712497330 712134018 711507034 711171265 710570755 709952316
2794.8 709952316 709840622 709734650 709546738 708813095 708382568 707922363 707130585 706737976 706079407 705511398
2804.4 705511398 705182419 704540405 703840561 703516159 703250732 702504044 701565323 700784760 700299072 699758835
2814 699758835 698864517 698251572 698013611 697306061 696531067 696264038 695778656 695004807 694210892 693396606
2823.7 693396606 692643051 691632004 690426025 689504700 688781967 688363953 688065491 687489853 686701889
2832.4 686701889 685524139 684678802 683812485 682673187 682130508 681285782 680260773 678943405 677475510
2841.1 677475510 676567307 675284195 674032593 672673187 670958939 669380646 668064041 667224655 666068039
2849.7 666068039 664537125 662924881 661645355 660879822 660035095 659102402 657998428 657143555 656770248
2858.4 656770248 656507874 655947342 655144730 654576035 653605270 652347870 651611252 650765915 649347305
2867.1 649347305 647625732 645851517 644393845 643192825 642061615 640885925 639595337 638013153
2874.8 638013153 636097450 634738693 633470268 631704445 630204163 629177208 628112984 626485596
2882.5 626485596 625630913 625457802 624938126 624648018 623911629 622949066 622113991 621389236 621050262 620821419
2892.2 620821419 620760956 620403862 620207405 620255699 619901161 619321632 619053459 619026833 618232498 617582626
2901.8 617582626 617576370 617396431 616694031 615764389 615414276 615073357 614613800 613985672 613068924 612307167
2911.4 612307167 611232872 609602051 608370399 607926331 606603584 604568672 603057899 602036324
2919.2 602036324 601194992 599804306 598396759 597128525 596192131 595603676 594815178 594308739 594045296
2927.8 594045296 594277458 594545250 594623413 594816360 594786682 595035515 595863266 597338104 599013290 600333138
2937.5 600333138 601242332 602192345 603875313 606035957 607964020 609607391 611385880 612747650 613901138
2946.2 613901138 615601540 617559280 619501648 621229210 622905235 624265900 625584526 627273483
2953.9 627273483 628905792 630693893 632204704 633310852 634955940 637023392 638813744 640464172
2961.6 640464172 641985016 643043137 644171371 645488052 646674271 648059845 649385147 650410309
2969.3 650410309 651898727 653796844 655261765 656333008 657466278 658373108 659188919 660791016 662476883
2978 662476883 663239059 663721466 664805069 666218262 667278442 668062744 668676758 669298096 670064316
2986.7 670064316 670898056 671566238 672048721 672530518 672827988 673723297 674754257 674607162 674546280 675079346
2996.3 675079346 675314255 675382843 675327225 675215302 675176010 675209885 675967178 676409378 675934372 676020737
3006 676020737 676056747 675505753 675175095 675159073 674839172 674199905 673510132 672730179 672687607 672632523 672031403
3016.6 672031403 671823654 671659851 671064301 670200958 669770508 669357910 668434830 667597198 667074432 666560211
3026.2 666560211 665928802 665613708 665202637 664461365 663758011 663317337 662509232 661356659 660930557
3034.9 660930557 660329285 659487152 658765106 658286819 658073578 657140808 656225815 655467529 654619827 653554840
3044.5 653554840 652385788 651728592 650971527 650374527 649903030 648979034 647401733 645888443 645291824
3053.2 645291824 644935760 644370956 643588257 643080978 642123871 640821915 640038223 639002151 638322601
3061.9 638322601 637773209 636563110 635405617 635086975 634961472 633950844 632847443 631985321 631313782
3070.6 631313782 630717354 630046234 629212189 627741356 626607742 626212883 625474434 624456596 624039803
3079.2 624039803 623210564 621641006 620729942 620208702 619709358 618987541 617689934 616221924 615473442
3087.9 615473442 615354156 614714584 613705254 612719803 612031059 611355705 610395432 609528008 608621025
3096.6 608621025 607864990 607021561 606039963 605047531 604215584 603831558 603113136 602112846 601308708
3105.3 601308708 600612564 599709435 598448105 597263069 596304398 595527534 594971466 594261894 593259850
3114 593259850 592754593 592239456 591022453 590009575 589171333 588192558 587472267 586866112 585867920 584989433
3123.6 584989433 584408379 583593216 582664185 581524010 580345764 579507523 578698463 577621803 576847687
3132.3 576847687 576233139 575355606 574889908 574380264 573807564 573431587 572595711 571160736 569705544
3141 569705544 568832626 567899208 567094955 566458092 565497742 564726181 563946266 563230247 562694969 562124023
3150.6 562124023 561445923 560708923 559580879 558161888 557528915 556948166 556022377 555479660 555159645
3159.3 555159645 554670792 553683434 552514572 551552849 550810394 550064087 549179840 548309937 547949409
3168 547949409 547988739 547580032 546612434 545450821 544551697 543770599 543205528 542508354 541602058 541203575
3177.6 541203575 540174103 539058762 538629074 538108978 537535515 536826706 536101913 535114670 534456215
3186.3 534456215 534193954 533411636 532520638 531479759 530437088 530248604 530190239 529022865 528020058
3195 528020058 527865181 527542572 526826973 525831375 525272942 524661636 523793373 523432312 523117180 522370453
3204.6 522370453 521299667 520442619 519763069 519221191 518712540 518299828 518246727 517845573 516988640 516226082
3214.3 516226082 515972366 515664330 515231667 514783783 513692970 512563210 511663780 511170197 511214218
3222.9 511214218 510710564 509633179 509311028 509497871 509099922 508503075 507696114 506983871 506544838
3231.6 506544838 505820923 505196686 505058861 505032120 504309006 503229523 502229462 501839142 502109528
3240.3 502109528 501971092 501531525 500816116 500099335 499219055 498448639 498496017 498337364 497955971 497750130
3249.9 497750130 497254944 496165657 495462723 495171051 494314156 493752174 493453026 492777214 492073860
3258.6 492073860 492141609 492474327 492258148 491755791 491008186 490611954 490175819 489827614 489770660 489137535
3268.3 489137535 488429565 488026505 487917404 487730331 487714043 487342377 486327591 486022263 485603600 484987602
3277.9 484987602 484582024 484444504 484626122 484207191 483771133 483352699 482889557 482664185 482073975 481548500
3287.5 481548500 481377220 481216087 480888176 480700569 480643272 480191994 479584656 479045868 478775787 478322487
3297.2 478322487 477385788 477039986 476797333 476259384 476278229 476435204 476437073 476121941 475329247 475174637
3306.8 475174637 475359650 473994446 472573509 472442780 472087517 471916847 471821785 471592979 471371803
3315.5 471371803 470559425 470038757 469683876 469143486 468171539 467706642 468085861 467282944 466530457 466389618
3325.2 466389618 466235657 466291580 465871010 465057487 464005432 463266487 462900429 462768898 462489967 461858330
3334.8 461858330 461400604 460624924 459829445 459350853 458972092 458383942 458034859 457978401 457335434 456726189
3344.4 456726189 455977707 455486641 455347900 454603615 453967438 453547020 452938271 452471771 452309608 451489487
3354.1 451489487 450600929 450253410 449604988 449401741 449390793 448978882 448194237 447352905 446608238 445669899
3363.7 445669899 445304108 445171394 444681969 444024696 443560257 443391571 442800140 441817894 441053047 440475540
3373.4 440475540 439792328 439304657 439139137 439423790 439357567 438569336 437896996 437113762 436486320 435828934
3383 435828934 435732155 435818291 434991035 435008965 435141945 434656487 433993988 433597298 433871880 433385925
3392.7 433385925 432645798 432511597 432690048 432469978 431748238 431555634 431164513 430581284 430480919 430680771
3402.3 430680771 430505333 429785461 429692917 429638138 428731956 428507881 429372711 429513893 428832932 428737679
3412 428737679 428725281 428309517 428203278 427947540 427673836 427448235 427393379 428054085 427685051 427169762
3421.6 427169762 427537537 427327080 427412682 428165512 428722000 428139229 427191429 426969795 427139511 427532234
3431.2 427532234 427533684 427432365 427478523 427617836 427704964 427721291 427932625 428330231 429007187 429055634 428831406
3441.8 428831406 429236794 429944954 429738655 429430161 430425148 430419388 430138741 430350456 430834808 432045250
3451.5 432045250 432467155 432527428 432723503 433413162 433808937 433670044 434458466 435175323 435378876 435410995
3461.1 435410995 435533791 435727119 436458626 437151260 437288322 437839432 438018570 438761330 439726486 439899559
3470.8 439899559 440153885 440230713 440913315 441767960 442115746 442804146 443460503 443862419 444745598 445168762
3480.4 445168762 444776573 444985657 445594177 446878395 447870522 448068085 448652382 449092178 449188271 449659157
3490.1 449659157 450773430 451357346 451902237 452835197 453524094 453862610 453476410 453934975 454783173
3498.7 454783173 455716858 456813507 457602997 458374519 458349037 458988152 459888229 460676956 461853638
3507.4 461853638 462712021 462642059 462412529 463704987 464383354 464496346 465036125 465898056 467128983
3516.1 467128983 467562218 468049355 468604889 469116211 470086288 471509705 472344704 472114296 473092384
3524.8 473092384 474542656 475600357 475777092 475699844 476214294 477287979 477823486 477997398 479603271
3533.5 479603271 480659142 481930199 482540321 481958809 483253860 484155579 485044479 485951843 486995506
3542.1 486995506 488261299 489297256 490039711 489763641 490676155 491127052 492697563 494142303 495259361
3550.8 495259361 497175751 496337891 496989479 497890053 499428787 501555862 502016029 503661613 504624138
3559.5 504624138 505345459 505830688 507610168 509493484 510473824 513729591 512806511 512749863 513001595
3568.2 513001595 512608490 516218872 517315788 518379326 520462189 522326813 523246155 524498863 526584358
3576.9 526584358 527173309 529470787 530764427 531366997 533304672 535228806 536917572 537734451 541860809
3585.5 541860809 543415260 540492020 542226257 542525558 545380440 549163780 552554703 552725449 552245293
3594.2 552245293 555494499 555113220 557940903 561372566 561890259 564922829 564786186 564812851 567547035
3602.9 567547035 569446411 571473999 574697685 577060013 576506348 580489006 579411125 578669968 586274529
3611.6 586274529 586456833 584163322 588213081 587563553 591362381 595788345 595823517 596222000 594639130
3620.3 594639130 595889854 599366150 601936760 604160080 606831055 608319664 610467072 616583900
3628 616583900 613059158 602911110 608744354 614661903 619833908 620331573 618812943 621170349 624547920
3636.6 624547920 626944923 627289276 627903976 629332237 632279587 633713799 633138008 634285469 637707253
3645.3 637707253 643771439 641718521 638136444 643819275 643160782 638195305 638356361 644859924 648992386
3654 648992386 652936096 656794815 648482971 650418243 654901199 656414261 657665024 657817230 659885559
3662.7 659885559 660598221 661293945 662480164 663762054 668171768 669357910 667694855 667052689 660040054
3671.4 660040054 663958511 673267899 681300583 677922440 660205688 664318008 672563171 676847229
3679.1 676847229 674288559 674422684 677313766 679499817 681149063 681498184 682243423 686413651 690694656
3687.8 690694656 680265503 679120712 685986633 679461746 681238937 687216187 688675385 690134048
3695.5 690134048 689954529 690180969 691727371 692356339 694786301 696732712 691112366 690109787 695273514
3704.1 695273514 696563110 696418381 696695328 699378357 702741699 694800873 698553391 702625732 690994568
3712.8 690994568 696144104 700515442 700106735 700496597 703240738 704390717 700968857 702521057 707827759
3721.5 707827759 703523178 700158844 705787506 705694351 704313278 702982101 704188995 707506180 708437424
3730.2 708437424 714156876 710745621 703691406 711802979 710868378 702275009 703666763 706221924
3737.9 706221924 706275482 709392624 712787170 708892365 712603073 723465805 708769226 696240158
3745.6 696240158 707945709 713812561 719681931 715498047 706759644 717742996 708784943 702765198
3753.3 702765198 710207443 715808487 718230820 711999207 714824753 720206299 713481598 712809830
3761 712809830 717175446 718450775 718583755 721578293 717825546 713784485 718230896 723608017 723337784
3769.7 723337784 714815598 717120209 719954224 720042496 720418701 720216293 721671982 722411880 725163269
3778.4 725163269 724160919 717014160 720144272 722032318 722467880 724666214 723237610 722235031
3786.1 722235031 722855911 723670959 724124451 724234543 724779434 724600449 724879456 724693146 726212387
3794.8 726212387 729475708 725614929 722911911 725560837 728683472 732754593 724391632 716009521
3802.5 716009521 721218567 724689331 729759827 734416122 723181152 720469742 725971603 727658920
3810.2 727658920 728220596 728977356 729416046 731178360 735696793 730697556 718687286 726660614 732360458
3818.9 732360458 735548248 735483170 717822113 721630554 727777863 730353394 732753448 731949081 728263168
3827.6 728263168 728921738 731012726 734105682 734820557 727140884 731012726 737366409 730749969 731592026
3836.3 731592026 738324585 728337860 726276398 733078995 727916031 729375458 735502396 732097244
3844 732097244 729094696 732083817 733158188 733630295 736038437 734907990 736705475 741990433 735063934
3852.7 735063934 734218750 719515991 724209518 734483795 733221893 733197479 735569458 736741104
3860.4 736741104 737859573 732876968 734823074 740464020 732090073 728754120 734585190 739506302
3868.1 739506302 742513046 732511902 727345428 732950211 739488144 741364899 730485687 732886047
3875.8 732886047 737544708 737366409 739371033 743080444 736753616 730975266 737636414 739101868
3883.5 739101868 740381775 743190613 729747620 732264633 737332230 738739853 742589417 740844803
3891.2 740844803 732857285 735941544 739721298 737512131 737832718 738958969 742210846 743079071 733630600
3899.9 733630600 739618454 740298233 735404663 741646652 738300552 736011047 736474533 736881027 739238205
3908.6 739238205 739755325 739792252 739928665 740627365 740537491 740078125 741530228 742584839 738365555
3917.3 738365555 736188278 740683823 740440445 737343216 739833679 741588135 742002182 739482880 737503281
3926 737503281 739781265 741450806 742042084 739889526 739328232 741735458 739607773 739239426 740758438
3934.6 740758438 740193405 740723953 741430130 742300949 743049850 742254868 743516159 744020996 739488297
3943.3 739488297 739599609 741213989 741781311 742769775 740942307 741563034 741340790 739621048 741578445
3952 741578445 741701813 741677856 742335281 742651672 742708969 741706924 742059784 742628021 743846512 743447189
3961.6 743447189 741153107 741582642 742000275 741696243 742160339 743199005 743517532 742248764 741669083
3970.3 741669083 742495270 742541428 742505875 743236694 743264542 743226318 742478104 742109680 742644272 742704773
3980 742704773 743377304 743639221 743124161 742772751 743358688 743523254 742425690 742406464 742906418 743509064
3989.6 743509064 743583374 743136597 743062592 743040619 743178406 742748108 742889709 743288727 743676300 744831619
3999.2 744831619 744797668
4000.2 744797668
##END=$$ End of the data block
