##TITLE=$$ Begin of the data block
##JCAMP-DX=5.00 $$ ACD/SpecManager v 10.08
##SPECTROMETER/DATA SYSTEM=Varian
##DATE=20 Nov 2012 13:54:44
##DATA TYPE=INFRARED SPECTRUM
##DATA CLASS=XYDATA
##ORIGIN=
##OWNER=
##NPOINTS=3735
##FIRSTX=399.26403809
##LASTX=4000.35498047
##MAXX=4000.35498047
##MINX=399.26403809
##MAXY=80.49861145
##MINY=40.05388260
##XFACTOR=1.0000000000
##YFACTOR=0.000000100000000
##FIRSTY=62.22574615
##DELTAX=0.96440572
##XUNITS=1/CM
##YUNITS=TRANSMITTANCE
##XYDATA=(X++(Y..Y))
399.3F22257462j6767502J5697059R849053j3381806q792343L034249J962242j831169
407F12027245M543876k891083j2549591m368820R704972J1206207m411469k813759
414.7F10447578J97754l440818R9678O815643J4318962p072601n649758n715332k003097
423.4F07998009N883789j601448j825905J262436J44539k131920m067154j985474J703720
432.1F05380592K638359J744461n5046p432785k917099O230584J792640k24952j300927
440.7F05855827k884292J365394N268212K871399J524162J495399j930389J079979
448.4F14645691K467270Q30803k541580m516983J727561M584771M851951J15662n409966
457.1F16755180k861824j65748j118927k346802K69432m317474n688172M851761L053475
$$ y = [622257462, 605489960, 621187019, 631036072, 617654266, 608861923, 611896172, 613858414, 612027245, 616571121, 613680038, 601130447, 596761627, 606466599, 617672806, 613261337, 610447578, 610645332, 607204514, 607304192, 614119835, 628438797, 621366196, 615716438, 610001106, 607998009, 613881798, 612280350, 610454445, 611716881, 611861420, 609729500, 605662346, 603676872, 605380592, 608018951, 609763412, 609708366, 602275581, 599358482, 605589066, 607381706, 607156754, 605855827, 602971535, 604336929, 609605141, 612476540, 614000702, 615496101, 613565712, 614645691, 617112961, 617943764, 615402184, 610885201, 612612762, 617197533, 622049484, 622165146, 616755180, 613893356, 613727608, 612608681, 610261879, 610531311, 606213837, 600525665, 605377426, 608430901]
465.8F08430901l362008o7901m40140p41692J119347l296242l501396L658791r60655
474.5F00839005l42217K176094k749596l481445j214447K520752K808724j537323r30329
483.2E98089218j703796l9788L237801K586708N60036k555771l442307m815750k390823
491.8E89525528M724388R94454k610283K47573J247330k46658o83556K17018N60761
500.5E93976555n54962j905594j317940r5634j829605m841042j882439J407814N98069
509.2E83555222R75952J184120R44977l309250n438271j167831J684570n78461l228607
517.9E74622421k605209k979546o23054k55470j296692j016465j025543p85141j613846
526.6E62421455J283760K306366M95148m96178q89282j574554r37233J059952J265602
$$ y = [608430901, 605068893, 605000992, 604560852, 603819160, 604938507, 601642265, 598140869, 601799660, 600839005, 600496788, 602672882, 599923286, 596441841, 595227394, 597748146, 600556870, 599019547, 598089218, 596385422, 596345634, 599583435, 602170143, 602730179, 600174408, 596732101, 591916351, 589525528, 594249916, 595244370, 592634087, 592881660, 594128990, 593882332, 593198776, 593415794, 593976555, 593421593, 591515999, 590198059, 590102425, 588272820, 583431778, 581549339, 582957153, 583555222, 584531174, 585715294, 586660271, 583351021, 577912750, 576744919, 578429489, 577851028, 574622421, 572017212, 569037666, 568414612, 568159142, 566862450, 565845985, 564820442, 564035301, 562421455, 563705215, 566011581, 566506729, 566010551, 565121269, 563546715, 562609482, 563669434, 564935036]
535.2E64935036L471794J665497l65944L117904N484467L397102k668571j509476J137123
543.9E78664932N2033R53941J714935K604752J72386j271324l97606k91595r54132
552.6E81248322j699753J595344L45650k815094r22775k68479j658744k651558l63350
561.3E72809563P02629j585121k938919l107949k717933j050682m84620j010475k38685
570E60377808j163292j677475l763314k488060K22855j175613J883773P92656K53792
578.6E53263130K756996K898484K562332J218605K191963L216553K503395J059646
586.4E71671104J331215R93386M89463J888314J290321J988945K783432O57539j230850
595E81862869q36868l07655M0931L34931J13754M69055m85420J48048l83949q00934
$$ y = [564935036, 568406830, 570072327, 569706383, 572824287, 578308754, 581705856, 579037285, 577527809, 578664932, 578716965, 579670906, 581385841, 583990593, 584162979, 582891655, 582494049, 582202454, 581248322, 579548569, 581143913, 581489563, 578674469, 577751694, 577483215, 575824471, 573172913, 572809563, 573512192, 571927071, 568988152, 565880203, 563162270, 562111588, 561626968, 560616493, 560377808, 559214516, 557537041, 553773727, 551285667, 551508522, 550332909, 552216682, 553009338, 553263130, 556020126, 558918610, 561480942, 562699547, 564891510, 568108063, 570611458, 571671104, 573002319, 573995705, 574485168, 576373482, 577663803, 579652748, 582436180, 583093719, 581862869, 581026001, 580718346, 580759277, 581094208, 581207962, 581677017, 581191597, 581339645, 580955696, 580154762]
604.7E80154762Q34732j056518j117668j23024J219902Q36334l87650J679802J167374
613.4E83208046J660385Q21114j36566Q23707J68038J711196J241227J109390J911087
622E92517624K068939K693405J240502Q32824L21579p27310M65927M55704j16577J750526
631.7F01503143K878838K575989J307792q79821l53775N98678L24135L36304N46646
640.4F08837929L23829j220J448860J537323J253738J330490k82363m42200K16865
649F14223251q4228l94287N64575J085091J104087K790146K353974p0801j371231j367455
658.7F18833122r83200l99856M86869K55776J204033J106491L81279K190246R54590
667.4F24029350m169006K923698J262436R3918p57484n53818J720543J929626J593628
$$ y = [580154762, 580989494, 579932976, 578815308, 578692284, 579912186, 580748520, 580360870, 582040672, 583208046, 584868431, 585689545, 585552979, 586376686, 586544724, 588255920, 589497147, 590606537, 592517624, 594586563, 597279968, 598520470, 599353294, 599674873, 598947563, 599413490, 599869194, 599752617, 601503143, 604381981, 606957970, 608265762, 607385941, 607032166, 607630844, 607954979, 608291283, 608837929, 609161758, 609160538, 610609398, 612146721, 613400459, 614730949, 614448586, 614006386, 614223251, 614139023, 613744736, 614309311, 615394402, 616498489, 619288635, 621642609, 621571808, 620200577, 618833122, 617849922, 617450066, 617936935, 618192711, 619396744, 620503235, 620884514, 623074760, 624029350, 619860344, 622784042, 624046478, 624140396, 623382912, 622829094, 624549637, 626479263, 628072891]
676.1F28072891J108017k89650J15967J31035q63304N69000J310959m20571R6550J950570
685.7F31781464J773872P97386L79715L75290l02010j180648m88205K02789k54898
694.4F33084755l25966O3706O13822j14250j771545j879425j306038j550903j614113
703.1F25200043l95394K05460k19231k79770J2436k3346K21520P12395k38572k4299
712.7F25171242J371193J257362J456261J963463K728691K436523O95725M78744J415405
721.4F38974609K389222J936264J691513K314224K166366K053299J914673K238465
729.1F55678635J817932J454468P16552J38245J154785J287460J409836R87854R49707
737.8F65595474O98471o21643j76544M70123q3084n90896L03726R73587Q5754p41958
$$ y = [628072891, 629180908, 628891258, 629007225, 629138260, 628274956, 628843956, 630154915, 629734344, 629830894, 631781464, 633555336, 634352722, 634732437, 635107727, 634805717, 633625069, 633136864, 633339653, 633084755, 632758789, 632822495, 633436317, 633322067, 631550522, 629671097, 628365059, 626814156, 625200043, 624804649, 625010109, 624790878, 624511108, 624523544, 624500198, 624721718, 625434113, 625195541, 625171242, 626542435, 627799797, 629256058, 631219521, 633948212, 636384735, 637080460, 637559204, 638974609, 641363831, 643300095, 644991608, 647305832, 649472198, 651525497, 653440170, 655678635, 657496567, 658951035, 659667587, 659805832, 660960617, 662248077, 663657913, 664645767, 665595474, 666293945, 665672302, 665495758, 665965881, 665882797, 665291901, 665595627, 666569214, 666654968, 665913010]
747.4F65913010o20804j310806j082840k59476j973038j609573j625977j413421K07290
756.1F56224365j988144l117294k210922m92172K00653n71747l53165j974029j927491
764.8F43790054O39420J076126L6468O11649J373520O11801K003174K593231J293717
773.5F54029160J354980K441177L368302L237076L374176K669143K282410K231216
781.2F74987640J613160J466369J427612J278534J530838K800599K131271K033157
788.9F89269180K573014J160125L42026K77710M60739n12161P4005J612091K637940
797.6F97894669L583755K143173N72892J17492N58548J22986K25754Q30231O17828
806.2G06667328J340103J283646J167678P62940J59607k42767m99421r88845j950837
$$ y = [665913010, 665292206, 663981400, 662898560, 662639084, 660666046, 659056473, 657430496, 656017075, 656224365, 654236221, 651118927, 648908005, 648415833, 648616486, 648044739, 647691574, 645717545, 643790054, 644429474, 645505600, 645542068, 646153717, 647527237, 648139038, 650142212, 652735443, 654029160, 655384140, 657825317, 661193619, 664430695, 667804871, 670474014, 672756424, 674987640, 676600800, 678067169, 679494781, 680773315, 682304153, 685104752, 687236023, 689269180, 691842194, 693002319, 693344345, 693622055, 694082794, 693570633, 693644638, 695256729, 697894669, 701478424, 703621597, 704194489, 704311981, 704870529, 704993515, 705219269, 706049500, 706667328, 708007431, 709291077, 710458755, 711221695, 711381302, 711138535, 710639114, 709650269, 707699432]
814.9G07699432j649017m80576J376496J519623J061859R64126l7689p44400r90677
823.6G08719177r76257k021408j455765o49948l58429k45361p54547J59454q36487
832.3G01580429j537323j726684k301713k115097k149505j103821n75256n95322j122284
841F88353424j97754J69983j714401k580795l064194j265564q96149j536407o5995
849.6F77202148K07367L3875p62711k053833k790527k263565k802963l041687r07822
858.3F62820282j32141K4948p7286N99747J593552J963653K935104K214585J764984
867F73707428J564484K440796M300003M597778M391708L142700L193741K827454J410446
875.7G01576538J169815M13208l93371M60281O42166J09711N28106l92913j227646
$$ y = [707699432, 706050415, 705569839, 706946335, 708465958, 709527817, 710491943, 710454254, 709709854, 708719177, 707742920, 705721512, 704265747, 703615799, 703257370, 703012009, 702257462, 702416916, 701580429, 700043106, 698316422, 696014709, 693899612, 691750107, 690646286, 690071030, 689475708, 688353424, 688155670, 688325653, 686611252, 684030457, 680966263, 679700699, 678804550, 677268143, 677202148, 677409515, 677443390, 676680679, 674626846, 671836319, 669572754, 666769791, 663728104, 662820282, 662688141, 662713089, 662635803, 663235550, 664829102, 666792755, 669727859, 671942444, 673707428, 675271912, 677712708, 682012711, 686610489, 691002197, 694144897, 697338638, 700166092, 701576538, 702746353, 703159561, 702766190, 703226471, 703868637, 703978348, 704506454, 704113541, 702885895]
884.4G02885895k280121l011398k677994k238236j895599k518387j877899j657562
892.1F84728699j686249j497574j416626r61990j791535k212448l637161l394623q79822
900.8F67250671o60553j192474j987534j941986j873855k089005j771393l329238m178467
909.4F48226166l091965k512054l265114m149208k705841k208100l427276l427925
917.2F23438683m200898l764496j926155j942215k149925j110763k43225p7858l4371
925.8F07988777p2861o9809m28123l69072Q5640M15955P05909J257515J613617J221237
935.5F12348785J486512J137237P20482M54292j00097R38720K024041K472801K064514
944.2F23547287J079903L84216r52873k563706l249740k892685l062210l532219l343430
$$ y = [702885895, 700605774, 697594376, 694916382, 692678146, 690782547, 688264160, 686386261, 684728699, 683042450, 681544876, 680128250, 679166260, 677374725, 675162277, 671525116, 668130493, 667250671, 666590118, 665397644, 663410110, 661468124, 659594269, 657505264, 655733871, 652404633, 648226166, 645134201, 642622147, 639357033, 635207825, 632501984, 630293884, 626866608, 623438683, 619237785, 615473289, 613547134, 611604919, 609454994, 608344231, 608101006, 608023148, 607988777, 607915916, 607846107, 607417984, 607048912, 607134552, 607550507, 608256416, 609513931, 611127548, 612348785, 613835297, 614972534, 615693016, 616147308, 616047211, 616985931, 619009972, 621482773, 623547287, 624627190, 625011406, 624058533, 621494827, 618245087, 615352402, 612290192, 608757973, 605414543]
952.8F05414543l938942m168892m218216m831962n286789o025009o450425n883064
960.6E64611244n540466n666924n479583o038895n428123n565682o525001o922760
968.3E17443810p721673o973152p657432p459336p024841o687050o073227o556129
976D61290970n813980p370529o599007o159935n762558m371071n197906l318596k934838
984.7D13762550k201271k152214j761589j653824k021675p26204j782570l34701j71547
993.3D00956955Q6632m07830r6931K234802L49922M27590O7406N28183L06167L91159
1003D04844055P49436m86870J007271n54505K52762K84233p08923q0414r03587p74575
1012.6D03628883j851158M45938N20630K46811N19333l69949J022033P08313J617508
$$ y = [605414543, 601475601, 597306709, 593088493, 588256531, 582969742, 576944733, 570494308, 564611244, 559070778, 553403854, 547924271, 541885376, 536457253, 530891571, 524366570, 517443810, 509722137, 502748985, 495091553, 487632217, 480607376, 473920326, 467847099, 461290970, 455476990, 448106461, 441507454, 435347519, 429584961, 425213890, 420015984, 416697388, 413762550, 411561279, 409409065, 407647476, 405993652, 403971977, 403245773, 401463203, 401128502, 400956955, 401043587, 400635757, 400538826, 402773628, 403123550, 403551140, 403618546, 404146729, 404452896, 404844055, 405593491, 405106621, 406113892, 405559387, 405812149, 406096382, 405387459, 405307045, 404403458, 403628883, 401777725, 402223663, 402744293, 402991104, 403510437, 403140488, 404162521, 404870834, 406488342]
1021.3D06488342K23809M71611Q50944R28955K163277P27501J811752J046639J835098
1030D16547928J895561Q78792N04799k07787J863442O37283O10771J55869O84662Q71772
1039.6D24443092m27780N41611j266937J70211K70081k70004k82631l8872J399345
1048.3D24538116K29798J478424O02608J601371J636391P10907K105522J756554L052063
1057D37711754K042732K712746K950210L686409L852196K319679L853798K698517K833519
1065.7D64661560K384567K039948J027489o76690n16204l176461l704910m042587l492775
1074.4D54503937k847786k554283j867867j643028O05812l99818N58395Q85429J377831
1083D48618622J978683J228333J497879l82538K271385K484436K345009L349991K922211
$$ y = [406488342, 406712151, 407183762, 408034706, 408963661, 411126938, 411854439, 413666191, 414712830, 416547928, 418443489, 419322281, 419827080, 419619293, 421482735, 422120018, 422730789, 422886658, 423571320, 424443092, 424015312, 424556923, 423289986, 423460197, 423730278, 423460274, 423177643, 423138771, 424538116, 424767914, 426246338, 426848946, 428450317, 430086708, 430797615, 432903137, 434659691, 437711754, 439754486, 442467232, 445417442, 449103851, 452956047, 455275726, 459129524, 461828041, 464661560, 467046127, 469086075, 470113564, 469436874, 468920670, 465744209, 462039299, 457996712, 454503937, 451656151, 449101868, 447234001, 445590973, 446196785, 445796967, 446355362, 447240791, 448618622, 450597305, 451825638, 453323517, 452940979, 455212364, 457696800, 460041809, 463391800, 466314011]
1091.7D66314011L707695J786346J823883J486969J662254P51496K29072J482773Q45604
1100.4D80090103J448136L51753L54881r77364l98139R30519q65021P05452Q14056
1109.1D82454376J594696J767197K508240K933502J588859J961556Q59833J334533
1116.8D97002792P29943Q67500J428909J063385J474076Q44192J196823P3242J080170
1125.5E05761032J767197Q13446M03595L60145K259751J461944J596871K310295K319603
1134.1E19053879J408043l48893n47103j037331p13348j539727j661377j929435k209092
1142.8E10475616j460685j930313j354294k773743k444267k208862l036767k330665
1150.5D92936020k030258k86789m41780k3003n59769l41987r7084j023827N38292K93503
$$ y = [466314011, 470021706, 471808052, 473631935, 475118904, 476781158, 477532654, 477761726, 479244499, 480090103, 481538239, 481889992, 482244873, 481267509, 480869370, 481799889, 480934868, 481640320, 482454376, 484049072, 485816269, 488324509, 491258011, 492846870, 494808426, 495668259, 497002792, 497732735, 498600235, 500029144, 501092529, 502566605, 503410797, 504607620, 504680862, 505761032, 507528229, 508341675, 508745270, 509105415, 511365166, 512827110, 514423981, 516734276, 519053879, 520461922, 520113029, 519565926, 518528595, 517815247, 516275520, 514614143, 512684708, 510475616, 509014931, 507084618, 505730324, 502956581, 500512314, 498303452, 495266685, 492936020, 490905762, 490618973, 490177193, 490154190, 489594421, 489252434, 489155350, 488131523, 488669815, 488963318]
1160.2D88963318J165428J010513K005234K584419J813660L429222L310127L794060
1167.9E08075981K856445L231240L999214M066391M482002M498596O245690N450020
1175.6E42905579N104026N401230N266686M135132L250007M073563L595466L647500
1183.3E77379189L440551M314041M901352M188729L508949K542267K257118J883545
1191F04415741J727829L15437N11170J770324J399498J501694J044655J346207Q02154
1199.7F14834709l73840k03972o4812l2119J0414Q39615J021461J398773J749191J356316
1209.4F20535736J122856R05838J570320J138649M33693Q37021J689568J939583J164703
1218F31337967J314468J514778R09310K92969m6463k31972j04103k00806n12390l28140
$$ y = [488963318, 490128746, 491139259, 493144493, 495728912, 497542572, 500971794, 504281921, 508075981, 510932426, 514163666, 518162880, 522229271, 526711273, 531209869, 537455559, 542905579, 548009605, 553410835, 558677521, 562812653, 566062660, 570136223, 573731689, 577379189, 580819740, 585133781, 590035133, 594223862, 597732811, 600275078, 602532196, 604415741, 606143570, 606459007, 606970177, 608740501, 610139999, 611641693, 612686348, 614032555, 614834709, 614460869, 614256897, 614192085, 614159966, 614170380, 615009995, 616031456, 617430229, 619179420, 620535736, 621658592, 622564430, 624134750, 625273399, 625707092, 626544113, 628233681, 630173264, 631337967, 632652435, 634167213, 635076523, 635369492, 635323029, 635091057, 634986954, 634786148, 634273758, 633945618]
1227.7F33945618j89820O0540k43493o23626o04592j052589r78928q08487o66160l96881
1237.3F28441582m2877K01034l4828J05743l19977p66296o44417m425N37529J86424
1247F27659492M77906Q35685R40819Q45070N09682K44255M0932J06392M39605Q29277
1256.6F32929115M73328L12118M27018N92079P42340L05633L70636L51029J34697J56059
1266.3F36794052N52406Q61702M90532J069565J611977J354675Q36716P9727R8190
1274.9F43749542J32828l45154k37655M43573R89608M40064j31226k62451k14844J93558
1284.6F44757843j36032n41382o48041l83529L4256N68390M37774p20825n35355n48324
1294.2F42284775o39878l48663r91058j029549o89583l44848k82212k62489n65338
$$ y = [633945618, 633755798, 633816338, 633572845, 632949219, 632344627, 631292038, 630313110, 629504623, 628838463, 628441582, 628398705, 628599739, 628564911, 628670654, 628350677, 627584381, 626939964, 626935539, 627473068, 627659492, 628137398, 628973083, 629913902, 630758972, 631268654, 631512909, 631553841, 631660233, 632099838, 632929115, 633402443, 633714561, 634141579, 634733658, 635475998, 635781631, 636152267, 636503296, 636637993, 636794052, 637346458, 638208160, 638698692, 639768257, 641380234, 642734909, 643571625, 643651352, 643749542, 643882370, 643537216, 643299561, 643743134, 644732742, 645172806, 645041580, 644779129, 644564285, 644757843, 644621811, 644080429, 643432388, 643048859, 643083115, 643651505, 644089279, 643368454, 642833099, 642284775, 641644897, 641296234, 640305176, 639275627, 638586044, 638241196, 637958984, 637696495, 637131157]
1302.9F37131157o82945o77529r02519k22015j826554k461586m87442n83114o35567
1311.6F28651886m14391n32684o16493o93283n31082r26247p96776p79037n44396n8250
1321.2F22759247l59116m10499r11599j268081j230622j603584j678200j836433j611404
1329.9F11849709j303215j554451j382027q87566o90536j128578j422005j198883m80232
1338.6F01802216m98352n20707K64855K80685N69840L93409N78576M13513J6060k25640
1348.2F03074455o18896k51541n37644K89192Q21953J20316j01814j27068M005q14590
1357.9F01858368q89244n92804o73561o03905o01654n9052J67618L46070j85280M90455
1367.5E99257011m4288j369858L3150o9123K43035R5405j6632Q80699Q51784Q76274
$$ y = [637131157, 636448212, 635770683, 634868164, 634646149, 632819595, 630358009, 629870567, 629287453, 628651886, 628237495, 627704811, 627088318, 626395035, 625863953, 624937706, 624140930, 623361893, 622817497, 622759247, 622400131, 621989632, 621078033, 619809952, 618579330, 616975746, 615297546, 613461113, 611849709, 610546494, 608992043, 607610016, 606722450, 606031914, 604903336, 603481331, 602282448, 601802216, 601303864, 600783157, 601048012, 601328697, 601898537, 602291946, 602870522, 603284035, 603300095, 603074455, 602455559, 602204018, 601666374, 601955566, 602777519, 602897835, 602796021, 602668953, 602672958, 601858368, 600969124, 600376320, 599702759, 599098854, 598497200, 598438148, 598605766, 598951836, 598766556, 599257011, 599212723, 597842865, 597876015, 597806892, 598049927, 598145332, 598128700, 599009399, 599861183, 600737457]
1377.2F00737457M01688N64384K938m3526m0398J34354O37550L92914J691857K065048
1386.8F06544266J608429J269722J215210P28416N01022P64046L89710l38974n82161
1395.5F12099686Q83369K12593j74141j144485j221657N04646j19819m49601j082191
1404.2F09508400j911850j92909M70886J08414o79055r07592j171875n93300r80683
1412.8F03650436q78639R7542k67372m26407o90117J92223k237778L62396J759110
1421.5F01561394j52588q6403j257820M98123J101570n8823N74761L85933M94842J58120
1431.2F03219109Q95309J56059r1324J042443M59251m66080J85051K161484Q37746
1439.8F08399048M57840R33189K46163O26869k66190N22194J12724q1138m15344r4719
$$ y = [600737457, 601139145, 601703529, 601706467, 601662941, 601622543, 601756897, 602394447, 602787361, 604479218, 606544266, 608152695, 609422417, 610637627, 611366043, 611867065, 612631111, 613020821, 612681847, 612099686, 612983055, 613195648, 613021507, 611877022, 610655365, 611160011, 611040192, 610590591, 609508400, 607596550, 607403641, 607874527, 607982941, 607303886, 606396294, 605224419, 604631119, 603650436, 602771797, 602869339, 602601967, 602175560, 601485443, 601677666, 599439888, 599802284, 601561394, 601408806, 601322403, 600064583, 600562706, 601664276, 601605453, 602180214, 602566147, 603060989, 603219109, 604114418, 604270477, 604179153, 605221596, 605680847, 605214767, 605399818, 607561302, 608399048, 608856888, 609790077, 610036240, 610663109, 610396919, 610919113, 611031837, 610950699, 610535355, 610440636]
1449.5F10440636R89875o12564n23109p87392l1318k52266p41539j740265l609772
1458.2F03132286K835045R35783J789170L51486O47507J761245j481018J508637J222305
1466.8F12702446K324219J975136K475395K947616J485176L900719K265740M943542
1474.6F35019989K481499K082481L050919K740402L211059K075654K788314J943207
1482.3F55393524K739182K059478K099152K626801j39695J576767J579590J452942
1490F69387741K63596K630081L087005J385422K372513R69162j454620J067123R51691
1498.7F80659714J35345J307678J236344M29230J886673J391296J610794j992264o362915
1507.3F80301895L634491K256470K192917Q59375M43725K62528K053146J459961n6381
$$ y = [610440636, 611430511, 610817947, 610294838, 609507446, 609476128, 609223862, 608482323, 606742058, 603132286, 605967331, 606903114, 608692284, 609043770, 609691277, 611452522, 609971504, 611480141, 612702446, 615026665, 617001801, 619477196, 622424812, 623909988, 627810707, 630076447, 635019989, 637501488, 639583969, 642634888, 645375290, 648586349, 650662003, 653450317, 655393524, 658132706, 660192184, 662291336, 664918137, 664778442, 666355209, 667934799, 669387741, 669651337, 672281418, 675368423, 676753845, 679126358, 680095520, 678640900, 679708023, 680659714, 680795059, 682102737, 683339081, 683768311, 685654984, 687046280, 688657074, 686664810, 680301895, 683936386, 686192856, 688385773, 689245148, 689688873, 689951401, 692004547, 693464508, 693408127]
1516F93408127M26941k512970K997055K294693j758118l779449P12661M546433J900711
1524.7F98236084O0730J24969J145401j13067K04544J291504l6774J259613p46612
1533.4G01426392j987305K268829J671829K082596K633515K047424j0069656J909332
1541.1G01982956Q13446q18558K418518k18277N67704K692108J663360K28196j440735
1549.8G07888718q41675J655426J350860K00348j987457P39517L379135J842881o581498
1558.5G07646255j742782Q63037K405701J787948J704178K49634j627655M48913J315156
1567.1G13050385Q66394l61557l988724R3231J131439J16577r0179N15366n14527o201248
1576.8G04617157J329651K033996j03912n65338o62918q91953j083679r03473j216049
$$ y = [693408127, 693835068, 691322098, 694319153, 696613846, 694855728, 691076279, 691788940, 696335373, 698236084, 698296814, 698421783, 699567184, 699454117, 699658661, 700950165, 700913391, 702173004, 701426392, 699439087, 701707916, 703379745, 705462341, 708095856, 710143280, 700073624, 701982956, 702796402, 701977844, 704396362, 704178085, 704745789, 707437897, 709101257, 709329453, 707888718, 707047043, 708702469, 710053329, 710253677, 708266220, 709005737, 712384872, 714227753, 707646255, 705903473, 706766510, 709172211, 710960159, 712664337, 712913971, 711286316, 711735229, 713050385, 713916779, 713555222, 709566498, 709659729, 710791168, 710907745, 710817566, 711332932, 710818405, 704617157, 705946808, 707980804, 707876892, 707311554, 706648636, 705756683, 704673004, 703769531, 702553482]
1585.5G02553482j088486o79474j168670p48596r62220r46350j345672j492081j521072
1594.1F92600861j822663j184997j451798j071701j404800j092758j462784k051468
1601.9F81057892j364594j612091j129455j367340j581498k240295j054001j537781
1609.6F69170837k337722q78601k179337j532898j856308n24750j000442p960282L60260
1618.2F51260757k28500l85742j399384j96609r48410m649048o11496n62820J63879
1626.9F42442627k547455j798668k98652o05660l94020j044960M03481n90897m867401
1635.6F30698395j228829J894341R51958L63426N76744l46298Q87832l71971J246262
1644.3F34671860J827125j746597j252594q73566L465462J938629J801605J839753
$$ y = [702553482, 701464996, 700785522, 699616852, 698868256, 697906036, 696959686, 695614014, 694121933, 692600861, 690778198, 689593201, 688141403, 687069702, 685664902, 684572144, 683109360, 681057892, 679693298, 678081207, 676951752, 675584412, 674002914, 671762619, 670708618, 669170837, 666833115, 665954514, 663775177, 662242279, 660385971, 659861221, 658860779, 650900497, 651260757, 651032257, 650646515, 649247131, 649050522, 648102112, 643453064, 642841568, 642278748, 642442627, 639895172, 638096504, 637797852, 637192192, 636798172, 635753212, 636156693, 635565796, 630698395, 629469566, 631363907, 632315865, 632679291, 633256035, 632909737, 633797569, 633425598, 634671860, 636498985, 634752388, 633499794, 632626228, 636091690, 638030319, 639831924, 641671677]
1652F41671677l112870m881553M467544M131661J608963J443786J113053J478805J534043
1660.7F49455109J433105R94568l92151K031708J396866J940307K352219J357651q77075
1669.4F59692307O99462K933579J392822K716675K870331O43539J77765L011932K742081
1678F76880493J525574J821670J727295L542633L213654r44443o23779L609161M477387
1686.7F95229645K795257J673355K560273K127533K387848K381744J982574K642212
1694.4G13780441J930237l387298K571868L978043M597855J875915n770950M436951
1702.1G24013062L814620J704484k05155R44748L01895J267166J830826L77884P4310
1710.8G34123840J291581J381378R94720K7695l18298K160873N37796m527588K327652
$$ y = [641671677, 638558807, 633677254, 638144798, 642276459, 643885422, 645329208, 646442261, 647921066, 649455109, 650888214, 651882782, 651490631, 653522339, 654919205, 656859512, 659211731, 660569382, 659692307, 660391769, 663325348, 664718170, 667434845, 670305176, 670948715, 671126480, 674138412, 676880493, 678406067, 680227737, 681955032, 685497665, 688711319, 687766876, 687143097, 690752258, 695229645, 698024902, 699698257, 702258530, 704386063, 706773911, 709155655, 711138229, 713780441, 715710678, 712323380, 714895248, 718873291, 723471146, 725347061, 719576111, 724013062, 727827682, 729532166, 729327011, 730271759, 730573654, 731840820, 733671646, 734049530, 734123840, 735415421, 736796799, 737791519, 737819214, 737500916, 739661789, 740199585, 735671997, 737999649]
1719.5G37999649K105179J231079Q71963K82822j59149Q50525Q81042j07269L74146
1728.2G44329987Q26263j071243n04151K496567J797104m983521k661438M902268K574310
1736.9G47706146N05600J523743q62579k028809K314224J374741m86069L15857K190323
1745.5G52553177J322403N84411N30777n15441K097473r3384l07541K601776J602478
1754.2G60376129J616821J278229p27234Q65021J506348J156234J868515n90591k59094
1762.9G67090378J831207P87582O05469J208954J217880j166992J333313K232895m58374
1771.6G74682312j267624j114807K725830J672516n32837J147690Q75397J094741k7542
1780.3G79255676o73828R43527J342621O81076j243515n14526R74655P86667J47552
$$ y = [737999649, 740104828, 741335907, 742207870, 742490692, 742331543, 743182068, 744063110, 743955841, 744329987, 745156250, 744085007, 743580856, 746077423, 747874527, 742891006, 740229568, 745131836, 747706146, 748211746, 749735489, 748872910, 746844101, 749158325, 750533066, 750046997, 750362854, 752553177, 753875580, 754459991, 754990768, 754475327, 756572800, 756479416, 756171875, 758773651, 760376129, 761992950, 763271179, 762543945, 763408966, 764915314, 766071548, 767940063, 767349472, 767090378, 768921585, 769709167, 770314636, 771523590, 772741470, 771574478, 772907791, 775140686, 774682312, 773414688, 772299881, 775025711, 776698227, 776165390, 777313080, 778188477, 779283218, 779255676, 778581848, 779525375, 780867996, 781549072, 780305557, 779791031, 780765686, 781552353, 781699905]
1788.9G81699905J113663O88629q11615j777801K14996K587204M42505p38525P12661
1797.6G84131622J018601l58734q56858J530686m7989P15713J166077l29971L2806
1806.3G87001953l45077k09122O41556O95495n87692N09110J049118K42691L36837
1815G89334869k58026J89286l13111K83127O45828j0605O57654k66723Q42056Q70209
1824.6G91974564k332688j6174J431045Q21381n06821k218017O95724J714173L17306
1833.3G91880493K66037K68097N2185j57394m60968O04095Q9188K79770k899M48226
1842.9G93266830n0811l039780K544022J548462o05927k98233N722K34070M1046M69055
1852.6G94114456l55987j06354K39258J76239K79236l26004K69165J96991L09677m20380
$$ y = [781699905, 782813568, 783502197, 782690582, 780912781, 781127777, 783714981, 784157486, 783418961, 784131622, 785150223, 784791489, 783934631, 785465317, 785417328, 786133041, 787299118, 786969147, 787001953, 786656876, 786447754, 787089310, 787784805, 787197113, 787706223, 788755341, 788998032, 789334869, 789076843, 789266129, 788953018, 789236145, 789881973, 789871368, 790529022, 790262299, 791104355, 791974564, 789641876, 789625702, 791056747, 791878128, 791371307, 789153290, 789849014, 791563187, 791880493, 792146530, 792414627, 792466812, 792309418, 791848450, 792452545, 792541733, 792821503, 792818604, 793266830, 793216019, 790176239, 792720261, 794268723, 793662796, 793364563, 793370285, 793604355, 793645401, 794114456, 793758469, 793652115, 793891373, 794067612, 794346848, 794020844, 794290009, 794487000, 794796677, 794376297]
1862.2G94376297l83911L47900J53427L88108m55170K72217m86908q70361P82928K42767
1871.9G94367294J85089O6452K84195J77384K12936J77841J85624K74734m0283L16238
1881.5G96207504m27093k05918L9368o3171K82058R8038Q47473k33688r73587P38983
1891.2G96309967N97305P2708K14539l31421q19626M86222L53164J10169K97317J45340
1900.8G97435684m4479n07813n4550J04752P0495q5907K9221K54974K26059p3623o2638
1911.4G97292175P89795n40848p58895M7073M95300R39865j765747o59179J271667
1920.1G97111206O71158J94397r26972n05142P10449L78190o01960p1182K84348L95355
1929.7G97639847M30908K0599k3651n16510J55411K33002j6403j18866l44925Q6059
$$ y = [794376297, 793992386, 794340286, 794493713, 794881821, 794426651, 794698868, 794211960, 793341599, 794124527, 794367294, 794552383, 794618835, 794903030, 795080414, 795293350, 795471191, 795656815, 795931549, 795891266, 796207504, 795780411, 795574493, 795613861, 795550690, 795832748, 795930786, 796778259, 796544571, 795570984, 796309967, 796907272, 796979980, 797194519, 796863098, 796043472, 796529694, 796882858, 796993027, 797290344, 797435684, 797391205, 796883392, 796828842, 796933594, 797004089, 796918182, 796947403, 797202377, 797428436, 797354813, 797292175, 798081970, 797541122, 796782227, 796829300, 797324600, 798264465, 796498718, 795839539, 797111206, 797782364, 797976761, 797049789, 796544647, 797255096, 797633286, 797031326, 796960144, 797244492, 797639847, 798070755, 798091354, 798067703, 797551193, 797706604, 797939606, 797923203, 797804337, 797459412, 797545471]
1939.4G97545471j02691O72302j87378p15790P16324k03476j70288L21197K47803j02997
1949G98020477j88064N2490j8539J40075L36151Q2398l28980K87094j26724l69263
1958.7G97887115O4240k54135J45340M23660M41971l85437j12991N81131m78211m34570
1968.3G97878113j33591K747J63726P51725O37893l17459j53045j08948R3536l0212
1978G98784485k25220j66092l4714M13361J74561J38397P3318k43072k58713N5237
1987.6G98711548J33819K5483J78375l16696p18384N8594N41839K9450j03455k518
1997.2G98538055j30462j84632n29937P4539J80893p2632J64261J66321K63824p3318
2006.9G98396912k23771r4146J04294l13034j97526J92795l36532P2632J9454l42712
$$ y = [797545471, 797442780, 798115082, 797927704, 797211914, 797928238, 797724762, 797554474, 797875671, 798123474, 798020477, 797832413, 797884903, 797866364, 798006439, 798342590, 798424988, 798096008, 798383102, 798256378, 797887115, 797951355, 797697220, 797842560, 798266220, 798708191, 798322754, 798209763, 798790894, 798312683, 797878113, 797744522, 797747269, 797910995, 798662720, 799300613, 798983154, 798830109, 798721161, 798814697, 798784485, 798559265, 798393173, 798358459, 798771820, 798946381, 799084778, 799158096, 798915024, 798656311, 798711548, 798845367, 798870850, 799049225, 798732529, 798014145, 798072739, 798614578, 798644028, 798540573, 798538055, 798407593, 798222961, 797693024, 797767563, 797948456, 797875824, 798040085, 798206406, 798470230, 798396912, 798173141, 798078995, 798183289, 797870255, 797672729, 797865524, 797528992, 797601624, 797621078, 797278366]
2016.5G97278366l19137k4872J39007j46866M7837k95258l60794l58581k1668L55759
2026.2G96293793M3182J74942n5160j48468m84467l40881j44196k81677L2425l17536
2035.8G94771957K5330J33591M959L1891M7302k0828o58112m0207J2207j88675J64948
2046.4G94284363K27203O0425k71835L1280j05667o8283M3259K3422k19574l35846
2056.1G93668747K78091P2785J55792M3793J3809P6370k35061j74637n77622J58310
2065.7G93480377N89600J75705O9961O2867J64108m0283R2773l07846m19464j29318
2075.4G93738480P8353K51618J26648M42200J27410k07061k68174M7989L25089N3558
2085G94716110n8212k40631J89133J31530j9760n8975j84174J15891q6746j145k8305
$$ y = [797278366, 796959229, 796934357, 797073364, 796926498, 796974335, 796679077, 796318283, 795959702, 795938034, 796293793, 796336975, 796511917, 796456757, 796308289, 795823822, 795482941, 795338745, 795057068, 795089493, 794771957, 794797287, 794930878, 794935837, 794967728, 795015030, 794994202, 794336090, 794295883, 794308090, 794119415, 794284363, 794511566, 794571991, 794300156, 794331436, 794225769, 794157486, 794200745, 794224167, 794004593, 793668747, 793946838, 794019623, 794175415, 794219208, 794233017, 794309387, 794074326, 793899689, 793322067, 793480377, 794069977, 794245682, 794315643, 794378510, 794542618, 794502335, 794595108, 794287262, 793867798, 793738480, 793816833, 794068451, 794195099, 794637299, 794764709, 794557648, 794289474, 794337463, 794662552, 794716110, 794657898, 794417267, 794606400, 794737930, 794718170, 794659195, 794475021, 794590912, 794504166, 794503021, 794474716]
2095.6G94474716M5624J98441K45132L26614J47934q0185m24270J73950P7286j34888
2105.2G95050354K92435J18255K16446J09253P6904j90277l18603k32926k6168K34451
2114.9G95330124j43280M1046J00861K32696K83280L01971J30234m35105k11715k37580
2124.5G95392532j40381n73806k11029P42798M37088L96118k060L4256o9351j97983
2134.2G95808182k32773m22974J88523O637J90811K14234k12479k50320J42669P19452
2143.8G96151962l0746n64346l83759N0583M2190K09809L81927j068L98712J25199
2153.5G96380463M9820R536l90777k43836O11J15585r5062O04782O07147K11945j15662
2164.1G97134552m64706P4462j45568j48545k08664J5030L94287N38407J010818L32108
$$ y = [794474716, 794520340, 794718781, 794963913, 795290527, 795438461, 795358276, 794934006, 795107956, 795185242, 795050354, 795342789, 795461044, 795677490, 795786743, 795863647, 795673370, 795354767, 795121841, 795095673, 795330124, 795186844, 795227890, 795328751, 795561447, 795844727, 796146698, 796276932, 795841827, 795630112, 795392532, 795252151, 794678345, 794467316, 795210114, 795647202, 796043320, 796041260, 796075516, 796006165, 795808182, 795575409, 795152435, 795340958, 795347595, 795538406, 795752640, 795540161, 795289841, 795432510, 796151962, 796121216, 795556870, 795173111, 795223694, 795265884, 795475693, 795857620, 795856552, 796255264, 796380463, 796430283, 796439819, 796049042, 795805206, 795805817, 795921402, 795826340, 796431122, 797038269, 797250214, 797134552, 796669846, 796744308, 796598740, 796450195, 796241531, 796256561, 796650848, 797189255, 798200073, 798532181]
2173.7G98532181k12403l30200K6856l9673m43573j49460p6904M56924P70264Q63037
2183.4G99397049K27280l81699j26877j74179Q5449N1270j02234r9030L00217L62854
2193G99540100J65176N31006K91520n1804m12827k07061j39695k31018K39182L62625
2202.6H00087204N18265L12347K72293J80283J13754l43552o65206k2736j48850L13874
2212.3H00617676L43323K14691O34384K59476J16958J831L0670m40521k85950j4877
2221.9H01477661j96152L50571K72980N49240N99213J78299j61973j82266k060l53470
2231.6H02532043O6300J47095k3346m0741K25067N82886P9040j14517k33841r5978
2241.2H03124008j96838m54483k10190K04849O65131M29916K6932J4648K09351k31476
$$ y = [798532181, 798319778, 797989578, 798016434, 797976761, 797533188, 797383728, 797306824, 797763748, 798534012, 799397049, 799624329, 799242630, 799115753, 798941574, 799027023, 799078293, 798976059, 798877029, 799177246, 799540100, 799705276, 800236282, 800527802, 800475998, 800063171, 799856110, 799716415, 799485397, 799724579, 800087204, 800605469, 800917816, 801190109, 801370392, 801484146, 801140594, 800475388, 800452652, 800303802, 800617676, 800960999, 801175690, 801810074, 802069550, 802186508, 802188339, 802219009, 801778488, 801492538, 801477661, 801281509, 801632080, 801905060, 802454300, 803053513, 803231812, 803069839, 802887573, 802885513, 802532043, 802598343, 802745438, 802722092, 802681351, 802906418, 803489304, 803568344, 803453827, 803219986, 803124008, 802927170, 802472687, 802262497, 802467346, 803132477, 803562393, 803589325, 803603973, 803813324, 803581848]
2250.9H03581848l05862k43378m22363K3041q927N00794O48727L91998K60697k70615
2260.5H04155960m57764n04760K0218j51597J15510L88793J09482L19443m4937L08761
2270.2H04259109J374l44238l44468k73895K30484q7967M40979K17056O9581N13916
2279.8H04681931K02865j9836n41611k91214j16043J47171R0485j68686J45721K09503
2289.4H04340286L07999p9269Q3770k32010k79541O3324l57437j40304j76850M93317
2299.1H04023285L23715J19095L74603l14789j92413o11572m00696m730K03094N13764
2308.7H04033356M66690M86069m15803m51583n73044K01034N77164m45175L7918l75900
2318.4H03540726P2632N74264k14996l56293P477N82275P9270o54450j425400l68423
$$ y = [803581848, 803275986, 803032608, 802610245, 802633286, 802624359, 803125153, 803773880, 804165878, 804426575, 804155960, 803698196, 803193436, 803213654, 803062057, 803177567, 803566360, 803675842, 803995285, 803950348, 804259109, 804260483, 803916245, 803571777, 803297882, 803528366, 803440399, 803881378, 804098434, 804168015, 804681931, 804884796, 804864960, 804323349, 804032135, 803916092, 804063263, 804153748, 803985062, 804130783, 804340286, 804648285, 804569016, 804652786, 804420776, 804141235, 804204559, 803847122, 803706818, 803529968, 804023285, 804347000, 804466095, 804840698, 804525909, 804333496, 803721924, 803321228, 803316498, 803519592, 804033356, 804500046, 804986115, 804570312, 804118729, 803545685, 803746719, 804323883, 803878708, 803916626, 803540726, 803613358, 804187622, 803972626, 803616333, 803623810, 804206085, 804285355, 803630905, 802205505, 801837082]
2328H01837082O09970N16052P57141l5705j55030m25643k69165k33155k23999O17752
2337.7H02995300k89688r02786J90735N0735p10449J024857Q19931j076432l59878
2346.3H01742325J17111o2561L52097N95474P6599L5248K67029N86166m37470j728363
2356H01543655p08847p39746N97687O23627q05512q16955n8136J434936M31977k67868
2365.6H01234818o02570l21961p61108o82754Q20999N26809m425o20956L51257N07813
2375.3H00447922Q3465K52381p76520m02680K87018K47498k52991k7771L95966J068
2384.9H00255356L38592J4038k17208k50092o26297m02679m883K19803j12992L75901
2394.6G99589539K94418m69666j97219o2943j16043m01917m52423r765J91345j82266
$$ y = [801837082, 802447052, 802963104, 803720245, 803684540, 803529510, 803103867, 802834702, 802601547, 802377548, 802995300, 802705612, 801802826, 801993561, 802044296, 801333847, 802358704, 803178635, 802102203, 801742325, 801859436, 801796875, 802148972, 802744446, 802821045, 802856293, 803123322, 803709488, 803272018, 801543655, 800834808, 800095062, 800692749, 801316376, 800510864, 799693909, 799635773, 801070709, 801502686, 801234818, 800632248, 800310287, 799549179, 798866425, 799687424, 800214233, 800209808, 799588852, 799940109, 800447922, 800531387, 800783768, 800007248, 799604568, 799891586, 800139084, 799886093, 799858322, 800254288, 800255356, 800593948, 800607986, 800390778, 800140686, 799514389, 799111710, 799106827, 799326630, 799213638, 799589539, 799883957, 799414291, 799217072, 799154129, 799038086, 798636169, 798183746, 798173981, 798365326, 798183060]
2404.2G98183060O4315L90778J2589p7820m60816l59039m27475k30408L22190j23444
2413.8G97293930j48621j53122L4028k84806m29840J18332k16598r9106j11771l57513
2423.5G95644913k95487j29776n2643m6997J13831k64359m09622m73556l46375K8305
2433.1G93768234J1597l69949n21851J69296L12119l1204k42081k45361m75007m88891
2442.8G91886902M9667r1247j77536l49350k10038l5095j61438J35117R5901j44195
2452.4G90998688m74320O3782Q4763o02646n88761n16967k8229j4572K15759L73611
2462.1G89511108n6915l84750n04914j96914n42221m39148l05939j41067J42745j17950
2471.7G86964035P4158n7373Q0948j51139l11889j14060m07409j69678k89307j51214
$$ y = [798183060, 798247375, 798638153, 798650742, 798572922, 798112106, 797753067, 797325592, 797095184, 797417374, 797293930, 797145309, 796992187, 797026215, 796741409, 796311569, 796429901, 796213303, 796114197, 796002426, 795644913, 795349426, 795219650, 795167007, 795120010, 795233841, 794969482, 794559860, 794086304, 793739929, 793768234, 793779831, 793409882, 792888031, 793057327, 793369446, 793338242, 793096161, 792850800, 792375793, 791886902, 791936569, 791845322, 791667786, 791318436, 791108398, 791073303, 790911865, 791046982, 791142883, 790998688, 790524368, 790588150, 790672913, 790070267, 789481506, 788964539, 788936310, 788921738, 789137497, 789511108, 789454193, 789069443, 788564529, 788367615, 787825394, 787386246, 787080307, 786939240, 787081985, 786964035, 787038193, 786980820, 787061768, 786910629, 786598740, 786484680, 786077271, 785907593, 785618286, 785467072]
2481.3G85467072P4920j76239m11758n2643L06091j99661j24435m11301o50482l05481
2491G83516083J1902L2425k21177J89209J80741L56903l05o71845k71377o5537j59912
2501.6G82897110n83954n5389K15606m0283O15006K06756p35321o85806j27411j39694
2511.2G81566620k48947L357L2501j37558K7237L93982L76968K59018o11725p55615
2520.9G80905838l11356p33642o16074j50146M48074L59345J8386j70059l41415o8970
2530.5G79339981k55890l34701p56607m66919L10363j48315k40402J28021K83966n0049
2540.2G77809448j75400j64108l92303n61676o59104m61349j59149M10690K44598J46790
2549.8G76038437K6321o09207o82831r55124l47824J53656j38321j10473J29928L08228
$$ y = [785467072, 785541992, 785365753, 784953995, 784901352, 785207443, 785007782, 784883347, 784472046, 783821564, 783516083, 783527985, 783560410, 783339233, 783528442, 783709183, 784066086, 784065781, 783393936, 783122559, 783057022, 782897110, 782313156, 782257767, 782473373, 782433090, 783048096, 783254852, 782519531, 781833725, 781706314, 781566620, 781317673, 781321030, 781353531, 781215973, 781243210, 781637192, 782014160, 782273178, 781661453, 780905838, 780594482, 779860840, 779244766, 779094620, 779542694, 779902039, 779920425, 779750366, 779408951, 779339981, 779084091, 778749390, 777992783, 777525864, 777836227, 777687912, 777447510, 777575531, 777859497, 777809448, 777634048, 777469940, 777077637, 776515961, 775856857, 775395508, 775236359, 775647049, 775891647, 776038437, 776064758, 775455551, 774772720, 773817596, 773469772, 773623428, 773485107, 773374634, 773504562, 773812790]
2559.5G73812790J0300M7683l09524k68250k13470p54090k67944j30463l85742k41852
2569.1G71299438K74888O2561k30256J34278k01035j60064m30069q31528m04358J27335
2578.7G69641190L89099r9411k67411K1515M5777j97754l98331o13708l35160M5090
2588.4G68230896m94690k94723K05001M0665j526J602j22985k30408m79202o37665
2598G66216965j21613l1357L968K81219J43967n9204j63575j28250o49566p14569l46985
2608.6G64431000r8038j63650m98734K93579L69797j95084j68762k40555n99746p16553
2618.3G62413254k36435l65296j85241J30768N6304j20086m89578l43171m37698m42123
2627.9G59980698n57862n37719l35007n16281j03531R4910k08817l93524n1575l50494
$$ y = [773812790, 773823090, 773870773, 773561249, 773292999, 773079529, 772325439, 772057495, 771927032, 771541290, 771299438, 771574326, 771636887, 771406631, 771540909, 771339874, 771179810, 770749741, 769918213, 769513855, 769641190, 770030289, 769930878, 769663467, 769684982, 769730759, 769533005, 769134674, 768520966, 768185806, 768230896, 767736206, 767441483, 767646484, 767687149, 767685623, 767687225, 767564240, 767333832, 766854630, 766216965, 766095352, 766063995, 766067963, 766349182, 766493149, 766433945, 766270370, 766142120, 765492554, 764777985, 764431000, 764332962, 764169312, 763670578, 763964157, 764333954, 764138870, 763970108, 763729553, 763129807, 762413254, 762176819, 761811523, 761626282, 761757050, 761813354, 761693268, 761203690, 760860519, 760422821, 759980698, 759422836, 758885117, 758550110, 758033829, 757930298, 758025208, 757816391, 757422867, 757371292, 757020798]
2637.6G57020798r42765p90939q01849k02332J24588J49918J44119l52173l39355j65177
2647.2G53844833m33578q47778m63105m35638l78418J64871l76663o18897k14233J0300
2656.9G50251694j66092m66919o92139l49655j6632n84869k04697K00653k43988n78308
2666.5G47149048l47366L7078l50494k74582k85797q07800p50580m9210M19770M5318
2676.1G44785385k98767m39529o11725p02591k78015p5379q4533j41526l97796P4234
2685.8G41829758m4480l54538k86560l99856n15671n08575j93863l84369k93885j62735
2695.4G38685226J65482K24991l76511k33612p05719o13174m34799q23288k52228P4844
2705.1G35711212j96152n94101Q7281K90451n04303p33719o09741k20337n16205n91888
$$ y = [757020798, 756078033, 755287094, 754485245, 754282913, 754407501, 754557419, 754701538, 754349365, 754010010, 753844833, 753411255, 752563477, 752100372, 751664734, 751286316, 751451187, 751074524, 750455627, 750241394, 750251694, 750085602, 749618683, 748926544, 748576889, 748560257, 747975388, 747770691, 747971344, 747727356, 747149048, 746801682, 746838760, 746488266, 746213684, 745927887, 745120087, 744369507, 744320297, 744740067, 744785385, 744486618, 744047089, 743435364, 742732773, 742454758, 742379379, 742294846, 742153320, 741755524, 741829758, 741785278, 741430740, 741144180, 740744324, 740228653, 739720078, 739526215, 739141846, 738847961, 738685226, 738850708, 739075699, 738699188, 738465576, 737759857, 737146683, 736711884, 735888596, 735636368, 735711212, 735515060, 734920959, 735008240, 735298691, 734794388, 734060669, 733450928, 733230591, 732714386, 732122498]
2714.7G32122498j50376M2649j57319k58026m1427l19901n17883p20368l07540Q7356
2724.4G29779663k02789k80991k90527k12631k53601R3612k40021n59387k07519m86222
2734G27139587l33252n8288j63880o46057k95181J45569l4638L80860k42386p10907
2743.7G25181427l84064j97677j93711k09427Q851j38321K8610l53470o97708n83344
2753.3G22461166m89807L0823J6708P630j97373j35879K6703k19803j66550l21121
2762.9G21012497j53122j77002k71301j71051j18332r3537l86810k90832L2348L70941
2772.6G19753799M5395l24173m85382j148452q31299J79825J19857o40487l31879j38092
2782.2G16199112k69394l9825n14908n84717l96271q9035J67084j17569n75714j013184
$$ y = [732122498, 731972122, 732014771, 731857452, 731599426, 731557999, 731238098, 730720215, 729999847, 729692307, 729779663, 729576874, 729295883, 729005356, 728792725, 728539124, 728632736, 728392715, 727833328, 727625809, 727139587, 726806335, 726748047, 726584167, 725938110, 725642929, 725788498, 725753860, 726134720, 725892334, 725181427, 724797363, 724599686, 724405975, 724196548, 724205399, 724067078, 724095688, 723742218, 723044510, 722461166, 721971359, 722002182, 722018890, 722026520, 721829147, 721693268, 721719971, 721500168, 721333618, 721012497, 720859375, 720682373, 720411072, 720240021, 720121689, 720028152, 719641342, 719350510, 719382858, 719753799, 719799194, 719475021, 718989639, 717841187, 717009888, 717189713, 717309570, 716669083, 716337204, 716199112, 715929718, 715889893, 715374985, 714790268, 714393997, 714304962, 714472046, 714354477, 713778763, 712765579]
2791.9G12765579n22613l46985n58548k43759o5766l42102p47604n64041k59323k31781
2801.5G08883057m28162p30057r03854n05066l79639p31811k97470l49961p05871n04685
2811.2G03346481m15344n76172o94732p14875r52377p21359n61524m71344n47790r13468
2820.8F96777496m50744n11933j040802j150360j074600p96051o31256n53970m62265
2829.5F90105515o07224q58231q57696j256943r93347o07910j119003o38810k93808
2838.2F82872543r85336j680603j464767j001206r16672p88269j407242j605606j430816
2846.8F71592026j655274j914749j616592r43985j344300j228942n97992m20456q74024
2855.5F60995712j515884p45239k83814o62689q29239p90329o38962n55877r09424
$$ y = [712765579, 712242966, 711895981, 711337433, 711093674, 711027908, 710685806, 709938202, 709374161, 709114838, 708883057, 708454895, 707724838, 706820984, 706315918, 705936279, 705204468, 704906998, 704557037, 703851166, 703346481, 702931137, 702354965, 701660233, 700945358, 699992981, 699271622, 698710098, 698238754, 697690964, 696777496, 696326752, 695814819, 694774017, 693623657, 692549057, 691753006, 691121750, 690567780, 690105515, 689498291, 688640060, 687782364, 686525421, 685532074, 684924164, 683805161, 683166351, 682872543, 681887207, 680206604, 678741837, 677740631, 676823959, 676035690, 674628448, 673022842, 671592026, 669936752, 668022003, 666405411, 665461426, 664117126, 662888184, 662290192, 661869736, 660995712, 659479828, 658734589, 658450775, 657788086, 656958847, 656168518, 655529556, 654973679, 654064255]
2864.2F54064255j257172j106949j383362j315231j180420j556015j440658r88922
2871.9F43835526j128693j647949j657410j943932j457824j190377j759414j284294
2879.6F31765633j317139j313362j231766q86497k99073q35685p47910n96962q37479
2888.3F23699760r18579n70907k50283m31404k60658o3972N93490J33057r17587r20563
2897.9F20092354n69916L30925j0986m38576k11868n78499p67288p59926n01251o84319
2907.6F15900650n12466n7526o71196j084862j239090j693306j208992m25186j234817
2916.3F07773209j900673j596375j480102j242333j033516r77325j221199r43566j16081
2925E97262039m09508r50622m06647n684q812M51241L57590j82000j19781O70509J387406
$$ y = [654064255, 652807083, 651700134, 650316772, 649001541, 647821121, 646265106, 644824448, 643835526, 642706833, 641058884, 639401474, 637457542, 635999718, 634809341, 633049927, 631765633, 630448494, 629135132, 627903366, 627016869, 626717796, 625882111, 625134201, 624537239, 623699760, 622781181, 622210274, 621959991, 621528587, 621267929, 621203957, 621797447, 621930504, 621012917, 620092354, 619522438, 619853363, 619842377, 619403801, 619191933, 618613434, 617846146, 617086220, 616584969, 615900650, 615388184, 615330658, 614659462, 613574600, 612335510, 610642204, 609433212, 609008026, 607773209, 605872536, 604276161, 602796059, 601553726, 600520210, 599542885, 598321686, 597378120, 597262039, 596852531, 595901909, 595495262, 595489578, 595480766, 595932007, 596289597, 596107597, 595987816, 596658325, 598045731]
2935.6E98045731J208381J216583J713753J773148J523132J681709J627770J503029
2943.3F10293236J634788J516304J811409J813011J607857J581230J669464K059136
2951F23986435J649742J401062J647110J373100J406784K130127K016335J407738J562728
2959.7F38581161J548768J436462J382446J430207J261444J003036J514282J830063
2967.4F49987869J366272Q42057J483688J937408J467591J203918P49207O60705J108780
2976.1F60807495J628952J451340Q08716P93457J152649J138610N27497O97250J166535
2984.7F70172501Q58688M29382M89579Q48159P61109L97186L00217Q44650Q93555M52499
2994.4F76447525K46887K23999N66025n2719n63049J87301L72620k61612O2561O73065
$$ y = [598045731, 599254112, 600470695, 602184448, 603957596, 605480728, 607162437, 608790207, 610293236, 611928024, 613444328, 615255737, 617068748, 618676605, 620257835, 621927299, 623986435, 625636177, 627037239, 628684349, 630057449, 631464233, 633594360, 635610695, 637018433, 638581161, 640129929, 641566391, 642948837, 644379044, 645640488, 646643524, 648157806, 649987869, 651354141, 652196198, 653679886, 655617294, 657084885, 658288803, 659038010, 659698715, 660807495, 662436447, 663887787, 664696503, 665489960, 666642609, 667781219, 668308716, 669005966, 670172501, 671031189, 671460571, 671950150, 672798309, 673559418, 673956604, 674256821, 675101471, 675995026, 676447525, 676694412, 676918411, 677484436, 677431717, 676868668, 677055969, 677428589, 677166977, 677229538, 677902603]
3004F77902603m4403l68500j91192l10517j77917K9754m6463j75170m75693q75244
3013.7F75267258m37088l93677l78647k12326n19714m86374q39844n04684k44828j045685
3023.3F70204391j054763k28577P7362n06515o28815r32770p97501j89132o88706j017227
3033F64237747q62732n89142o59561o48651n20401m71039l98559p10221p02972j045990
3042.6F57628479j405182j399765r91592l37601o21872p29217l40729p02439j521453
3051.3F49578629r72214m85077r47800r60235j026993p30057r77859p05491j48315
3060F42624588q80127r35593p48214q69751j389542j090965p02210q30536l72505j129074
3069.6F33676071r73015n1841o10657j277161j288719r39980p60116k20718o36750
$$ y = [677902603, 677858200, 677489700, 677298508, 676987991, 676810074, 676839828, 676793365, 676618195, 676142502, 675267258, 674830170, 674436493, 674057846, 673845520, 673325806, 672839432, 671999588, 671494904, 671250076, 670204391, 669149628, 668921051, 668998413, 668491898, 667863083, 666930313, 666132812, 665943680, 665254974, 664237747, 663375015, 662785873, 662126312, 661477661, 660957260, 660486221, 660087662, 659377441, 658674469, 657628479, 656223297, 654823532, 653831940, 653494339, 652872467, 652143250, 651802521, 651100082, 649578629, 648606415, 648121338, 647173538, 646213303, 645186310, 644456253, 643478394, 642772903, 642624588, 641744461, 640808868, 640060654, 639190903, 637801361, 636710396, 636008186, 635177650, 634805145, 633676071, 632703056, 632651215, 632040558, 630763397, 629474678, 628534698, 627774582, 627553864, 626917114]
3078.3F26917114j387710j051026p56950n24597n86090o60401q58650j370354j491813
3087F18229523q67615n52979o50367o16646j060372r06753p07512o10619n35316j141510
3096.6F10579834j116371q15048o56090r65882q83941n73769r56154r13276p75757
3105.3F02923546o32019j111222j315879o87676o96106p87925o06347k89955n87997
3114E96208420r61876j226730j424523q56552r67331j109619m05655l86734j195793
3122.6E87673607j295662q76427o36139n08766j267242j414566l22762j88408j147957
3131.3E80015678j231117o33468n84298q07380j152802j036835o32476m12331p29485
3140E72795486j109924p20367p08351q94318q95691n88417m64172r66072r64509q39042
$$ y = [626917114, 625529404, 624478378, 623721428, 623196831, 622610741, 621950340, 621091690, 619721336, 618229523, 617361908, 616808929, 616158562, 615541916, 614481544, 613574791, 612867279, 612256660, 611721344, 610579834, 609463463, 608648415, 607992325, 607026443, 606142502, 605568733, 604612579, 603699303, 602923546, 602291527, 601180305, 599864426, 599176750, 598480644, 597692719, 597086372, 596796417, 596208420, 595246544, 594019814, 592595291, 591738739, 590771408, 589661789, 589256134, 588869400, 587673607, 586377945, 585501518, 584865379, 584356613, 583089371, 581674805, 581352043, 581163635, 580015678, 578784561, 578151093, 577566795, 576759415, 575606613, 574569778, 573937302, 573524971, 572795486, 571685562, 570965195, 570256844, 569362526, 568466835, 567878418, 567414246, 566448174, 565483665, 564644623]
3149.6E64644623r97963q68836l58200r19151j374054o82640q96683j101455q13256
3158.3E56632385n04303l28521o19698j017952q55713o10809q61664l53661n00106
3167E50979958q30994o97098q99696m87786p81173r18274q30345q69522o55442q29849
3176.6E43179779p70225r42841o57082o50673o23245l28331p64160o48117j027451
3185.3E36767654j041145l47900p25441j127243m63791j87950o65360n68657r16519
3194E30723648r38377o60553n10369k69241p34558r75990r17282j84441j53618l64265
3203.6E25014954p88460j734848r24416o22902j70936k98920j185760m48418k44026
3212.3E18596268j55640o43196j026497q85124m10080R231r98497o09397j08300l72390
$$ y = [564644623, 563646660, 562777824, 562419624, 561500473, 560126419, 559443779, 558547096, 557445641, 556632385, 556128082, 555799561, 555179863, 554161911, 553306198, 552695389, 551833725, 551480064, 550979958, 550148964, 549451866, 548552170, 548064384, 547283211, 546364937, 545534592, 544665070, 544009628, 543179779, 542409554, 541466713, 540809631, 540158958, 539535713, 539207382, 538443222, 537795105, 536767654, 535726509, 535378609, 534653168, 533525925, 533062134, 532874184, 532208824, 531640167, 530723648, 529785271, 529124718, 528614349, 528345108, 527610550, 526634560, 525717278, 525532837, 525379219, 525014954, 524226494, 522491646, 521567230, 520944328, 520773392, 520474472, 519288712, 518840294, 518596268, 518440628, 517797432, 516770935, 515885811, 515475731, 515484962, 514486465, 513877068, 513768768, 513396378]
3222E13396378o12221q53005m11224l71323j85508o99120j116028n44853k86179l66287
3231.6E07950630p42302n12962l30391m98810n70907p09649r60350o25457R9830k64702
3241.3E02834930o39000q09059n91354j68037l38593m85229q41179m69323o6490m41932
3250.9D97984734n60570n33943n02892m43230l52172m14391o41747o83593j34049j32179
3260.5D93585968n55382n06668o38656j95847l27606r61800n11703J7891o7215p08428
3270.2D89130554l62587N31349j3656j151962p29561M6730q20237n95169M91143k38610
3279.8D86287994j089477p93419l02811k00386j57470j82457m99688k02179J39389
3288.5D82999496m12864o50482n15366k7466K13547o15616o32133k56615p15408q03109
$$ y = [513396378, 512784157, 511931152, 511519928, 511148605, 510963097, 510263977, 509147949, 508603096, 508316917, 507950630, 507208328, 506695366, 506364975, 505866165, 505295258, 504585609, 503625259, 502999802, 503099632, 502834930, 502195930, 501386871, 500795517, 500627480, 500288887, 499803658, 498962479, 498493156, 498426666, 497984734, 497424164, 496890221, 496387329, 495944099, 495591927, 495177536, 494535789, 493852196, 493718147, 493585968, 493030586, 492523918, 491885262, 491689415, 491361809, 490400009, 489888306, 489906197, 489838982, 489130554, 488767967, 489299316, 489285660, 488133698, 487404137, 487450867, 486630630, 486035461, 486526604, 486287994, 485198517, 484405098, 484102287, 483901901, 483744431, 483561974, 483062286, 482860107, 482999496, 482586632, 481936150, 481420784, 481393318, 481606865, 480991249, 480359116, 480102501, 479387093, 478583984]
3298.2D78583984m15039m62570l89328O1150Q659p1258j64643n02662n79110m82673
3307.8D75586510n86930n08384l98903p43714l52172l24860p08122k84844l6545l77197
3317.4D71264839j240310n34363K1972p09686n96466n00526J28402K77138m15344j046372
3327.1D66649284r37156k18811o69594m48418k79426n50652m15268n24826j46980n36461
3336.7D61921692r51424p41653l37944J62048m26750j116219q54187m82750p70225
3345.4D56402588m01726J4877m79316o04019o66047p69538n91088p13730q73375n2452
3355.1D51266174k13279j038933m33998k38114k78549m26407o58798o33087o35033
3363.7D46709976n67932o46400m90570q17185j74866L19786p87010j008796q06847
$$ y = [478583984, 478168945, 477706375, 477317047, 477378197, 477386856, 477315598, 477150955, 476648293, 476069183, 475586510, 474999580, 474491196, 474092293, 473348579, 472996407, 472671547, 471963425, 471678581, 471642036, 471264839, 470024529, 469490166, 469512138, 468802452, 468205986, 467705460, 467833862, 468111000, 467695656, 466649284, 465712128, 465493317, 464823723, 464375305, 464095879, 463545227, 463129959, 462605133, 462458153, 461921692, 460970268, 460228615, 459890671, 460052719, 459625969, 458509750, 457655563, 457172813, 456402588, 456000862, 456015739, 455536423, 454932404, 454266357, 453496819, 452905731, 452192001, 451318626, 451266174, 451052895, 450013962, 449579964, 449341850, 449063301, 448636894, 447978096, 447345009, 446709976, 446142044, 445495644, 445005074, 444187889, 444013023, 444332809, 443545799, 442537003, 441730156]
3372.4D41730156k88773k36778p00989p49359n67512j57128m26101k74544k44026o81687
3382.1D37403259n63202k85110j68152p03430n89295l53660l49159L0250k04010k38800
3391.7D33978691l86925r57603n23796K24724P8659m48609l27110j35612j93139m3525
3401.3D31265755Q0490K785j79253j90773k84538q14095n08270L5286k3766K11487
3411D29595108J52359l04832p03621n23644m9209O0424j5068m6119N4016m07028n53589
3421.6D27258797o2485M77829L71590R5672P23114J5297n50537j12801k47840q0681
3431.2D27887955j20926K06489O35758K59743m19274k80762M55323N90553L59955p3929
3440.9D29500885P8239L815J86081M88434L61824M47540l19290M36974N76248j61781
$$ y = [441730156, 441441383, 441204605, 440503616, 439754257, 439186745, 439029617, 438603516, 438328972, 438084946, 437403259, 436840057, 436554947, 436386795, 435683365, 435094070, 434740410, 434391251, 434421501, 434217491, 433978691, 433591766, 432634163, 432110367, 432335091, 432413750, 431965141, 431638031, 431502419, 431309280, 431265755, 431346245, 431349030, 431169777, 430979004, 430694466, 429880371, 429372101, 429407387, 429383621, 429595108, 429747467, 429442635, 428739014, 428215370, 428166161, 428226585, 428211517, 428165398, 428219414, 427812386, 427258797, 427196312, 427674141, 428045731, 428141403, 428864517, 428879814, 428329277, 428216476, 427968636, 427887955, 427767029, 427973518, 428609276, 428869019, 428449745, 428168983, 428624306, 429214859, 429574814, 429500885, 429579124, 429582939, 429769020, 430257454, 430619278, 431066818, 430747528, 431184502, 431760750, 431598969]
3450.5D31598969L68881O45065R92127O31523K30484k51656j36833O11381J25313K90680
3460.2D35105934L33214M29611N95513L84445L58047J61782N56793L64647O11305P99904
3469.8D39701195M87785Q23517L87459O35566P23610n02891J24206J294403O88172
3478.5D44363022M40445M84810L33213L92190k8687P84645P95593M88053J209106K53334
3488.1D49515724J97678J439667P90596k88430M05770Q51555Q14590J094398K35749
3496.8D55057297j24130M00428R78585Q18367L23638N73464L49121J92947Q44155J085357
3506.5D60499229O50063J621628R85298r78050P87735J358719J145629Q42286J36757
3515.1D67049294J36604J61094Q77457J101227J154480J343193J588478M71153j121101
$$ y = [431598969, 431967850, 432612915, 433605042, 434236565, 434467049, 434215393, 434078560, 434689941, 434815254, 435105934, 435439148, 435868759, 436464272, 436848717, 437206764, 437368546, 437925339, 438289986, 438901291, 439701195, 440188980, 441012497, 441399956, 442035522, 442759132, 442256241, 442380447, 443674850, 444363022, 444803467, 445288277, 445621490, 446013680, 445984993, 446769638, 447565231, 448053284, 449262390, 449515724, 449713402, 451153069, 451943665, 451655235, 452061005, 452912560, 453727150, 454821548, 455057297, 454933167, 455333595, 456312180, 457130547, 457454185, 458027649, 458376770, 458569717, 459413872, 460499229, 461149292, 462770920, 463756218, 462778168, 463565903, 464924622, 466070251, 466912537, 467049294, 467185898, 467346992, 468224449, 469325676, 470480156, 471823349, 473411827, 473882980, 472761879]
3523.8D72761879N0926J109619J605645P95745N19562P35970R16938Q22297J57852
3532.5D79476433J212158Q61511P96967M02527p668J889992R11598N1270Q02879J840973
3542.1D88238640J524124M70886M09432O53190J398087l02277R00231J834716J564179
3550.8D96691208R89685j286583J465683J433487J346626J704292M18549J907845J434097
3559.5E06104889N45006K90794J729508R64508O44798L940544k60582j63460J12190
3568.2E13908195o48689L724060J519470J093331K254486K052345J080208R13391J862450
3576.9E27759247J077118K104950J225586K80227J801949K445450J512146J242637
3584.6E39449310M582787J463470l035774Q56209J51100L335304L804055K670326J31264
$$ y = [472761879, 472812805, 473922424, 475528069, 476323814, 476843376, 477579346, 478496284, 479318581, 479476433, 480688591, 481550102, 482347069, 482749596, 482741928, 484631920, 485543518, 485594788, 486397667, 488238640, 489762764, 490233650, 490643082, 491296272, 492694359, 492392082, 493292313, 495127029, 496691208, 497680893, 496394310, 497859993, 499293480, 500640106, 502344398, 502762947, 504670792, 506104889, 506649895, 506940689, 508670197, 509634705, 510279503, 514220047, 513959465, 513796005, 513908195, 513259506, 516983566, 518503036, 519596367, 521850853, 523903198, 524983406, 525896797, 527759247, 528836365, 530941315, 532166901, 532447128, 534249077, 536694527, 538206673, 539449310, 544032097, 545495567, 542459793, 543316002, 543467102, 546802406, 550606461, 553276787, 553408051]
3593.2E53408051P12127L655052r85107K015114L154144L20129K883072N36232N39551
3601.9E66238365L066292J949158J687507L057900K107963j017494L756790n33561
3609.6E80312920j65291P733841L28369k427750L845330o24695L887138L899651K43835
3618.3E97033348J957665j318932J216049L512116K226371J760064K453460J823540
3626F10663681J966743N609475l554268r488449N590057N819397N994186L71170k153129
3634.7F20818863K315216K708626J872177K72827J585236J645317J517105J229667
3642.4F33965034O71006K205734L232918N392990q06046k554245O189118j368942o158448
3651.1F40769119j23443O272049M527511L937378L277969r214706J787415N026550
$$ y = [553408051, 554120178, 557775230, 556790123, 558805237, 561959381, 562279510, 565162582, 565698814, 566238365, 569304657, 571253815, 572941322, 575999222, 578107185, 577089691, 580846481, 580312920, 580147629, 587881470, 588209839, 585782089, 589627419, 589002724, 592889862, 596789513, 597033348, 598991013, 597672081, 598888130, 602400246, 604626617, 606386681, 608840141, 610663681, 612630424, 618239899, 614685631, 605197182, 610787239, 616606636, 622600822, 622971992, 620818863, 623134079, 625842705, 627714882, 627987709, 629572945, 631218262, 632735367, 633965034, 634636040, 636841774, 640074692, 645467682, 644661636, 642107391, 648296509, 646927567, 640769119, 640645676, 646917725, 651445236, 655382614, 658660583, 649445877, 651233292, 656259842]
3658.8F56259842J756210J293488k21634J922989J525116R04083J164856J173248L870697
3667.5F69648895J319962j619110j097031n885239M110794Q902436P919388l694153
3675.2F79605942j7061844M695358P495575L137436k885056J504365L870391J603699
3682.9F81965866J087494N76401P92846L930436M089126j0818100r53369P422409o193466
3691.6F81899643K053757N492553M11606J168366K19497Q33893J477051L7918K074585
3700.3F95668869K287674n289154j158218N595397J112900k64206J158676L114930
3708G02226868L449020q031387L360367K361373j2545776N894928M761887O93588R43909
3716.7G03114777K372055N55191l492203K003174N429077m375458m174805N518570
$$ y = [656259842, 658016052, 659309540, 659087906, 661010895, 662536011, 663440094, 664604950, 665778198, 669648895, 670968857, 669349747, 668252716, 662367477, 666478271, 675380707, 683300095, 679605942, 662544098, 667239456, 674735031, 677872467, 674987411, 676491776, 680362167, 681965866, 683053360, 683629761, 684422607, 688353043, 692442169, 681624069, 680670700, 688093109, 681899643, 683953400, 689445953, 689857559, 691025925, 691245422, 692079315, 693556366, 693594284, 695668869, 697956543, 692667389, 691509171, 697104568, 698217468, 697953262, 699111938, 702226868, 705675888, 697644501, 701004868, 703366241, 690820465, 696715393, 701477280, 702170868, 703114777, 705486832, 706042023, 702549820, 704552994, 709982071, 705606613, 701431808, 706950378]
3724.4G06950378M04969j754990j604156J129226L741989J720276N112152m588089
3732.1G11111755n845413Q685913k410736r817734K613831L965836R59014K811585
3739.8G12074051K171173m434357L608017J0714112j2481385j4459152J1215134P054596
3747.5G15462189O486282m632111r980087J1012345p928925n239487P427292N344544
3755.3G17952042L375091n571899J792221M430084p680359k80838N026322J111068
3763G20153732L8224L139267m330597l800888M933090N033645j407165q528671L035431
3771.7G18266068K776260P63168J178665k44217J150971J20697K380905j723480o616821
3780.3G18052216M175186K228698R39942J058578l220749m88967J467285J589431R37195
$$ y = [706950378, 707355347, 705600357, 703996201, 705125427, 708867416, 710587692, 715699844, 711111755, 705266342, 713952255, 711541519, 701723785, 704337616, 708303452, 709262466, 712074051, 714245224, 709810867, 713418884, 724132996, 711651611, 697192459, 708407593, 715462189, 721948471, 717316360, 707336273, 718348618, 710419693, 705180206, 712607498, 717952042, 721327133, 715755234, 717547455, 721977539, 714297180, 714016342, 719042664, 720153732, 720191956, 723331223, 719000626, 715199738, 720132828, 725166473, 723759308, 715230637, 718266068, 721042328, 721805496, 722984161, 722739944, 723890915, 724011612, 726392517, 724669037, 718052216, 722227402, 724456100, 725396042, 726454620, 723233871, 722744904, 724212189, 725801620, 726738815]
3789G26738815J43051K57493m04587M31671k65732R98917K927704m285813l763351
3797.7G22778168L269806N356979M959335j1372986q072052O726304L453064M544067
3805.4G31642685L873825j1127167k348251N919342J851044k73667M24347M85764J688385
3814.1G32136307M602356m186936j1919479P175598O683197M628601j319198j8805848
3821.8G18994598M811097O117630K397232K864456l8758m116439n55344J946793L557129
3830.5G35978394P62863p363205L900223O324081o519699l18680N918961q739319j010132
3839.2G28933487P569199n522690Q62884N841065m853669k336883M040451J281967
3846.9G35815811j3580J460419p41044J678696M715500o798477l209763j4956054O538543
$$ y = [726738815, 726881866, 727139359, 726734772, 727166443, 726900711, 727899628, 730827332, 726541519, 722778168, 726047974, 731404953, 736364288, 724991302, 716919250, 723645554, 727098618, 731642685, 735516510, 724389343, 722041092, 727960434, 729811478, 729537811, 729962158, 730447922, 732136307, 736738663, 732551727, 720632248, 727807846, 734491043, 739119644, 737800446, 718994598, 723805695, 729923325, 732320557, 735185013, 735146255, 731029816, 730474472, 732421265, 735978394, 736741257, 729378052, 733278275, 739602356, 733082657, 732763977, 738682938, 729943619, 728933487, 736502686, 730979996, 731842880, 737683945, 732830276, 730493393, 734533844, 735815811, 735802231, 737262650, 736521606, 738200302, 742915802, 736117325, 732907562, 717951508, 724490051]
3855.6G24490051J1608200p51495k92664K502213J064835J269073m604187K367401
3863.3G37653427O087799p859344m100342M786606N004501L793869j0821228p014236
3871G27531052O142120P254410K599792j0517502J533127M702606M00696K463990M162063
3879.7G46272354o200027o704636N895844J663284J515274K482300j2779236L216629
3887.4G35361786M438400J137314M364319k692719p888946L068924L434143j525421
3895.1G39697800L03726J102676L197937O90308r446335N899048O50482n544510N662613
3903.8G42213745k820663r69849L43094L9596K103882P0801N54886L61633J14289J22451
3913.4G42133865K06299J352768J357727l876953l250198M113006j61133k668380K387695
$$ y = [724490051, 736098251, 735346756, 735054092, 737556305, 738621140, 739890213, 735286026, 737653427, 743741226, 735881882, 731781540, 736568146, 741572647, 745366516, 734545288, 727531052, 733673172, 740927582, 743527374, 733009872, 734542999, 739245605, 739646301, 742110291, 746272354, 740072327, 733367691, 739263535, 740926819, 742442093, 744924393, 732145157, 735361786, 739800186, 740937500, 745301819, 742609100, 734720154, 737789078, 741223221, 739697800, 740001526, 741104202, 744302139, 744992447, 735546112, 741445160, 742095642, 736551132, 742213745, 739393082, 738423233, 738766327, 738805923, 740909805, 740980606, 741535492, 741897125, 742011414, 742133865, 742340164, 743692932, 745050659, 741173706, 737923508, 742036514, 741875381, 739207001, 741594696]
3922.1G41594696J243515K23618k584153j470413K387314J881256Q12225k115325o61316
3930.8G41311417J686782j657180J47400J467514l60489J09253J22146M83933L63617
3939.5G43674393n43442J831360P12585l981781Q2932J504440J029282O79016k498169
3948.1G42490616M23126l13263k028961K190628R83276M24195O01883k42615k1744
3956.8G44507141q78143K27432N88150Q97827l85895j691131Q41217O32553M3793j04447
3966.5G44678497l4637J5030j053620J90049J085891L8452q80355l07083O92672L67584
3976.1G44792480m57077J50910O85272m08554J38855O24084l16543N7068K02255m87137
3985.7G44981613k26364L45764L30506M64477n42145o20346M60892n3329n03693n34821
$$ y = [741594696, 742838211, 743061829, 740477676, 739007263, 741394577, 743275833, 744088058, 741972733, 741311417, 742998199, 741341019, 741488419, 742955933, 742595444, 742704697, 742826843, 743310776, 743674393, 743130951, 744962311, 745674896, 741693115, 741776047, 743280487, 744309769, 744988785, 742490616, 742913742, 742600479, 740571518, 742762146, 743745422, 744169617, 744771500, 744528885, 744507141, 743628998, 743856430, 744444580, 745342407, 744956512, 743265381, 744106598, 744739151, 744782944, 744678497, 744643860, 744658890, 743605270, 743795319, 744881210, 744919662, 744039307, 743732224, 744424896, 744792480, 744335403, 744486313, 745171585, 744763031, 744901886, 745525970, 745209427, 745266495, 745468750, 744981613, 744755249, 745101013, 745431519, 745895996, 745353851, 744733505, 745194397, 745141068, 744637375, 744102554]
3995.4G44102554P69577R03626l7003O50101K62375
4000.2G46651230
$$ y = [744102554, 744872131, 745775757, 745738754, 746388855, 746651230]
##END=$$ End of the data block
