##TITLE=$$ Begin of the data block
##JCAMP-DX=5.00 $$ ACD/SpecManager v 10.08
##SPECTROMETER/DATA SYSTEM=Varian
##DATE=20 Nov 2012 13:54:40
##DATA TYPE=INFRARED SPECTRUM
##DATA CLASS=XYDATA
##ORIGIN=
##OWNER=
##NPOINTS=3735
##FIRSTX=399.26403809
##LASTX=4000.35498047
##MAXX=4000.35498047
##MINX=399.26403809
##MAXY=80.64891815
##MINY=40.01402283
##XFACTOR=1.0000000000
##YFACTOR=0.000000100000000
##FIRSTY=61.29533386
##DELTAX=0.96440572
##XUNITS=1/CM
##YUNITS=TRANSMITTANCE
##XYDATA=(X++(Y..Y))
399.3F12953339j776238J2153435N379333l990402r599800p596817O06422K337227
407F10466499L147698m005242k352218K574196p66869K559776n33714k356605K995834
415.7F11729355M216881N594711J2403145k103691j9008141n764313J582146J864548
423.4F10514641m619255n745964J798095N225411K90680q97484N547066Q16192p752342
432.1F05177040m859276O81534L196755k899895k968407M718018N627136L54843l776321
440.7F05251427m787674l839455L780747P075691M813614K697601k550240j220359
448.4F11221352J143417M82292N6038p12814m38385O43043K695732M128876J285248
457.1F20504799l454247M57611K120705k058449n789795l904190k933807k259789K910309
$$ y = [612953339, 611177101, 623330536, 628709869, 624719467, 615119667, 607522850, 608129272, 610466499, 613614197, 609608955, 607256737, 609830933, 609064064, 611623840, 611090126, 608733521, 611729355, 615946236, 621540947, 633944092, 631840401, 612832260, 607067947, 608650093, 610514641, 605895386, 600149422, 601947517, 607172928, 607463608, 606566124, 612113190, 612929382, 605177040, 600317764, 600999298, 604196053, 601296158, 598327751, 603045769, 608672905, 609027748, 605251427, 600463753, 596624298, 600405045, 607480736, 612294350, 614991951, 612441711, 611221352, 612364769, 612847061, 612903099, 612190285, 611751900, 612394943, 615090675, 619219551, 620504799, 617050552, 617508163, 619628868, 617570419, 611780624, 607876434, 604942627, 602682838, 605593147]
465.8F05593147O29578l944969l64380K362366K011070J77002m874268m676437P96699
474.5E97709808K106743l171501n017624K619705K664223N55153J960068j157914r11178
483.2E97357483k669335j897087K027283K002869K432785K311401K543564m942055
490.9E99166908p572670J322174m38919O95801R48906j972237J159249J931686O72188
499.6E95913086j671143l606262l808670q19206O69136n37567N05523j184616m736518
508.2E80723763m13628K168960j616745l283958k498932r94606K2240l23982j176835
516.9E72606277j218109j474762k51159J106529k170105L16544M11720l470688j853638
525.6E64002609j349182J342278K68974r51500K022896J196747k034417k182579J719323
$$ y = [605593147, 606222725, 602277756, 601913376, 604275742, 606286812, 606463814, 601589546, 596913109, 597709808, 599816551, 596645050, 591627426, 594247131, 596911354, 597466507, 599426575, 598268661, 597357483, 594688148, 592791061, 594818344, 596821213, 599253998, 601565399, 604108963, 599166908, 591594238, 592916412, 592477493, 593173294, 594122200, 592149963, 593309212, 595240898, 595913086, 594241943, 590635681, 586827011, 586007805, 586676941, 586139374, 586644897, 585460281, 580723763, 580310135, 582479095, 580862350, 577578392, 575079460, 574084854, 574107094, 573783112, 572606277, 571388168, 569913406, 569662247, 570768776, 568598671, 568915215, 569326935, 565856247, 564002609, 562653427, 563995705, 564264679, 563313179, 565336075, 566532822, 564498405, 562315826, 564035149]
534.3E64035149R58519J148910K106743P11365K878532L745690L060836J186180K88086
543E80120010l33976l80593J466751J843491J676674q02994j548843l70674Q2321K98576
552.6E82050743p21168p20902j386642j061783j124077q99620O0997r09805j110382
561.3E74177361k666817k315521j371460j174813j587028l160858j396370r89342j573563
570E57941589k818527j672363j7891m52614j004143k285232L87115j78909J490974
578.6E51389999M350701K615585K310982K192268L045273K176590R04350N28527J235084
587.3E70749359J926270J377983K888145J790962Q26188J311111k27394p39060m26521
596E79477043M18091O47507k48375m85993Q86231J389084J70135j007995q74749j7738
$$ y = [564035149, 564993668, 566142578, 568249321, 568960686, 571839218, 575584908, 578645744, 579831924, 580120010, 579786034, 579405441, 580872192, 582715683, 584392357, 583589363, 582040520, 581669846, 581752167, 582050743, 581329575, 580608673, 579222031, 578160248, 577036171, 576136551, 576197548, 575287743, 574177361, 571510544, 569195023, 567823563, 566648750, 565061722, 561900864, 560504494, 559515152, 557941589, 555123062, 553450699, 553432808, 552980194, 551976051, 549690819, 550077934, 549899025, 551389999, 555740700, 558356285, 560667267, 562859535, 565904808, 568081398, 568985748, 569514275, 570749359, 572675629, 574053612, 576941757, 578732719, 579558907, 580870018, 580642624, 579903564, 579477043, 579895134, 580542641, 580294266, 579808273, 580694504, 582083588, 582253723, 581245728, 580370979, 580353241]
605.6E80353241p23953m16222M52995L64533N08308J092072J637001R89799P65915
614.3E85023689j38817J97983R37309N1079J300736J470146J128197K511215L171120
623E95652657J412048o72379J86158J538047J309510J586876P83271r37767P79610
631.7F01638031K293282K520637K461090n20134m96063R56001q52203l89404J238327
640.4F08849564R48867J713219J961937J47057L9329j33133l03688O58379J90353K93121
650F14365005O33889J203041P65838o78024J541252K899857J005707p63588j409722
658.7F19563255n31959Q2626k22511n26924R04922J807938J602554K024460k6283n831986
668.3F18846092L306313L060684o9046k117615J92528J478729J349831K053642J00556
$$ y = [580353241, 579629288, 579213066, 579666061, 580030594, 580538902, 581630974, 583267975, 584257774, 585023689, 584884872, 585082855, 586020164, 586071243, 587371979, 588842125, 589970322, 592481537, 595652657, 597064705, 596392326, 596578484, 598116531, 599426041, 601012917, 601796188, 600858421, 601638031, 603931313, 606451950, 608913040, 608392906, 607896843, 608852844, 608000641, 607611237, 608849564, 609798431, 611511650, 613473587, 613620644, 613659973, 613526840, 613223152, 613881531, 614071884, 614365005, 614998894, 616201935, 616967773, 616289749, 617831001, 620730858, 621736565, 620972977, 619563255, 619031296, 619113922, 618891411, 618364487, 619269409, 621077347, 622679901, 624704361, 624678078, 618846092, 622152405, 625213089, 625144043, 623026428, 623218956, 624697685, 626047516, 628101158, 628201714]
677F28201714k99035J772843J206474O409M33006n35393p00760J033326J397819J009026
686.7F33525429K84042J266174J133347j041298r63211r97581p42341J37291K69356
695.3F32871208m88243j04103R16367j158867k096291j439667j220283r98345j347694
704F24934082l33366O28090K14614J94664Q4114l96957N47180J274071k19193j79557
713.7F26747742J398391K104989J920280J571655J605721K016678K379951J217041
721.4F40962448J621857J957855J182938K140884K468185K429810K086716J191787
729.1F56042480Q89512J085891J105805J283264J254043N02472J155243K243805J880188
737.8F67442703l33557p64847P01142L16009o73141o87180R67941P46460q67385q73871
$$ y = [628201714, 627902679, 629675522, 630881996, 630888405, 631321411, 630786018, 630085258, 631118584, 632516403, 633525429, 633809471, 635075645, 636208992, 635167694, 634204483, 633206902, 632464561, 632601852, 632871208, 632382965, 632278862, 633195229, 632036362, 629940071, 628500404, 627280121, 626281776, 624934082, 624600716, 625228806, 625443420, 625638084, 625722198, 625325241, 625872421, 627146492, 626927299, 626747742, 628146133, 630251122, 632171402, 633743057, 635348778, 637365456, 639745407, 640962448, 642584305, 644542160, 645725098, 647865982, 650334167, 652763977, 654850693, 656042480, 656931992, 658017883, 659123688, 660406952, 661660995, 662163467, 663318710, 665562515, 667442703, 667109146, 666344299, 667045441, 667361450, 666688309, 666001129, 666969070, 667715530, 666848145, 665974274]
747.4F65974274m883l86429j904297j364822j409836r77478j577759k337341l1967
756.1F55979462j102829j099549P4540k202149k953796j935730r83658q88519m66156
764.8F44421616K99377P86133J279297J077804J205139J239548J662293J480865J052399
773.5F54504471J899338K914657L791123L087310J979523K147675K701492K462692
781.2F75488281K179337J062469M06418J373444K010803L324814K423630J483230K284088
789.9F92036514J723252N18951m82178L26844L30886K36054J364746K768478L514099
798.5G02337646J962433J082688J179580P31965r26667r21859l19367L34091K393952
807.2G07854462K318420J864014j22376j213608N9128m01382l62168n71289j422805
$$ y = [665974274, 665969391, 665582962, 663678665, 662313843, 660904007, 659926529, 658348770, 656011429, 655979462, 654876633, 653777084, 653851624, 651649475, 648695679, 646759949, 645776291, 644887772, 644421616, 644720993, 645507126, 646786423, 647864227, 649069366, 650308914, 651971207, 653452072, 654504471, 656403809, 659318466, 663109589, 666196899, 668176422, 670324097, 673025589, 675488281, 677667618, 678730087, 679136505, 680509949, 682520752, 685845566, 688269196, 689752426, 692036514, 693759766, 694278717, 693796539, 694123383, 694454269, 694690323, 696055069, 698823547, 702337646, 704300079, 705382767, 706562347, 707294312, 706367645, 705445786, 705126419, 705460510, 707854462, 710172882, 712036896, 711914520, 710700912, 710760040, 710358658, 709996490, 709425201, 708002396]
815.9G08002396q44803Q97674J118317O56433J070099R8190j403274j415940n52826
824.6G07626266j214904j780396j061630j14212m69971p46155M28925o61697k225571
833.3F99780655k700348j850739j322402k294007j236954k28118q66623q60215P92618
841.9F89213867k29873k785111k051773j743393j916351j681900j068955m34646o37207
850.6F76664658m01688m48456j008987j963120k130584k049637k316666j957703j829452
859.3F62558365j367645L29589J988068K563019K672348J619186J025696K292938J949387
868F75630951K091904L768463N064773M612732L137589L385010K544555J143494O31180
876.7G02010651J283722O35986k16675R38034J29471l02887p84607j558075j197510
$$ y = [708002396, 707157593, 708055267, 709173584, 709830017, 710900116, 710998306, 709595032, 708179092, 707626266, 706411362, 704630966, 703569336, 703455124, 702985153, 702238998, 702667923, 702006226, 699780655, 697080307, 695229568, 693907166, 691613159, 690376205, 690148087, 689281464, 688421249, 689213867, 688983994, 686198883, 684147110, 682403717, 680487366, 678805466, 677736511, 677301865, 676664658, 676262970, 675814514, 674805527, 672842407, 670711823, 668662186, 666345520, 664387817, 662558365, 661190720, 661520309, 663508377, 666071396, 668743744, 670362930, 671388626, 673681564, 675630951, 677722855, 681491318, 686556091, 691168823, 694306412, 697691422, 700235977, 701379471, 702010651, 703294373, 703930359, 703713684, 704651718, 704781189, 704478302, 703693695, 702135620, 700938110]
885.3G00938110k238235m015808l104782j234742k027435j833877j277314k049331
893F83156586j518860n66330j359253k786102k977677l266830k305908r46198j316681
901.7F66112747j551285j319809j333007k127457k620697k888870l303528k950821
909.4F48017273l164749l470230k775421k426796k631340l588410m136162l456802
917.2F22367363l558159l744926k868119j399574j053200j030044l43476o9274k87400
925.8F08013191n00488L02925K58293k03819p15790n23071J101761J480369J627617
934.5F10840988J203194J276054J373978K36473M88090P41539J040764J700020K210732
943.2F21111832K180710P49206k54707p27845j692619l032608l296471k812385l495941
$$ y = [700938110, 698699875, 694684067, 691579285, 690344543, 688317108, 686483231, 685205917, 683156586, 681637726, 681071396, 679712143, 676926041, 673948364, 670681534, 668375626, 667429428, 666112747, 664561462, 663241653, 661908646, 659781189, 657160492, 654271622, 650968094, 648017273, 644852524, 641382294, 638606873, 636180077, 633548737, 629960327, 625824165, 622367363, 618809204, 615064278, 612196159, 610796585, 609743385, 608713341, 608369865, 608300591, 608013191, 607512703, 607815628, 608073921, 607870102, 607154312, 606631241, 607733002, 609213371, 610840988, 612044182, 613320236, 614694214, 614930687, 615418777, 616160316, 617201080, 618901100, 621111832, 623292542, 624041748, 623787041, 623059196, 621366577, 618333969, 615037498, 612225113, 608729172]
951.9F08729172l912964m001198m186783m358787m343682n039024n849876n930901
959.6E71105957o205101o108246o138305n765687o176376n448952n093612o596794
967.3E23572884o811982p517814o877861p128830p588158p425308p109985o180649
975D66932297o745987n887757o243133n627480o068077o328430m214859m958992m064560
983.7D16793022l467369k931518k225876j146317q66279j184769o39725j817703j147766
992.4D01365700j225472J88980O70815L60145J043358j78642O58608J6746P89795L34740
1002D04024773j29204M66118J8692J345176o04171N33905L11355o17637N66826r35288
1011.7D04980545r74235j451989J32828J87531J90239R1743k56767J287155Q54111
$$ y = [608729172, 604816208, 600815010, 596628227, 592269440, 587925758, 582886734, 577036858, 571105957, 564900856, 558792610, 552654305, 546888618, 540712242, 535263290, 530169678, 523572884, 516760902, 509243088, 502365227, 495236397, 487648239, 480222931, 473112946, 466932297, 460186310, 454298553, 448055420, 442427940, 436359863, 430031433, 425816574, 420857582, 416793022, 413325653, 410394135, 408168259, 407021942, 406155663, 404970894, 404331169, 402513466, 401365700, 400140228, 400329208, 401000023, 401360168, 402403526, 402224884, 402883492, 402900238, 403690033, 404024773, 403895569, 404361687, 404380379, 405725555, 405121384, 405655289, 405966644, 405349007, 405915833, 404980545, 404006310, 402554321, 402687149, 402874680, 403064919, 403156662, 402899895, 404187050, 405041161]
1020.3D05041161J972274L26882M68902J038247O41212J463852N32226J674576R59168
1029D14118500J949463J631927Q63876J652260R46579J071663j57432J228675J50834
1037.7D23456345j8197K43073o03676Q15163p08313O79359l90014n14985L69721n52368
1047.4D22776108R97772N05829J175384O48232J846886J579399J124458K679481K345620
1056D35679169K738800J021080K932472L103523L309975L996010J846008L564453L618965
1064.7D61810455L626290K636375J311798K251k86179l94973l534356l426361m253120
1073.4D57492180l794975l162842k515412j327934j466560J072426q4649P32575O37398
1082.1D47582207R88807K467270O94199J458168J751556K960587Q13255J189232K985115
$$ y = [405041161, 407013435, 407340317, 407809219, 408847466, 409488678, 410952530, 411484756, 413159332, 414118500, 416067963, 417699890, 418563766, 420216026, 421162605, 422234268, 422076836, 423305511, 423456345, 423438148, 423681221, 423077545, 423892708, 423184395, 423863754, 423473740, 422958755, 423328476, 422776108, 423773880, 424279709, 425455093, 426103325, 427950211, 429529610, 430654068, 433333549, 435679169, 438417969, 439439049, 442371521, 445475044, 448785019, 452781029, 454627037, 458191490, 461810455, 465436745, 468073120, 469384918, 469387169, 469100990, 468706017, 465171661, 461745300, 457492180, 453697205, 450534363, 448018951, 446691017, 445224457, 446296883, 446212234, 446944809, 447582207, 448571014, 451038284, 451732483, 453190651, 454942207, 457902794, 458716049, 459905281, 462890396]
1090.7D62890396K005882L593941K781220K130127P42836J297988J528130O65512J135521
1099.4D78771553L51181J116982k24114p67746j68877K011948J620979j470756J94664
1108.1D81435814Q96187J725349J431923K490845K369232J045990K660027J519584
1115.8D95574951J686249Q75015Q96149J018829K79541J427422R26933J779747J504517
1124.5E05969353J137275L62015J58425O80389M58755J772233J293945K293510K309914
1133.2E16435814J789818J089477r2354L91198j102829r72329j355857j609154k171250
1141.9E12402534k811393j354218j753120j302948k694054k533455j917801k490577
1149.6D95544968k143326k107811k3079j496849m90074O63566l32870K55661r40209
$$ y = [462890396, 464896278, 468490219, 471271439, 473401566, 474144402, 475442390, 476970520, 477636032, 478771553, 479122734, 480239716, 480015602, 479247856, 479078979, 481090927, 482711906, 481241150, 481435814, 482332001, 484057350, 485489273, 487980118, 490349350, 491395340, 494055367, 495574951, 497261200, 498136215, 499032364, 500051193, 500330734, 501758156, 502685089, 504464836, 505969353, 507106628, 507468643, 507627068, 508307457, 508766212, 510538445, 511832390, 514125900, 516435814, 518225632, 519315109, 519222755, 519613953, 518511124, 517538795, 516182938, 514573784, 512402534, 509591141, 508236923, 506483803, 505180855, 502486801, 499953346, 498035545, 495544968, 493401642, 491293831, 491270752, 489773903, 489283829, 489947395, 489614525, 489870186, 488929977]
1158.3D88929977L80478Q14057N80024N65873J804199K646866K108802L371048L351975
1166.9E04553299L616486K833442L511849M556884M214707M000206M048920N558967
1174.6E36894760M961434N280609N453453M884872M714012L959313L818969L460312
1182.4E73427734L868103M352341M742241L809662L291473L747368L011627K546425
1190.1F02796974J773338J245041O16646O01273J346550J366615J479607J340103J014213
1198.8F13580360N1766k39487M01650M56543R8228k12097N57785J359825J520577J320419
1208.4F18895569J587372J364479N75523J000328Q44650R01757J646499J873398J590386
1217.1F30279961J093521J542129J673394M88586n5618O7253m03099m36440k65922
$$ y = [488929977, 489310455, 490124512, 490704536, 491270409, 493074608, 495721474, 497830276, 501201324, 504553299, 508169785, 511003227, 514515076, 519071960, 523286667, 527286873, 531335793, 536894760, 541856194, 547136803, 552590256, 557475128, 562189140, 566148453, 569967422, 573427734, 577295837, 581648178, 586390419, 590200081, 593491554, 597238922, 600250549, 602796974, 604570312, 605815353, 606431999, 607033272, 608379822, 609746437, 611226044, 612566147, 613580360, 613632126, 613392639, 613794289, 614250832, 614349060, 614136963, 614694748, 616054573, 617575150, 618895569, 620482941, 621847420, 622422943, 623423271, 624267921, 625169678, 626816177, 628689575, 630279961, 631373482, 632915611, 634589005, 635077591, 635021973, 635089226, 634686127, 634249687, 633983765]
1225.8F33983765r6321L52058L65906J2626q58039r26743m91409r64089j070785r64051
1235.4F29342918o01348j15166k58408j31607K00234K24151l73344n03578j1788k13241
1245F27558823n41878l2692P09152P94182J150246J247139N43937K56806L43818J59912
1254.7F32189445Q469K21787M19845M72832N66482Q65174R67216M27361K1286O1226
1264.3F36221123p1907K04544R00612R47036J000748J630440J632080O81305M21905
1273F43567886K60086j83410K39868o5537j62582K83890L50723N50003M32053j80664
1282.7F45092316n29862l1738l05023m85459p4691p3853J27335K22702J65252l20129
1292.3F43786850m54941n33981p26624o51474j071548j103325n52940l1777l00522
$$ y = [633983765, 633887444, 634239502, 634605408, 634618034, 633759995, 632833252, 632341843, 631377754, 630306969, 629342918, 628741570, 628626404, 628367996, 628236389, 628436623, 628660774, 628287430, 627783852, 627772064, 627558823, 627016945, 626984253, 627693405, 628487587, 629637833, 630884972, 631428909, 631685715, 632029533, 632189445, 632197914, 632419701, 632839546, 633312378, 633878860, 634744034, 635711250, 636138611, 636159897, 636221123, 636149216, 636353760, 637254372, 638201408, 639202156, 640832596, 642464676, 643145981, 643567886, 643827972, 643644562, 643884430, 643818893, 643656311, 643940201, 644290924, 644840927, 645272980, 645092316, 644562454, 644530716, 644225693, 643740234, 643665543, 643591690, 643719025, 643941727, 644106979, 643786850, 643331909, 642797928, 642071304, 641419830, 640348282, 639244957, 638692017, 638660240, 638359718]
1301F38359718n66902o31676p65838o27289l90015r53636l300972k370224K84920k43759
1310.6F28794327m35753q0490k40326o23856r68628r48867q03872l32183o90461p60383
1320.3F22909508j37978j52664n48172r19113p99484j043358j694947k083244j986771
1328.9F13543777j269416j180268j400108j232529j290283j045341q69713r93462j306343
1337.6F02956314j192017q33930m37737M43420O59104N86777K90565K55470Q8730K35214
1347.3F03051910p5111o88438j54725N3292K64015K39639K32086k66418m76646L62701
1356.9F02542305j49460o95572q61053p13196o19049r40209m01153K07939M85458J25885
1366.6E98981895K09923n36880o23398L45459j32179M41475k5521k07481P90787J103477
$$ y = [638359718, 637792816, 637161140, 636395302, 635768013, 635377998, 634424362, 631123390, 628753166, 629038086, 628794327, 628358574, 628278084, 628037758, 627413902, 626445274, 625496407, 624692535, 624360352, 623669891, 622909508, 622771530, 622618866, 622070694, 621151581, 620352097, 619308739, 617613792, 615530548, 613543777, 612274361, 611094093, 609693985, 608461456, 607171173, 606125832, 605256119, 604262657, 602956314, 601764297, 600930367, 600492630, 600936050, 601595154, 602181931, 602472496, 602727966, 602816696, 603051910, 602976799, 602288361, 602133636, 602186928, 602450943, 602690582, 602922668, 602656250, 602179604, 602542305, 602392845, 601697273, 600836220, 600123024, 599503975, 598563766, 598162613, 598370552, 598856010, 598981895, 599191818, 598654938, 598031540, 598376999, 598244820, 598686295, 598660774, 598453293, 599244080, 600347557]
1376.2F00347557R10797O2523M25453J66855L06969j68495k10572O97975O62995J867866
1385.8F05069923J742020J133118J378669J272164Q93593P75795P41844N01938k2354
1394.5F13486710j128731O14357N63621l16734j634750n17922P64313q55751r56955
1403.2F10018158o46133j287880n86167K48604K70653o76651q25615j333351q81462
1411.9F04300156n41764o61125m00810o54144l31879j63116L79714k751464K50015
1420.6E99425583J907577K01531m0321j704484L82653J224136L36914J154061O49261
1429.2F03536911R6588J38054R76410J40724J04790R32426l92913j641388J355018
1437.9F05246620K630615P95937M79736P96738M10728Q91152m72183R727k02293n05791
$$ y = [600347557, 601258354, 601320877, 601746330, 601913185, 602220154, 602051659, 601841087, 602539062, 603202057, 605069923, 606811943, 607945061, 609323730, 610595894, 611489487, 612265282, 613007126, 613509064, 613486710, 612357979, 612972336, 613535957, 613219223, 611584473, 611066551, 611830864, 610975113, 610018158, 609372025, 608084145, 607497978, 607746582, 608017235, 607340584, 606514969, 605181618, 604300156, 603758392, 603097267, 602696457, 602042313, 601710434, 601547318, 601927032, 599175568, 599425583, 601333160, 601534691, 601494370, 599789886, 600172539, 601396675, 601733589, 602887650, 603536911, 603633499, 603771553, 604747963, 604888687, 604993477, 605925903, 605532990, 603891602, 605246620, 607877235, 608673172, 609152908, 609949646, 610360374, 611251526, 610779343, 610789070, 610586777, 610080986]
1447.6F10080986n25169Q51974J275978o14891k0637p10106k97356o90765j563492
1456.2F07786522k500458k216949L194122O26144K050896M70810M71535J826782j155891
1464.9F10553513J300506J278954K743683J873893K184716L130607J659088K771035
1472.6F27495995J408767N437813K899170K211609L341370K985534K820587J762162
1480.3F50363007L094406K337494L063430J985779J775894K382431k61764J878204
1488.1F66618881J757889J534805N15213K376175K720185J427459K255936K92053j032257
1496.7F78466339J709595P14950j85546J798095J789398J53504J397705J273651J701584
1505.4F88819275j216736n633926K250824J023788K126083J736680J223983L98484
$$ y = [610080986, 609555817, 610407791, 611683769, 611068878, 611048241, 610338135, 610040779, 609350014, 607786522, 605286064, 603069115, 606263237, 606889381, 608940277, 609411087, 609882622, 611709404, 610553513, 611854019, 613132973, 615876656, 617750549, 619935265, 623065872, 624724960, 627495995, 628904762, 634342575, 637241745, 639453354, 642794724, 645780258, 648600845, 650363007, 653457413, 655794907, 658858337, 660844116, 662620010, 665002441, 664740677, 666618881, 668376770, 669911575, 670426788, 672802963, 675523148, 676950607, 679206543, 679498596, 678466339, 680175934, 680890884, 680705338, 682503433, 684292831, 684446335, 685844040, 687117691, 688819275, 687602539, 681968613, 684219437, 685243225, 687369308, 689105988, 690329971, 690728455]
1513.1F90728455J725387R87473L4027J02463k861329L372727K180328j984405l474198
1521.8F90810928J396714M767761J470260q98590P32880J902084o50634M23202J765671
1530.5G01720276L10211J208038k603759j758194L036041J481018J902771J731415
1538.2G07027817j272888p922745M717941J053314r37805K450791j70136O17676K387619
1546.9G07951584J701126O55289r06449r92279J176377J197052L54690k742691j7624
1555.6G08377075L691101J998368n188294k269668n01175L881149J719437J090698
1563.3G12798691k9679j405105O57959J098480Q94013o45295m156494J222916J503296
1572G11938782j70059l45002M78363j223068n463943J980209J517334l17001n64118
$$ y = [690728455, 692453842, 693441315, 693475342, 693577805, 690716476, 694089203, 696269531, 694285126, 690810928, 692207642, 696975403, 698445663, 697547073, 698279953, 700182037, 699531403, 699954605, 701720276, 702030487, 703238525, 700634766, 698876572, 701912613, 703393631, 705296402, 707027817, 705754929, 697832184, 702550125, 703603439, 702665634, 705116425, 704946289, 705563965, 707951584, 709652710, 710307999, 709401550, 708409271, 709585648, 710782700, 711137390, 708394699, 708377075, 712068176, 714066544, 708878250, 706608582, 706107407, 709988556, 711707993, 712798691, 712769012, 711363907, 712021866, 713120346, 714014359, 713369064, 709212570, 710435486, 711938782, 711768723, 711423721, 711902084, 710679016, 705215073, 707195282, 708712616, 708395615, 707831497]
1580.6G07831497q15048j055832r98077n38254j183548j278992n06286q63038j031570
1589.3F99560852j338959r35287j238709j359481j614457j611328r33075j645660j191025
1598F87692871j462631j165161j542664j796875j148224j736145j390304j904984j375809
1606.7F74170074j750183j230468j625901k365951o06003j821060j565781k124328
1614.4F61080399o95878j207122q261414J029892L9597n05524j615753n04837j405640
1623.1F47953720m236603K75269m62036N5999k956924k131081q9073q62961m89311
1631.7F37056999j128654O90384M39262n382233j549453J581802P32231P13158P83462
1640.4F33936958p8201Q79555n15175J192932J676102k139969o82602l28178K984771
$$ y = [707831497, 707016449, 705960617, 704962540, 704424286, 703240738, 701961746, 701455460, 700592422, 699560852, 698221893, 697286606, 696047897, 694688416, 693073959, 691462631, 690529556, 688883896, 687692871, 686230240, 685065079, 683522415, 681725540, 680577316, 678841171, 677450867, 675545883, 674170074, 672419891, 671189423, 669563522, 667197571, 666591568, 664770508, 663204727, 661080399, 660384521, 659177399, 650915985, 651945877, 651985474, 651479950, 649864197, 649359360, 647953720, 643717117, 643992386, 643530350, 643586349, 640629425, 638498344, 638409271, 637546310, 637056999, 635928345, 636618729, 637057991, 631675758, 630126305, 631708107, 632440338, 633153496, 633936958, 633858757, 634738312, 634223137, 635416069, 637092171, 634952202, 634269600, 633941422, 636926193]
1649.1F36926193K186814K445144K323303k802352m849244L284340L476982J685257
1656.8F44676437J406021J325455J789322J302567J201782P92618o3782K446442J428451
1665.5F56305313J576614J998826J284637o46896J063690K780456J246415K929306
1673.2F68538361L067245P74078k7313K998657K940827J891556J512222R53598L730621
1681.9F86379852L624344j021271k583313M781418M982300K624283J611328K495651
1689.6G02894592J951371K625579K675782J974563K568970K234268l086777K345887
1697.3G16184235L705902L864135j381149l557052N863800L772659J738892L28750
1705G30520172R51538J05820J305160J987153M67987k98615Q92792J502228J406631
$$ y = [636926193, 639113007, 641558151, 643881454, 641079102, 636229858, 639514198, 642991180, 644676437, 646082458, 647407913, 649197235, 650499802, 651701584, 652494202, 652430420, 654876862, 656305313, 657881927, 659880753, 661165390, 660518494, 661582184, 664362640, 665609055, 668538361, 671605606, 672379684, 672352371, 675351028, 678291855, 680183411, 681695633, 682649231, 686379852, 690004196, 688982925, 686399612, 691181030, 696163330, 698787613, 700398941, 702894592, 704845963, 707471542, 710147324, 712121887, 714690857, 716925125, 713838348, 716184235, 719890137, 723754272, 722373123, 718816071, 724679871, 728452530, 730191422, 730520172, 731471710, 731577530, 732882690, 734869843, 735337830, 735039215, 735932007, 737434235, 738840866]
1713.7G38840866j34888n73959K429504R9869n475769L224335K786789J235046L96805
1722.4G42828598N6076J00403J105957J008453j2741J82266M22898j146240j87378
1731.1G44358292K510528J960068k755737l678513L310776K674942N87540J167602
1738.8G50135498q04214j607895K144699R31778l62549O45752J977234J222763O20880
1747.5G54903946P81250r5902J835404j069641l60947L299942J931305J484070J195831
1756.2G63905258p13882R09805J693192J468429J848679j173249k71911J861038P91473
1764.8G70318832Q98133J367798R87167j308060J763153K649689o81229k332306o49108
1773.5G73014069L534240J636658j212540J079789J138992J195145m2344p02743N72662
$$ y = [738840866, 738705978, 738132019, 740561523, 740661392, 735185623, 738409958, 741196747, 742431793, 742828598, 742884674, 742985077, 744091034, 745099487, 745086746, 745269012, 745691910, 744545670, 744358292, 746868820, 748828888, 746073151, 742394638, 745705414, 748380356, 748967896, 750135498, 749331284, 747723389, 749868088, 750799866, 750437317, 751083069, 753060303, 754283066, 754903946, 755685196, 755589294, 757424698, 756355057, 755994110, 759294052, 761225357, 762709427, 763905258, 763191376, 764101181, 765794373, 767262802, 769111481, 767938232, 767666321, 769527359, 770318832, 771216965, 772584763, 773571930, 772263870, 774027023, 776676712, 775995483, 773663177, 773014069, 776548309, 778184967, 776972427, 778052216, 779191208, 780386353, 780344009, 779641266, 780213928]
1782.2G80213928R25904N73120j032791J7242J179581O64901K75879Q26645m9972m90113
1791.8G83104324j327972J67847K550888J39312n51757J010894R49097l32565j082154
1800.5G84627914J276856O103O50101J335449j33590m8752J6403J39923M33426K63901
1810.2G88567734p85828P24030R71298K65274O93436K7160J37787n50461j0071J90430
1819.8G90230789k7695R40323o9885Q73184N34439k266311J86767J584473J124649
1828.5G93110733p49969k772446O08139J848450M32281K05917O46286N25971j78986
1837.2G93676376o35833N05523n5694K18506r3384L47824O3095l464966K191162J960678
1846.8G94713287k7542k35595J30081J47476o28891L43704L39203J51596j85852j38016
$$ y = [780213928, 781139832, 781712952, 780680161, 780697403, 781876984, 782541885, 782817764, 783644409, 783594437, 783104324, 781776352, 781944199, 784495087, 784634399, 784082642, 785093536, 786042633, 785710068, 784627914, 785904770, 785910873, 786560974, 787896423, 787762833, 787714081, 787730484, 787870407, 788303833, 788567734, 787781906, 788505936, 789477234, 789742508, 790435944, 790463104, 790600891, 790050430, 790040359, 790230789, 790203094, 791143417, 791073532, 791946716, 792481155, 790214844, 790401611, 791986084, 793110733, 792360764, 789588318, 790196457, 792044907, 792477188, 792683105, 793329391, 793855362, 793676376, 793040543, 793546066, 793490372, 793708878, 793615494, 793963318, 794026413, 790561447, 792752609, 794713287, 794685745, 794450150, 794580231, 794727707, 794098816, 794442520, 794781723, 794933319, 794747467, 794609451]
1856.4G94609451N94330J98288Q4686l10211L6621l93142j450M66614j55106K05765
1866.1G95335846j78528M40903r54819r04388J197128N08423K44217J09405J82266
1874.8G95980453j84097J70136L56140K94418K59857n57327j56860J1673M59366R91
1884.4G96634750j25045N50842j3580O51550j03913j140594N26733N53284m0131J77994
1894.1G97671890m31213q70590O72455M74548k6322K23313J52893q8654J15738L26691
1903.7G98220749m51660j10169n2795p2022L84140N23911J39465k49176O02417k10266
1913.3G98724594n39169m66385K24533Q83255k015762n08118J376724R20792K62680
1922G98863144j067505k48718P36770L42102m42886j26114o180M41819N21392j48544
$$ y = [794609451, 795203781, 795402069, 795486755, 795176544, 795213165, 794820023, 794818573, 795285187, 795130081, 795335846, 795157318, 795598221, 794643402, 793739014, 794936142, 795444565, 795688782, 795798187, 795980453, 795796356, 795966492, 796322632, 796617050, 796876907, 796319580, 796162720, 796174393, 796633759, 796634750, 796509705, 797060547, 797046967, 797698517, 797594604, 796454010, 796980743, 797534027, 797493896, 797671890, 797240677, 796370087, 797042542, 797517090, 797490768, 797714081, 797866974, 797778320, 797894058, 798220749, 797769089, 797658920, 797606125, 797534103, 797918243, 798442154, 798581619, 798332443, 798934860, 798724594, 798185425, 797719040, 797943573, 798826828, 796811066, 796302948, 797679672, 798600464, 798863144, 797795639, 797546921, 798283691, 798625793, 798182907, 798056793, 798050613, 798492432, 799013824, 798865280]
1931.7G98865280J20163j52359K23847k61460m55932p477j67084L68042K45743O98013
1941.3G99476776l04947j130371O12564M57764k49710m98657N7602J6098K6702j61590
1951G98302231L738Q33969M27246j50299n18417M3030r8496k8000L19291k28424Q1787
1961.6G98987656J40838K93350k79769j6098L68347o23856J32599K32849l4485j18408
1971.2G99083023L24555N60989r2392N8975j88904l30429j79519J00326N0888k1667
1980.8G99365845J25732l2501L15628J86615J38473J9379p3471m24042o15616M77829
1990.5G99483871P3090p24487J61819O40030Q7662R9335J75247n82276l54995j85013
2000.1G98874283K17590K25220l09982K2888K25448K09427j0528j53504m89883k95181
$$ y = [798865280, 798985443, 798833084, 799056931, 798795471, 798339539, 798332062, 798164978, 798533020, 798778763, 799476776, 799171829, 798041458, 798654022, 799111786, 798862076, 798363419, 798421021, 798437119, 798463821, 798302231, 798305969, 799139938, 799567184, 799416885, 798898468, 798941498, 798843002, 798815002, 799134293, 798905869, 798987656, 799128494, 799421844, 799142075, 799125977, 799494324, 798870468, 799003067, 799235916, 799201431, 799083023, 799407578, 799968567, 799876175, 799935150, 799746246, 799415817, 799236298, 799336624, 799387512, 799365845, 799491577, 799459076, 799774704, 799961319, 800099792, 800119171, 800045700, 799621658, 799006042, 799483871, 799556961, 798832474, 798994293, 799634323, 799721985, 799821320, 799996567, 799414291, 799059296, 798874283, 799091873, 799317093, 799007111, 799029999, 799255447, 799464874, 799454346, 799300842, 798810959, 798515778]
2009.8G98515778k06681m7073M03824k24152L4332j2283j80282P2937k92969m3335
2019.4G98020096o6071k07138k99682j93940M3641L84979J71890m00391N7755J4954
2029.1G97526093k13776l15781m03824m42886k01340J61972L3265K59170r2850j88903
2038.7G96121140q5373O0501m0284p96813k12479m4632q1329j3733K98538M36478k57035
2049.3G95384979J70822J46943j11619k97088k78168j22681k66494J53885J07421N61219
2059G95449219K74887m13284l39356k66876J51672j66931O1493M93088N03235k6474
2068.6G95720673l85743J98365j374o9046k31018j57623J450j72120J02540J80282
2078.2G95186386K67716J9531R6130J81427P3319K2583j79901k64740m43726K25525
$$ y = [798515778, 798309097, 798262024, 798665848, 798441696, 798476028, 798463745, 798283463, 798356400, 798063431, 798020096, 797954025, 797746887, 797447205, 797253265, 797296906, 797681885, 797853775, 797453384, 797511139, 797526093, 797312317, 796996536, 796592712, 796149826, 795948486, 796110458, 796143723, 796402893, 796310043, 796121140, 796035767, 796096268, 796055984, 795259171, 795046692, 795002060, 794920731, 794906998, 795205536, 795642014, 795384979, 795555801, 795702744, 795591125, 795294037, 795015869, 794893188, 794626694, 794780579, 794888000, 795449219, 795724106, 795310822, 794971466, 794704590, 794856262, 794689331, 794750824, 795243912, 795747147, 795720673, 795334930, 795533295, 795531921, 795462875, 795231857, 795074234, 795075684, 794903564, 795006104, 795186386, 795454102, 795473633, 795569763, 795751190, 795824509, 795847092, 795667191, 795402451, 794958725, 795184250]
2087.9G95184250O24695L25927p8430m1351j0834m11758J9378K823Q3084K67182M1961
2098.5G96006927N8365K44828R7885m47083L47443J58768m30756J22147L19824M64248
2108.1G96942596L8834M273k80915o19049k95257K11258M56771q0871O103L3875L15246
2118.7G96732864L11661L6469K10266k23007l12500j02234J39084n29023m55780L40882
2128.4G96148682M80651O40564j06353K01416Q3618n69458k77100k58331Q1482l2578
2138G96392593K53220N22003K01264m00620k92511L81622l50875l57438K16294K49786
2147.7G96815338k58865q7738N72204M33426M41590l48587j68763J70746l44543j34125
2157.3G97090683r5978J2818k8840L98407O98090K78244m09393l73917L61176L8528
$$ y = [795184250, 795808945, 796134872, 796056442, 796015091, 796004257, 795592499, 795611877, 795614700, 795697784, 795964966, 796006927, 796065292, 796310120, 796408005, 795960922, 796308365, 796467133, 796036377, 796158524, 796478348, 796942596, 796981430, 796985703, 796704788, 796085739, 795790482, 796001740, 796458511, 796377640, 796383743, 796417618, 796732864, 797044525, 797080994, 797291260, 797068253, 796755753, 796653519, 796792603, 796263580, 795807800, 796148682, 796629333, 797269897, 797163544, 797364960, 797448578, 796879120, 796602020, 796343689, 796425171, 796392593, 796645813, 797167816, 797369080, 796968460, 796675949, 797057571, 796706696, 796349258, 796565552, 796815338, 796556473, 796468735, 797040939, 797474365, 797915955, 797567368, 797398605, 797569351, 797224808, 797090683, 796994705, 797007523, 796978683, 797377090, 798075180, 798353424, 797944031, 797570114, 797931290, 797969818]
2167G97969818n1803J068J72195J58386M32968R02329J45492q3389k98309k6474Q9340
2177.6G99411621l11661k09655k80991K04315M21982P30591O99157K90757j57624m66384
2187.2H00332108P9193k47498l11661R5215O57273N88912q2702J64261J09482K00424
2196.9H01585007j21002k38114r537k22931J4344L07464O23703N69992M01383k27661
2206.5H02682648k35138k40937o89544R9335Q5372K8611l7918K26821J035004N46341
2216.1H03500595k1744j57852K07596j21002n00717l28370J27945O39878J90353K63062
2225.8H03799744K74582K05764r155k42615j76391m15421L815J1978J08871K61918
2235.4H03823090L82919M03213k4643J42060j07269j63804l63159l15399L0136k07825
$$ y = [797969818, 797918015, 797919083, 798091278, 798249664, 798682632, 799584961, 799730453, 799647064, 799348755, 799322281, 799411621, 799099960, 798890305, 798609314, 798813629, 799235611, 799966202, 800665359, 800956116, 800798492, 800332108, 800411301, 800163803, 799852142, 799947357, 800604630, 801193542, 801110840, 801275101, 801384583, 801585007, 801464005, 801225891, 801216354, 800993423, 801007767, 801315231, 801938934, 802508926, 802910309, 802682648, 802447510, 802206573, 801517029, 801616364, 801701736, 801730347, 801692429, 801919250, 802954254, 803500595, 803478851, 803320999, 803528595, 803407593, 802906876, 802578506, 802706451, 803346329, 803536682, 803799744, 804074326, 804280090, 804270935, 804028320, 803851929, 803436508, 803440323, 803452301, 803561172, 803823090, 804206009, 804609222, 804584579, 804726639, 804619370, 804455566, 804092407, 803777008, 803807144, 803599319]
2245.1H03599319J40534O92139O54754k22091p4387P6904l24173k43683m12292Q39
2254.7H03887863K96555P21512M10995j27335l0670k85644l75901m98275L47671J94092
2264.4H04540863r7580L91846J22452L96270J58768J58920K5788k93351l39279l43780
2274H04720917J73950J72119K71530l12347j75095N20172L47901K51770m4785J47019
2283.7H06073151m08020o04935j45874L7079M43802N59158N34821l7003j83334n83802
2293.3H05685043k25296L12348n03388l58276j32904O05774M06494j3123K73896l72086
2302.9H05678482l84674m86603L5553j25885l71704M91104M96750K86179m06723k20337
2312.6H04992142k37122N5008L32871p32804j44653O2256L03650O45294m36554n99442
$$ y = [803599319, 803739853, 804431992, 805086746, 804864655, 804790268, 804867172, 804542999, 804299316, 803887024, 803887863, 804184418, 804905930, 805316925, 805189590, 805158920, 804873276, 804497375, 803999100, 804346771, 804540863, 804443283, 804835129, 804957581, 805353851, 805512619, 805671539, 805697327, 805403976, 805064697, 804720917, 804894867, 805066986, 805338516, 805026169, 804851074, 805371246, 805719147, 805970917, 805926132, 806073151, 805665131, 805060196, 804914322, 804951401, 805395203, 805954361, 806489182, 806452179, 806268845, 805685043, 805459747, 805772095, 805268707, 804910431, 804777527, 805383301, 805789795, 805776672, 806050568, 805678482, 805293808, 804807205, 804842758, 804716873, 804345169, 804836273, 805333023, 805619202, 805212479, 804992142, 804755020, 804810028, 805142899, 804410095, 804265442, 804327698, 804631348, 805276642, 804840088, 804240646]
2322.2H04240646K8916M15344N64194k40174j085662L67279P36770k59933j98899j12609
2331.9H04455872k90833l75595N34058M94155j73873n75562k65274J21078K17591N49698
2341.5H04691315l65448n52292n80139n2109K16751n23605J69067J071396Q98437j002044
2351.2H03971329j153107J24741O75964j61209j336289L00217r39636J24130J147156
2359.8H02753296j207504m77829N45349J461868j2436k57950J53275o2866l87497j841050
2369.5H00666656r09576L63464N18265M21143P58285L31726N1575r155o40030k62070
2379.1H01290283q1329K49023n1574j41602L48434J10245L30124j11618k16217j92566
2388.8H01533203n60226l79715k20413K36511J33133M15191K70462m31289k70768k77252
$$ y = [804240646, 804269562, 804684906, 805249100, 805008926, 803923264, 804290543, 805027313, 804767380, 804568481, 804455872, 804165039, 803789444, 804323502, 804817657, 804643784, 804068222, 803802948, 803924026, 804141617, 804691315, 804325867, 803773575, 803193436, 803141327, 803358078, 802834473, 803003540, 804074936, 804973373, 803971329, 802818222, 802942963, 803618927, 803457718, 802121429, 802421646, 801482010, 801606140, 802753296, 801545792, 801067963, 801613312, 803075180, 803062744, 802804794, 802958069, 802895203, 802507706, 800666656, 799757080, 800120544, 800638809, 801059952, 801818237, 802149963, 802201538, 802192383, 801552353, 801290283, 801208954, 801457977, 801406403, 801264801, 801613235, 801723480, 802053604, 801941986, 801725769, 801533203, 800972977, 800593262, 800372849, 800609360, 800742493, 801157684, 801428146, 800996857, 800726089, 800448837]
2398.4H00448837j71737m12064j66168K39029l17536m18701K70386M02222j86615q9188
2408.1G99598465N6839j17798m53720l81546k41928k64969K97775O1722O027L9215
2417.7G98600082k40936k83966n52673j39313j76392o14624l11813M12827M18930k94648
2427.3G96817474l44162j99813j08338k22931k43225k06756l82615l15017j45493M8676
2437G94697800J15890N6687k87323m42429n52597l24936N8136k03781k41318k33764
2446.6G92642365J1825j50299j24588m5013n07737J53656P2403l33404k52533k91138
2456.3G91175537l75671l14408J69983k85568m1046L35312R6435o9732l02735n8670
2465.9G90329437o13861m48303j57394l28980L6697n7067j8921R6512K68249k68631
$$ y = [800448837, 800277100, 799865036, 799698868, 799937897, 799620361, 799201660, 799472046, 799874268, 799687653, 799598465, 799655304, 799537506, 799083786, 798702240, 798460312, 798195343, 798493118, 798554840, 798560867, 798600082, 798359146, 798075180, 797522507, 797383194, 797206802, 796592178, 796280365, 796693192, 797112122, 796817474, 796473312, 796273499, 796165161, 795942230, 795699005, 795492249, 795109634, 794794617, 794649124, 794697800, 794813690, 794870377, 794583054, 794140625, 793588028, 793263092, 793321228, 793117447, 792876129, 792642365, 792654190, 792503891, 792379303, 792334290, 791826553, 791980209, 792052612, 791719208, 791466675, 791175537, 790799866, 790485458, 790655441, 790369873, 790328827, 790664139, 790760574, 790690842, 790388107, 790329437, 789715576, 789267273, 789109879, 788780899, 788817596, 788760529, 788741608, 788838120, 789106369, 788837738]
2475.6G88837738o33469n40313m42658r0713m12369K9831J04446m57306j17263L19137
2485.2G86597061j4267l21350k9220n91355m01077o2332j46103J56402p6065O2256
2494.8G85173950P6904L47291Q8272n08347n75027n59159J85013j72729m68369j16424
2504.5G83471375J27639O23551L23944k18888n78918k60849l2959l26996l80554j70593
2514.1G82576752R5062Q240K9220K39106K71987l70178n64422m32511m88357k17743
2523.8G81147156j98364L17993K55203Q011j00022n48477j9989l7536m60587o42929
2533.4G79720459m73175k9831j831N9051J28632K87933j18713n86472m48608k51388
2543.1G78286057m42124m86374j48697r2773K30942M2801j72348j30539k04697j52817
$$ y = [788837738, 788204269, 787663956, 787221298, 787130585, 786718216, 786748047, 786852493, 786395187, 786277924, 786597061, 786582794, 786261444, 786232224, 785640869, 785239792, 785177460, 785031357, 785187759, 785111694, 785173950, 785250854, 785598145, 785686417, 785178070, 784603043, 784043884, 784228897, 784056168, 783587799, 783471375, 783599014, 784222565, 784546509, 784327621, 783748703, 783487854, 783454895, 783127899, 782747345, 782576752, 782671814, 782680054, 782709274, 782948380, 783220367, 782850189, 782285767, 781853256, 781364899, 781147156, 780948792, 781266785, 781521988, 781529999, 781429977, 780881500, 780861511, 780823975, 780363388, 779720459, 779247284, 779217453, 779215622, 779274673, 779403305, 779691238, 779572525, 778986053, 778537445, 778286057, 777843933, 777357559, 777208862, 777116089, 777347031, 777389832, 777217484, 777086945, 776882248, 776729431]
2552.7G76729431n80597o82144p32040m0741M45404K6550L06320J56937j68991j12763
2562.4G75347366p8582p37992q65097j67084j2435m2954l82309J75858K73742j57242
2572G73353271J9532l41263m01001n97076n17731l73459j80130L26691J73797J60523
2581.6G71623154M5776k39410o56891p19223n55344n15213k02942N1422K52457K29416
2591.3G69313202N84717K74048l54996m24500m82025k82974m65164o1188J24283n0736
2600.9G68174667n3787j03607J58997k70920l53089p14264q56018k21252J71661L22800
2610.6G66255188m11453l66211j98822Q087K46353l42560n75027p15561j00556m6081
2620.2G63753357n00259n2262P4997l09448m78439k46125l28216l81546n18723l66745
$$ y = [776729431, 776148834, 775466690, 774734650, 774693909, 775139313, 775165863, 775472183, 775629120, 775460129, 775347366, 775268784, 774530792, 773665695, 773498611, 773486176, 773443222, 773060913, 773236771, 773510513, 773353271, 773372803, 773031540, 772630539, 772033463, 771515732, 771142273, 770962143, 771288834, 771462631, 771623154, 771668930, 771429520, 770772629, 770053406, 769498062, 768982849, 768779907, 768831329, 769083786, 769313202, 769897919, 770171967, 769816971, 769392471, 768910446, 768627472, 768162308, 768101120, 768225403, 768174667, 768120880, 768017273, 768176270, 767905350, 767552261, 766837997, 765981979, 765760727, 765932388, 766255188, 765843735, 765477524, 765278702, 765286789, 765533142, 765190582, 764615555, 763899994, 763799438, 763753357, 763253098, 763200836, 763275833, 762966385, 762487946, 762241821, 761913605, 761532059, 761013336, 760646591]
2629.9G60646591m37469p34787L4866L44162j11160p37915l22266M0665m81568p01904
2639.5G57539215q85162k66190k23694K7085M05273l43399m17633n15518p85523q63113
2649.1G53671341j67008k5253l43246K35061l07617p68814m07867J2054l2272m54712
2658.8G51411667o11420n55115q1558k87094k41394p4844n37186l78113K2049j27411
2668.4G48539581n11398k23999k38419m97970l70941l0671J09864m38767l65600k39945
2678.1G45731735n71136n97229j53733o6680l20740M1199j4191j19324j50604m10843
2687.7G43368454p04269n93720n6534k69241k58637l25622n83038l58887O3095J88904
2697.4G40470505l58887k38113k36130n80673m65775m30450n89447k92130J16577l79867
$$ y = [760646591, 760209122, 759474335, 759509201, 759853363, 759742203, 759004288, 758682022, 758722687, 758241119, 757539215, 756654053, 756387863, 756164169, 756191254, 756596527, 756253128, 755835495, 755319977, 754534454, 753671341, 753504333, 753479080, 753135834, 753370895, 753063278, 752294464, 751886597, 751898651, 751866379, 751411667, 750800247, 750245132, 750163574, 749876480, 749635086, 749560242, 749023056, 748644943, 748666992, 748539581, 748028183, 747804184, 747565765, 747067795, 746696854, 746666183, 746776047, 746337280, 745971680, 745731735, 745160599, 744563370, 744409637, 744342957, 744022217, 744063416, 744049225, 743929901, 743779297, 743368454, 742664185, 742070465, 742013931, 741744690, 741486053, 741160431, 740577393, 740218506, 740281601, 740470505, 740111618, 739873505, 739637375, 739056702, 738590927, 738160477, 737571030, 737278900, 737395477, 737015610]
2707G37015610j57624l0975m93851o24313q77075n35813l07235m1580l5859k41851
2716.6G33669434Q4076k2049m44184p36465m31214l89709l19138K14310l0136m12827
2726.3G31182098j64337q8577k62528K90299o0501p26700n04379p07321m65622N8822
2735.9G28551254J41068n39627o19660P6676q0872J6632J09711k42767n46799l83606
2745.6G26482010k35596j81961O5613j03302K05383j30310q97369p60727j91116J44805
2755.2G24397430m63790k00501K13852j29852n2872j80206l07923j86386j51443m25110
2764.9G22513199n69000j0605K53448l96652k69089K25601l1890k3423l27911m24423
2774.5G20939255n64728r97467l70560K53678Q5754m89883l70942k16522m48837m22592
$$ y = [737015610, 736857986, 736827011, 736333160, 735708847, 734831772, 734295959, 733988724, 733947144, 733911285, 733669434, 733753510, 733731461, 733287277, 732550812, 732119598, 731729889, 731410751, 731625061, 731594925, 731182098, 731017761, 730929184, 730666656, 730956955, 730896454, 730169754, 729665375, 728958054, 728492432, 728551254, 728692322, 728152695, 727533035, 727609711, 727528839, 727545471, 727655182, 727412415, 726865616, 726482010, 726246414, 726064453, 726130066, 726026764, 726232147, 726101837, 725204468, 724443741, 724252625, 724397430, 723933640, 723733139, 723946991, 723817139, 723764267, 723584061, 723276138, 723089752, 722938309, 722513199, 721944199, 721933594, 722187042, 721790390, 721521301, 721746902, 721715012, 721691589, 721363678, 720939255, 720374527, 719377060, 719006500, 719260178, 719345932, 718856049, 718485107, 718268585, 717819748, 717397156]
2784.2G17397156o07605m22898K747K48413j87912m34418k93045p75375n96237j85700
2793.8G14145126j99127m02756m18930l31726p03048o40488m23279l71246k59094n89905
2803.4G09805527r41620m51126k47422o96334n97382l70483m73328q51135p29370l98865
2813.1G04048462m75388o64901p69425n84488o96106k34527n66330j433640l79486
2821.8F98244171k00729j029282j147537j058884r31473p79190o60019n15289l02887
2830.4F91618881o53381j080780j160202q03147o33544p91779r49860j292495r52835
2839.1F83300858j104279j093826q67844j450806j372604j293411j180954j451645
2846.8F73485489j577149j430892j779480j186448j072235j164398p94067j117401
$$ y = [717397156, 716789551, 716366653, 716369400, 716617813, 716429901, 715995483, 715702438, 714927063, 714330826, 714145126, 713945999, 713543243, 713124313, 712792587, 712089539, 711449051, 711025772, 710654526, 710395432, 709805527, 708863907, 708412781, 708165359, 707469025, 706871643, 706501160, 706027832, 705176697, 704447327, 704048462, 703573074, 702908173, 702138748, 701554260, 700858154, 700623627, 700057297, 698623657, 698244171, 698043442, 697014160, 695866623, 694807739, 693876266, 693097076, 692437057, 691921768, 691618881, 690965500, 689884720, 688724518, 687921371, 687287827, 686496048, 685546188, 684253693, 683300858, 682196579, 681102753, 680234909, 678784103, 677411499, 676118088, 674937134, 673485489, 671908340, 670477448, 668697968, 667511520, 666439285, 665274887, 664480820, 663363419]
2854.6F63363419j364823p58209l08685n64957k94189k96326n36804q74939j264191
2863.2F57100296j006775j211777j403732j235580j195450j522980j533279j290894
2870.9F46699829j480865j352692j249695j269684j857681k051964j468200j392098
2878.7F34576950j127510j160507j503411j492004q44688l90816n38559l38554n84794
2887.3F26596107r96818j063232o40641m75464k72789N65491N8899n36728l17688j45492
2897F22771645l19062m15497k71034o44417k11372q6479p88040p09496l46565n19676
2906.6F18460007r82628p21016n95932n92537m96330p85179j051026j030121j242485
2915.3F10962753k224273j839943j113625j273079j175728j154441p13768j134835
$$ y = [663363419, 661998596, 661240387, 660931702, 660366745, 660072556, 659776230, 659239426, 658364487, 657100296, 656093521, 654881744, 653478012, 652242432, 651046982, 649524002, 647990723, 646699829, 645218964, 643866272, 642616577, 641346893, 639489212, 637437248, 635969048, 634576950, 633449440, 632288933, 630785522, 629293518, 628448830, 628058014, 627519455, 627180901, 626596107, 625599289, 624536057, 623895416, 623419952, 623147163, 623712654, 623771553, 623234825, 622917137, 622771645, 622452583, 622037086, 621766052, 621121635, 620910263, 620823784, 620035744, 619326248, 618979683, 618460007, 617477379, 616756363, 616160431, 615567894, 615071564, 614286385, 613235359, 612205238, 610962753, 608738480, 606898537, 605784912, 604511833, 603336105, 602181664, 601467896, 600333061]
2923F00333061j304817o56509o73600l06205k36969j47782J02043J57700K68898J59988
2932.7E97695808M17939P24105R21250J181869J489792J386261J057968J462555J902504
2941.3F08240051K023812J841011J604538J793251J619568J539764J726494J467361
2949.1F21855850J721802J956634J614800J379051J463585J707993J545524J835938
2956.8F35081177K004966J767464J825180J339264J022720J296158J687088J597824
2964.5F47621841J381913J587448J396713R37958J101532J705780J659241J416778
2972.2F58809204R62753Q79212J087799P54394J515656J572037O78634Q87452J451644
2980.9F68598785J286698O16607J077652J153641M74167L40118M36249P57294Q92410
$$ y = [600333061, 599028244, 598371735, 597698135, 597391930, 597154961, 597007179, 597109222, 597266922, 597535820, 597695808, 598113747, 598837852, 599759102, 600940971, 602430763, 603817024, 604874992, 606337547, 608240051, 610263863, 612104874, 613709412, 615502663, 617122231, 618661995, 620388489, 621855850, 623577652, 625534286, 627149086, 628528137, 629991722, 631699715, 633245239, 635081177, 637086143, 638853607, 640678787, 642018051, 643040771, 644336929, 646024017, 647621841, 649003754, 650591202, 651987915, 652925873, 654027405, 655733185, 657392426, 658809204, 659771957, 660651169, 661738968, 662493362, 664009018, 665581055, 666259689, 667147141, 668598785, 669885483, 670502090, 671579742, 672733383, 673207550, 673547668, 673983917, 674741211, 675633621]
2989.6F75633621R50318N56564K67715N98069N30395J07041K77099K60544k90527K44979
2999.2F79135818L52326k84348Q7052O82754K62375j62659K55890j17797l67890j77612
3008.8F79665909l10288l52783j75247l22342j102524m77676q3695k37655k5330n90973
3018.5F75987396o86188q66012n81894j62735o78558p10755l08456o43158j240158
3027.2F70109482k81601j36871o81458l66135q53576j067353p78122l97491j44424
3035.9F65402451l28446q79364j194839q99353o02265m82101j196366j469345r69391
3044.5F57380981m74700l85743p86972n63507o40869r79690j144486j006851p58438
3053.2F50639725p05338o55975q85773n67322r80453j055679m50287j050415j167984
$$ y = [675633621, 676583939, 677140503, 677408218, 678006287, 678536682, 678643723, 678920822, 679181366, 678890839, 679135818, 679488144, 679203796, 679290848, 679973602, 680235977, 680073318, 680329208, 680211411, 679843521, 679665909, 679355621, 679002838, 678827591, 678505249, 677402725, 676925049, 676841354, 676603699, 676578369, 675987396, 675301208, 674435196, 673853302, 673690567, 673012009, 672301254, 671992798, 671349640, 670109482, 669827881, 669691010, 669009552, 668643417, 667789841, 666722488, 665944366, 665546875, 665402451, 665074005, 664194641, 662999802, 662100449, 661498184, 661016083, 659819717, 658350372, 657380981, 656906281, 656520538, 655733566, 655170059, 654529190, 653549500, 652405014, 651398163, 650639725, 649934387, 649278412, 648392639, 647825317, 646844864, 645789185, 645338898, 644288483, 643120499]
3061.9F43120499q00324p22122j307983q82340p9842q15353r26742j126862r76753
3070.6F35482178k56119n50270p17011r17434j220055r11064o61507q12530p86858
3079.2F28649330j000137j393051j055832k32353j63842j067390j324730j138992j207047
3087.9F20065956p34749j10931n27687j046181r68552q64143l78609j078758j692886
3096.6F12663460o01540n81627j107940j129761q20313m51355p80220r94148o87065
3105.3F05509491p85751r09310o56395o39076q34045j214714q40493n82847q78792
3114E98168068p99942r65271o85539p21665j103782j273537q92754p15179j320572
3122.6E89689827m35448k44980o04286j032791j669273p05567n53131q72917j044960
$$ y = [643120499, 642320175, 641598053, 640290070, 639407730, 639327888, 638512535, 637585793, 636458931, 635482178, 635226059, 634675789, 633958778, 633041344, 631821289, 630910225, 630248718, 629436188, 628649330, 627649193, 626256142, 625200310, 624967957, 624804115, 623736725, 622411995, 621273003, 620065956, 619331207, 619220276, 618692589, 617646408, 616677856, 615813713, 615435104, 614356346, 612663460, 612061920, 611480293, 610372353, 609242592, 608422279, 607970924, 607190704, 606196556, 605509491, 604723740, 603814430, 603158035, 602518959, 601684914, 600470200, 599629707, 599046860, 598168068, 597368126, 596402855, 595717316, 594995651, 593891869, 592618332, 591725578, 591010399, 589689827, 589254379, 589009399, 588405113, 587372322, 585703049, 584997482, 584444351, 583571434, 582526474]
3131.3E82526474o06308p92618j404571j95008p05948j244392p66869r68551q57163
3140E74985046o84623q72956j236725o10504o85234j005630q06732q60367o06117p37877
3149.6E66878281p48101r55047n70183m13322q34618p82280j487961j155739l87878
3158.3E59543152m20456p71256r12933o40869o72417o60019r71527r75609q99582o11495
3168E52006989o42395q38700k41089q49189j209641r31931n85556n15327p12433o10275
3177.6E44870453j185341n38979k57072r79004r94949n96619o63147j327362m24080
3186.3E37903900j77650o60324n57824p41958q03108r96628p93381o10657l59916p82280
3195.9E31420174q11158l43170r19533m92591q34198j183434l55911k58408o15959
$$ y = [582526474, 581920166, 581127548, 579722977, 579527969, 578822021, 577577629, 576810760, 575842209, 574985046, 574300423, 573427467, 572190742, 571580238, 570895004, 569889374, 569082642, 568222275, 567616158, 566878281, 566130180, 565175133, 564604950, 564191628, 563357010, 562574730, 561086769, 559931030, 559543152, 559122696, 558351440, 557438507, 556797638, 556125221, 555465202, 554493675, 553518066, 552618484, 552006989, 551364594, 550525894, 550284805, 549435616, 548225975, 547294044, 546708488, 546193161, 545480728, 544870453, 543685112, 543146133, 542889061, 541910057, 540915108, 540318489, 539655342, 538327980, 537903900, 537726250, 537065926, 536508102, 535766144, 534963036, 533966408, 533173027, 532562370, 532202454, 531420174, 530609016, 530265846, 529346313, 528853722, 528019524, 526836090, 526480179, 526221771, 525605812]
3204.6E25605812r00917q36182j027870o93512m27933l47328K0104k18125p07168q39234
3214.3E19627647n40084q61817l26881j5908r11521j248131j052590j17645k76184
3222.9E14276886n54733o13747r84116n76591n03807k46163n13000o88210j76582n3367
3232.6E09366570m69819q17642l19977n62439r47990r07402m25644m79851p72972L45040
3242.2E04007874p5760r60389o81648l26423n40963q07762l06244n70984p72171o67762
3251.9D98297768j95198O0386m33235m85840j001816q67614k40250R9258l5514o55022
3261.5D94542923o10161o12526k53563k54287q00858n79529j24092j89896n23986j93634
3271.2D90400391J37024j88446q93708p76138l37982m52423j68152m48570o68068J106
$$ y = [525605812, 524704895, 523868713, 522840843, 522147331, 521719398, 521372070, 521392174, 521174049, 520466881, 519627647, 519087563, 518225746, 517898865, 517882957, 516971436, 515723305, 514670715, 514553070, 514276886, 513722153, 513108406, 512124290, 511547699, 511043892, 510797729, 510284729, 509596519, 509419937, 509366570, 508896751, 508079109, 507759132, 507196693, 506248703, 505341301, 504915657, 504435806, 503662834, 504007874, 503932114, 502971725, 502290077, 501963654, 501422691, 500614929, 500308685, 499737701, 498965530, 498297768, 498102570, 498162956, 497729721, 497243881, 496242065, 495374451, 495134201, 495233459, 495197945, 494542923, 493932762, 493320236, 493066673, 492812386, 492011528, 491431999, 491307907, 491118011, 490594025, 490400391, 490537415, 490348969, 489455261, 488679123, 488341141, 487888718, 487720566, 487271996, 486603928, 486605034]
3280.8D86605034j71013o80771k92015k93312p25479m45213p1183o0348m00582m44297
3290.4D83020821l17421k03362m0474l62396n02129m70962n50728p11441o82869k80647
3300.1D78898392Q2893j50185l45993k0790k55508k35977o09017r72328l82614k27013
3309.7D75781860m6386k94190m29191r08623j082039k91443n37186m56390k02331j50376
3319.4D71383705n74913m64020n3215q58192m98581o75392p70378j14174l38783k95640
3329D66740417m40750m53224q09517p18422m53109o20537j27259k45704o21224q36677
3338.7D61413994q79173p44629k72789k49443o94848m77371m56428k76451p01676q74443
3348.3D55786743m94804m69971j08070n09720o28777n55534o11572n37911o43043k92931
$$ y = [486605034, 486434021, 485753250, 485461235, 485167923, 484442444, 483997231, 483926048, 483865700, 483465118, 483020821, 482703400, 482500038, 482459564, 482097168, 481595039, 481124077, 480573349, 479861908, 479179039, 478898392, 478981285, 478831100, 478485107, 478464317, 478208809, 477972832, 477363815, 476391487, 476008873, 475781860, 475735474, 475441284, 475012093, 474103470, 473021431, 472729988, 472192802, 471736412, 471534081, 471383705, 470808792, 470344772, 470291557, 469433365, 468934784, 468259392, 467489014, 467374840, 467036057, 466740417, 466299667, 465846443, 465036926, 464318504, 463865395, 463244858, 463117599, 462871895, 462250671, 461413994, 460534821, 459790192, 459517403, 459267960, 458573112, 458095741, 457639313, 457362862, 456661186, 455786743, 455291939, 454821968, 454713898, 454204178, 453575401, 453019867, 452408295, 451870384, 451227341, 450934410]
3357.9D50934410m07181q58116p35702j25275n68848r38797n86815n58319l00369p48291
3367.6D45106697o55517m64860o48727j01433l08838j035308j002732j87187k8686
3376.3D40673409k90261n23987m40292m41132r26399n38978k20833K73475k31552j057434
3385.9D36276016n25818m44641l22380n42373O065K01797r22432p98301k13852J30729
3395.6D32844810q163k20642j70555K23389J24664l52974m74358o13670O7558L967
3405.2D31424026j33895n39399q90426M8485r499m9706k17056j01356l3875l15742
3414.8D29181557O2332j87378o9695J32218R7999q09021p20024L15819k1248L17497
3424.5D28300056L6889L3645J02959m51012l37448j75209M01611K11220O80123P25097
$$ y = [450934410, 450527229, 449669113, 448933411, 448808136, 448239288, 447300491, 446713676, 446155357, 445854988, 445106697, 444451180, 443986320, 443337593, 443236160, 442927322, 441892014, 440889282, 440702095, 440673409, 440383148, 439859161, 439418869, 438977737, 438051338, 437512360, 437291527, 437565002, 437333450, 436276016, 435750198, 435305557, 434983177, 434440804, 434446869, 434648666, 433726234, 432927933, 432714081, 432844810, 432836647, 432616005, 432445450, 432668839, 432793503, 432440529, 431966171, 431352501, 431420059, 431424026, 431290131, 430750732, 429860306, 429908791, 429899292, 429849586, 429632530, 429531174, 429497299, 429181557, 429243889, 429056511, 428986816, 429119034, 429217033, 428408012, 427687988, 428003807, 427982559, 428300056, 428336945, 428370590, 428473549, 428022537, 427685089, 427509880, 427911491, 428122711, 428802834, 429527931]
3434.1D29527931j34620P5340j69029l10288o3171L12996N11436N14145J86882K72293
3443.8D30723915K33002j06964N97191l72315j71242P57485K07443L57246N01061R56688
3453.4D33683510Q31528L89823M5128K61574O41899j9417M769j37406L77999R36813
3463.1D37016220N69801O23246O45332J33629j46332Q23784L62549M11758J244774
3471.7D41684761P70645O25725r9106k80228L25509R60502Q96225P68776N68428k73094
3481.4D45948143N08080M54864Q82187R33037K0637Q24242L89290L11355R18465O27174
3491D51817474N11361Q60862N42565K18010P03392M4784P20368J134529N56984O53152
3500.7D57763481K63596O78634O20842O48842J045647P58591Q68606J205750J02501
$$ y = [429527931, 429393311, 429468651, 429299622, 428989334, 428926163, 429239159, 429750595, 430264740, 430451622, 430723915, 430956917, 430849953, 431447144, 431074829, 430903587, 431661072, 431868515, 432225761, 432726822, 433683510, 434515038, 434904861, 434949989, 435211563, 435853462, 435834045, 435838814, 435701408, 436079407, 437016220, 437586021, 438209267, 438854599, 438988228, 438841896, 439665680, 440028229, 440439987, 441684761, 442455406, 443081131, 442982025, 442701797, 443027306, 443987808, 444884033, 445652809, 446221237, 445948143, 446456223, 446911087, 447793274, 448726311, 448746948, 449571190, 449960480, 450271835, 451190300, 451817474, 452328835, 453189697, 453732262, 453950272, 454653664, 454698448, 455418816, 456553345, 457110329, 457763481, 458027077, 458705711, 459326553, 459975395, 461021042, 461779633, 462648239, 463853989, 463956490]
3509.4D63956490j014901Q53768J144180O95801J221886J049079M43573J55793J164093
3518D69669762R28611K4300M82292J239586J171837M26254P96929J032486J325836
3526.7D77097893J015815j47705k72979R88578J008339O05011J487732O04096N78613
3535.4D82965393P59316K88467J034698P28951P31583Q71772J620713J293945Q25653
3544.1D91120491O95572J54114J138725k52037R93614J773377J835708J547585r52225
3552.7D98054924J624527J221504R03664J745109J068764J783219P60612O30913O36902
3561.4E08430138K018699J011009Q77762M208870j307029o68297J148147k75612L411026
3570.1E18854713J569100J004753J816673J876450P26700J683311K494736L30009K056732
$$ y = [463956490, 462941589, 463795357, 464939537, 465635338, 466857224, 467906303, 468349876, 468505669, 469669762, 470598373, 470622673, 471104965, 472344551, 473516388, 473942642, 474739571, 475772057, 477097893, 478113708, 477966003, 477693024, 478681602, 479689941, 480294952, 481782684, 482386780, 482965393, 483724709, 484013176, 485047874, 485776825, 486508408, 487380180, 489000893, 490294838, 491120491, 491816063, 491970177, 493108902, 492856865, 493850479, 495623856, 497459564, 499007149, 498054924, 499679451, 500900955, 501804619, 503549728, 504618492, 506401711, 507162323, 507793236, 508430138, 510448837, 511459846, 512337608, 516546478, 515239449, 514571152, 515719299, 515443687, 518854713, 520423813, 521428566, 523245239, 525121689, 525848389, 527531700, 530026436, 530356445, 532413177]
3578.8E32413177J198426N78804J875076J988640J956482R72671L522454M93889k246705
3587.5E42752914K826462O89202K919044L436470K886200M07372M16984L285561p13768
3596.1E58906441K425499K687530M87366L197555L05443N99327K467957J546860J885757
3604.8E74509735L379898K553101o05049L777313j326676l70140Q333626N19180l794784
3613.5E86976204L797722n1842L715477M927788J237602J386223k179985P68547L623505
3622.2F04201241K238693K121238K610589J449699J852493O404152k368316j0744019
3629.9F07765770N563621N442734N835915P13501k261734K564392K909164K117386
3637.6F30650749K25868J276551K072372K021065J172752J51596J838837L336563N697479
$$ y = [532413177, 533611603, 534190407, 536065483, 538054123, 540010605, 540983276, 544505730, 544999619, 542752914, 545579376, 546268578, 549187622, 552624092, 555510292, 555917664, 556334648, 559620209, 558906441, 561331940, 564019470, 564506836, 567704391, 568009834, 568609161, 571077118, 572623978, 574509735, 577889633, 580442734, 579837685, 583614998, 582288322, 581918182, 590251808, 590770988, 586976204, 590773926, 590722084, 594437561, 599365349, 600602951, 601989174, 599809189, 600577736, 604201241, 606439934, 608561172, 611171761, 612621460, 614473953, 620878105, 618509789, 607765770, 613329391, 618772125, 624608040, 625321541, 623059807, 625624199, 628533363, 630650749, 630876617, 632153168, 634225540, 636246605, 637419357, 637570953, 639409790, 642746353, 648443832]
3646.3F48443832j813049m137649M405517l339462l050995K452316O918488M684753
3654F54563751L473664L053665q694153J909027M543152J200027J410065P32727J976929
3662.7F64168854M64325J079178J274719R93194M561844K142105m74701k011489p228089
3671.4F64969940M874649Q500977O823349n157547j7654343O410217Q054200L029709
3679.1F79851151k143937J867905L776932J836395M67758o11038P95059M532013M625473
3687.8F94997711r623489r91135O958389o523590J442566N510712P88879J434327O26297
3696.4F94620667J67007M67834N38483K583771J740036n145798j268844N337524K559128
3705.1G01599808J51138n64499K996140M786377q402787K369614L007813j1649094
$$ y = [648443832, 646630783, 642493134, 646898651, 643559189, 640508194, 642960510, 649878998, 654563751, 658037415, 661091080, 652396927, 654305954, 658849106, 660049133, 661459198, 662191925, 664168854, 664633179, 665712357, 666987076, 667980270, 672542114, 674684219, 674209518, 672198029, 664969940, 669844589, 678345566, 685168915, 680011368, 662357025, 668767242, 676821442, 679851151, 677707214, 679575119, 683352051, 685188446, 685656204, 685045166, 685840225, 690372238, 694997711, 685374222, 684383087, 691341476, 684817886, 686260452, 691771164, 692560043, 693994370, 694620667, 694787674, 695255508, 695793991, 698377762, 700117798, 694972000, 693703156, 699040680, 701599808, 701750946, 701186447, 704182587, 708968964, 700566177, 702935791, 705943604, 694294510]
3712.8F94294510N334625L827057j57623J417999L378448R07746l840561J506653M791412
3721.5G11460266n024643l088226O259003N51452j460190j786804J344605L320541
3729.2G11576004P90787N704193l534470n784149Q852463k741089j1070099J749268
3736.9G05542908L991928J363678L389587K993851l615875L684921R581451j4512710
3744.7G12419739j1199723J2036896O341324M983826o365814q874970J1558838r503250
3752.4G11396866m772186P925720N163803K804794n253067L201523M374619q661194
3760.1G16180878j96762M798126J523437O06690L594970l652496n082855L912964N476684
3768.8G27161636m62188q699799K948074L000565N53894J070557n53208O84433N34973
$$ y = [694294510, 699629135, 703456192, 703298569, 704716568, 708095016, 709002762, 705162201, 706668854, 711460266, 706435623, 703347397, 709606400, 710157852, 708697662, 706910858, 708255463, 711576004, 712366791, 718070984, 714536514, 708752365, 717604828, 714863739, 703793640, 705542908, 709534836, 710898514, 714288101, 717281952, 713666077, 717350998, 726932449, 712419739, 701220016, 713256912, 719598236, 724582062, 718216248, 709341278, 720900116, 711396866, 706624680, 714550400, 719714203, 722518997, 717265930, 720467453, 724842072, 716180878, 715984116, 720782242, 722305679, 722912369, 726507339, 722854843, 717771988, 721684952, 727161636, 726699448, 717999649, 720947723, 723948288, 724502182, 725572739, 725019531, 725703964, 726238937]
3777.4G26238937L430787q56324p095337L434143J661759J281509K252884k982941
3785.2G27365417p40203R39331N84259N45120K63443P81097k5787k73132p40738J845550
3794.8G30544357L446808m521789l380204L394013M909363M272995j0402069p630158
3802.5G20633316N431137L260269M873963M588470j0757065l209381N673142J767959
3810.2G32261810K30561J170120M91028J737899M776993m995346j3060837P007828
3817.9G29620056O473847M267959n82504j6712418M417191N379715J879120L168792
3825.7G37911758j82418m733658k87857J612243L265152J141968p278137M330521O961898
3834.3G42741470p066955M3487P338105r946213k195282P946396m765244Q49991N620728
$$ y = [726238937, 729669724, 728813400, 721718063, 725152206, 726813965, 728095474, 730348358, 727365417, 726625214, 727564545, 728148804, 728693924, 728957367, 729738464, 729712677, 729439545, 728698807, 730544357, 733991165, 729469376, 726089172, 729483185, 734392548, 738665543, 728263474, 720633316, 726064453, 729324722, 734198685, 738787155, 728030090, 724820709, 730493851, 732261810, 732492371, 733662491, 734153519, 735891418, 740668411, 735673065, 722612228, 729620056, 736093903, 740361862, 739779358, 723066940, 727484131, 732863846, 734742966, 737911758, 737729340, 732995682, 732707825, 734320068, 737585220, 738727188, 731449051, 735779572, 742741470, 735674515, 735718002, 743056107, 733109894, 730914612, 738861008, 734095764, 734945755, 740566483]
3843G40566483m148407l039856L930282J782913l73535J707077r9106J970368L752441
3851.7G46048660q574676j142273j4716110N830535J1553345j106643o26526K338562
3859.4G39604874J516342K180557m776077J323776N512085p770920l635559N340576
3867.1G39295654N885315M010239r934692o667176M904404P393036K306289j1941604
3874.8G35251465J584549M500656j18332K220001M481430o565475o089249O722183
3882.6G41987228J910553K005158K233810j3332367K889023M327240J195603M681396
3890.3G47897644j486969r108047K291488L860016p08694O81228K16828L030929N16434
3898.9G47190857r915390O782150J481400n914154M306183l537369m03137J254348
$$ y = [740566483, 736418076, 733378220, 737308502, 739091415, 738717880, 740424957, 740325851, 742296219, 746048660, 737473984, 736331711, 721615601, 727446136, 738999481, 737892838, 737266312, 739604874, 741121216, 743301773, 738525696, 739849472, 745361557, 737590637, 733955078, 739295654, 745180969, 749191208, 739256516, 732589340, 737493744, 744886780, 747193069, 735251465, 736836014, 741336670, 741218338, 743438339, 747919769, 741354294, 735265045, 741987228, 743897781, 745902939, 748136749, 734804382, 737693405, 742020645, 743216248, 747897644, 746410675, 737302628, 739594116, 743454132, 742745438, 743426666, 743643494, 746674423, 747190857, 737275467, 744057617, 745539017, 739624863, 743931046, 740393677, 739990540, 741244888]
3906.7G41244888M47846K223892M41208K11105J64261N01175p3700l2272J150131N81741
3916.3G46860275m108581k296982M894867o57349l344955L340072J845475K63290l041458
3925G43754654k965012K154160K811661J884384k248078j306915K317200j571503r35135
3933.7G43895416J121445k74811K13089N47791P11746M08554q2092K336731P40204
3942.3G49618073m780274o35986J444015J594162J249085k239151K37274m71420j861878
3951G44153900J820069M55322m77143L68729R63593M20456j064225J77536L10898K04315
3960.7G47333450p91320j090012J347427P35703p4845Q6060L83835N51452j063385
3969.3G47418365p11135P72476l9749o25000L36456J039963J82495q74558K74964P48825
$$ y = [741244888, 741692734, 743916626, 744357834, 744568939, 744733200, 745234375, 745160675, 745128403, 746278534, 746860275, 742751694, 740454712, 745349579, 744692230, 741347275, 744687347, 746532822, 746796112, 743754654, 740789642, 742943802, 745755463, 747639847, 745391769, 744084854, 746402054, 744830551, 743895416, 745016861, 744742050, 744955139, 745502930, 746214676, 746623230, 746541138, 748877869, 749618073, 744837799, 744201813, 745645828, 747239990, 748489075, 746249924, 746487198, 746015778, 744153900, 745973969, 746429291, 745952148, 746320877, 747284470, 747704926, 746640701, 746818237, 747129135, 747333450, 746542130, 745452118, 746799545, 747535248, 747460403, 747546463, 747930298, 748481750, 747418365, 746707230, 747479706, 747439957, 746814957, 747151413, 748191376, 748373871, 747499313, 747774277, 748523102]
3979G48523102n05371m84085J99203M9057O5842M77905k62451k72827M76074L79715
3988.6G48646164M05807o99997q91647L26004Q12378M05655o78177j47705J98135R537
3998.3G48386154K72141j11771
4000.2G48546524
$$ y = [748523102, 748017731, 747533646, 747732849, 747781906, 747847748, 748325653, 748063202, 747790375, 748266449, 748646164, 749051971, 748351974, 747460327, 747786331, 748598709, 749004364, 748326187, 748178482, 748376617, 748386154, 748658295, 748546524]
##END=$$ End of the data block
