##TITLE=$$ Begin of the data block
##JCAMP-DX=5.00 $$ ACD/SpecManager v 10.08
##SPECTROMETER/DATA SYSTEM=Varian
##DATE=20 Nov 2012 13:54:36
##DATA TYPE=INFRARED SPECTRUM
##DATA CLASS=XYDATA
##ORIGIN=
##OWNER=
##NPOINTS=3735
##FIRSTX=399.26403809
##LASTX=4000.35498047
##MAXX=4000.35498047
##MINX=399.26403809
##MAXY=80.80728149
##MINY=40.08522797
##XFACTOR=1.0000000000
##YFACTOR=0.000000100000000
##FIRSTY=61.86411667
##DELTAX=0.96440572
##XUNITS=1/CM
##YUNITS=TRANSMITTANCE
##XYDATA=(X++(Y..Y))
399.3F18641167j6678124J8822708N313950r224548k956696R04503K54211n885734
407F09191437j523323j305886L898621K233238m204902k38877n772285p24373J0992203
415.7F12545853J2632751O431732M765511l842316j4206390l110314o855278k560043
423.4F05801506N676651K974739Q76656l645783k521095J082268K758522j945572m207840
432.1F06850052k862358j365929J31874m246826r97887L769570N801163R51271n308152
440.7F02722778j801910L753128N272980n96161M730K155266K487945M691086R55124
449.4F19644966k00310p77244k665329p44476J558456K566376K328338k853279q706322
458.1F10151176J965714K499657J063423m230919o331787k397995J99890L867531k334595
$$ plain form
399.3 618641167 601963043 620785751 626099701 616875153 613918457 614822960 615077171 609191437
407 609191437 607668114 606362228 610260849 612494087 608289185 608050308 602278023 601553650 612545853
415.7 612545853 625178604 631610336 636375847 632533531 618327141 615216827 608361549 605801506
423.4 605801506 611478157 614452896 615329552 611683769 609162674 610244942 613003464 611057892 606850052
432.1 606850052 603987694 602621765 602753639 598506813 597508926 601278496 607079659 608030930 602722778
440.7 602722778 600920868 604673996 609946976 609350815 609355545 611510811 613998756 618689842 619644966
449.4 619644966 619444656 618667412 616002083 615257607 616816063 619382439 621710777 618857498 610151176
458.1 610151176 612116890 614616547 615679970 611449051 605117264 602719269 602919159 606786690 604452095
466.8F04452095j774139L197631M47617p99599m263916j509208J420631l46298J805191
475.5F02630005J497650k446556k683411m520607m194832L381730P78541p78084j332512
484.1E92331924j253089L777236M064789J322213j710396K823181j825829r392547
491.8E90137482j166535J299401J872558J789246Q07342j226387k208481p55271r2888
500.5E90456467L31382j928978J191979k343178m344635J964645K035637p19604j160889
509.2E85482826N34554o95153m129600m285812J97410J833496k396431l009453k861938
517.9E70669899j890450j770782l57780j17569j202622l75023p74460R3346j211510
526.6E63063049J384087J707649j330795o12793P73506J140328k064248K76566J140823
$$ plain form
466.8 604452095 602677956 605875587 606323204 605523605 601259689 599750481 601171112 600824814 602630005
475.5 602630005 604127655 601681099 598997688 594477081 590282249 593663979 594442520 593664436 592331924
484.1 592331924 591078835 594856071 598920860 600243073 598532677 601355858 599530029 590137482
491.8 590137482 588970947 590270348 592142906 593932152 594739494 593513107 591304626 590549355 590456467
500.5 590456467 590787849 588858871 590050850 587707672 583363037 585327682 587363319 586643715 585482826
509.2 585482826 586017380 585322227 581192627 576906815 577104225 578937721 576541290 573531837 570669899
517.9 570669899 568779449 567008667 566650887 566533318 565330696 564955673 564181213 564274559 563063049
526.6 563063049 564447136 566154785 564823990 564211197 564984703 566125031 564060783 564337349 565478172
535.2E65478172l40423J886368K137489M608421L693428J270828j13754M94843R43298
543.9E80058670j144714J371841J861267J483116l12996j142807J254921q83751j964225
552.6E80581322j642342Q91190J6174k075806m08439n57251n5123j760635k059937
561.3E72929153j028366j005020j714630k981796j792298j834335j283340j919556
569E59369812j545219j196824k113151r79042m48761k78816j008568J217804R57947
577.7E53975182k01760K041893L083344K217178J472168K962532K801781K437324K192650
586.4E72982292O73294j54304J385307L732719J318856p9346J539650P56645q29696
595E81325417j232491M87328J014976K41242k33460J86691K87171n77240n30892j12877
$$ plain form
535.2 565478172 565137749 567024117 569161606 573770027 577463455 578734283 578620529 579115372 580058670
543.9 580058670 578913956 580285797 582147064 583630180 583317184 582174377 583429298 582545547 580581322
552.6 580581322 578938980 579830170 579846344 577770538 577362099 576804848 576749725 574989090 572929153
561.3 572929153 571900787 570895767 569181137 566199341 564407043 562572708 561289368 559369812
569 559369812 557824593 556627769 554514618 553535576 553086815 552807999 551799431 553017235 553975182
577.7 553975182 553773422 555815315 558898659 561115837 562588005 565550537 568352318 570789642 572982292
586.4 572982292 573655586 573501282 574886589 578619308 579938164 579858818 581398468 582155113 581325417
595 581325417 580092926 580580254 581595230 581836472 581603012 581789703 582076874 581499634 580968742 580855865
604.7E80855865L98598k2812q6403k11525j75399Q06579Q85277Q04367Q38890J479264
614.3E85572701P5874p8011J793442N13191K94304J356735J680794K461929L423043
623E97094002O76079j247826J270752J341667K64549L90931J342582O24504k21862
631.7F01535378J800079K704658K835579J174164o37207J46523N72m49448O00777K063446
641.3F11774521J591415Q99773K65541O371N33065j92604k11029K21215k59820m47921
651F14180527J334572K246170J502533J726112J226540R99984m12674j412162q12684
659.7F20578918r98306R7618M24004J267853J784095J600380J146431k493477l045425
668.3F20362091M413643J044044p88116j726227R61037K902756J688232Q62885Q11157
$$ plain form
604.7 580855865 581254463 581231651 581145248 580933723 580758324 581564903 582450180 583254547 584093437 585572701
614.3 585572701 585648575 585570564 587364006 587877197 588171501 589528236 591209030 593670959 597094002
623 597094002 597770081 596522255 597793007 599134674 599399223 599790154 601132736 601757240 601535378
631.7 601535378 603335457 606040115 608875694 610049858 609412651 609559174 609559746 609110298 609711075 611774521
641.3 611774521 613365936 614265709 614531250 614537621 615070686 614878082 614667053 614888268 614628448 614180527
651 614180527 615515099 617761269 619263802 620989914 622216454 623216438 622803764 621391602 620578918
659.7 620578918 619580612 619678230 620102234 621370087 623154182 624754562 625900993 623407516 620362091
668.3 620362091 624775734 625819778 625031662 623305435 624266472 627169228 628857460 629720345 630531502
677F30531502k86331j61210M50631j57280M70886O2637M60320J963234J357383m40826
686.7F34250946j33018K323341M15459j605416p94868k29302O44112L83797J64184
695.3F35419235o93283p02743K78205r47189j659279j303444j081123q90655o62156
704F27757568q01849r12170l51143M84390L12195o5766J88485l91007N55115J831550
713.7F28607368J749306J992874J807671K141380J671181J141777R66568J045837L051606
722.3F44175568K113571J218033K168426J517029K077026K862702K247696J120529
730.1F59500580J049576J093673Q38395O11572N6000Q68454K640228K899322p8811
738.7F69478989n78843R97010j07117q26569l95889L40042j49307q2855J7547r69772
$$ plain form
677 630531502 630245171 630083961 630534592 630377312 630848198 630910835 631371155 633334389 634691772 634250946
686.7 634250946 634117928 636441269 636856728 635251312 634456444 634227142 634871254 635255051 635419235
695.3 635419235 634725952 634023209 634301414 633354225 631694946 630391502 629310379 628419724 627757568
704 627757568 626955719 626043549 625692406 626176796 626488991 626423225 626611710 626220703 626775818 628607368
713.7 628607368 630356674 632349548 634157219 636298599 637969780 639111557 640078125 641123962 644175568
722.3 644175568 646289139 647507172 649675598 651192627 653269653 656132355 658380051 659500580
730.1 659500580 660550156 661643829 662482224 663093796 663149796 664018250 666658478 669557800 669478989
738.7 669478989 668900146 669897156 669790039 668963470 668567581 668907623 668758316 668675461 668693008 667723236
748.4F67723236j831436j853180m87823j633683j717529j238556j928253n87387j383057
757.1F55062332j074066N72357j431045k971421j880951q01849n98068n7144M05807
765.7F47225952J9303p2251J241303J463241M06952J308823J755981J354599J986008
774.4F56689911L677521M297409K649154K936478L497925K312774J446839J164169
782.1F78672180P57599J056747J757660K262955K927780K016526K095642J990356Q11234
790.8F94348679N60455n18036j46408J117477J666031K097473K767716K489700J665344
799.5G06048431J138993k79312J38244K55356P2098K31323M1885J521607K021179J255646
809.1G12445450R5825k78625j02158n64652j230392r93729j09634r7122P59125Q50219
$$ plain form
748.4 667723236 665891800 664038620 663550797 661917114 660199585 658961029 657032776 656445389 655062332
757.1 655062332 653988266 654560623 653129578 650158157 648277206 647475357 646877289 646820145 647225952
765.7 647225952 647245255 647173004 648414307 649877548 650284500 651593323 653349304 654703903 656689911
774.4 656689911 660367432 664664841 667313995 670250473 673748398 676061172 677508011 678672180
782.1 678672180 679429779 680486526 682244186 684507141 687434921 689451447 691547089 693537445 694348679
790.8 694348679 694909134 694391098 694244690 695362167 697028198 699125671 701893387 704383087 706048431
799.5 706048431 707187424 706908112 707046356 707301712 707373810 707605133 707647018 709168625 711189804 712445450
809.1 712445450 712541275 712262650 712160492 711595840 710365448 709371719 709262085 709164963 709924088 710774307
818.8G10774307N30091L01132q40531r50393m21677k53906j343689j677780j031571
827.5G05085983J4649l4180n57709J5335j340789k034989k535477k549591j572799
836.1F94490433j966858j346588o49872l23486l73841k91977p50656k468185k490464
844.8F83828506j739425j122589j314926j675721m75464K91596j113739j587601n60989
853.5F74529648j814041k619019j770859k188263k571334p23496O90537j61515N70069
862.2F63941727K369079K221222J740570J977921K304535K213363K619324L418121
869.9F82805862M300919M822769L952484K980881K606278J512146m49067L1281Q17108
878.6G03380661Q36029J077347L54385n98602j479492j396256k047577j986084k219390
$$ plain form
818.8 710774307 711304398 711605530 710764999 709814606 709392929 709139023 707795334 706117554 705085983
827.5 705085983 705100632 705066452 704508743 704524078 703183289 701148300 698612823 696063232 694490433
836.1 694490433 692523575 691176987 690527115 690203629 689829788 689537811 688787155 686318970 683828506
844.8 683828506 682089081 680966492 679651566 677975845 677500381 677791977 676678238 675090637 674529648
853.5 674529648 672715607 670096588 668325729 666137466 663566132 662842636 663533173 663371658 663941727
862.2 663941727 666310806 668532028 670272598 672250519 674555054 676768417 679387741 682805862
869.9 682805862 687106781 691929550 695882034 698862915 701469193 702981339 702532272 702563553 703380661
878.6 703380661 704216690 705294037 705648422 705049820 703570328 702174072 700126495 698140411 695921021
887.3F95921021l261109k387695k009583j861725j980896j504516r26132j454773j924057
895.9F78610535k720795k796326k329483j781082j495209r87320j178894k554245k034454
904.6F60732727j392593k084732k314225l508758m318009k658233k515030l332482
912.3F38608665l030204k998505l360863l876381l236503k861252l224602k684517
920F13335838j830024k006150q12225O25420q66852r48868J05247M12217l40577j160049
929.7F06513977k01836M9057P75452J953125J731262J259232J439247J323166K79007
938.4F15121689K33688O52619P98301J526985K019577J840439J106987n4435j259842
947.1F21986008j943207k085419k509537l358078l846969l834572l814278l653564
$$ plain form
887.3 695921021 692659912 690272217 688262634 686400909 684420013 682915497 681989365 680534592 678610535
895.9 678610535 675889740 673093414 670763931 668982849 667487640 666500320 665321426 662767181 660732727
904.6 660732727 659340134 657255402 654941177 651432419 647114410 644456177 641941147 638608665
912.3 638608665 635578461 632579956 629219093 625342712 622106209 619244957 616020355 613335838
920 613335838 611505814 609499664 608687439 609312859 608446007 607497139 607602386 608014603 607674026 606513977
929.7 606513977 606312141 606361198 607136650 609089775 610821037 612080269 613519516 614842682 615121689
938.4 615121689 615355377 616007996 616806297 618333282 620352859 622193298 623300285 623245850 621986008
947.1 621986008 620042801 617957382 615447845 612089767 608242798 604408226 600593948 596940384
954.8E96940384m478378m950295n181541n875321n809173o092949o662064o222153
962.5E51668510m610672n575904o060410n391846o603927p368965p915001o783600
970.2E01358185p069779p673874p381095o867943n895310o184997n438309o406021
977.9D48440857o270180o347198n925789m783478n324898l252754k898292j761933
985.6D11876335k011032k296715j606102j953697l45154j010856o25687n56068j72348
994.3D01298676m13819l2577J758613M38042P87125R2659O26716J81885j21307J134185
1004D05750198q4114L64304k10419N93186k04544o09551m0893j053467n70336j305084
1013.6D02629280M63524j80130k72865J78451K14997K168312P37724J035080p0992
$$ plain form
954.8 596940384 592462006 587511711 582330170 576454849 570645676 564552727 557890663 551668510
962.5 551668510 547057838 541481934 535421524 530029678 523425751 516056786 508141785 501358185
970.2 501358185 494288406 486614532 479233437 472365494 466470184 460285187 454846878 448440857
977.9 448440857 442170677 435823479 429897690 425114212 419789314 416536560 413638268 411876335
985.6 411876335 409865303 407568588 405962486 404008789 403663635 402652779 402027092 401471024 401298676
994.3 401298676 400884857 400852280 402610893 403048935 403836060 403928719 404555435 404737320 404616013 405750198
1004 405750198 405666084 406030388 405819969 406413155 406208611 405599060 405558167 404504700 403934364 402629280
1013.6 402629280 403092804 402912674 402639809 402818260 403033257 405201569 405939293 406974373 406903381
1022.3D06903381M36364N26237L45612K274704J171341K067718J475830J653443R55657
1031D17810287R80912J548271J09062J209374n989P63130N98221R49058J014633k46696
1040.6D24730263L46565j649780N44204N47181l7003j44005o88362J112023N34362
1049.3D25295448J775399K90336P20520J171036J326981K423629J407204L672523J781693
1058D39864769K107391L521653L527221L484574K143364L629379L058853L300362J879310
1066.6D66516876J443176J514054L04375l41835m341164m026337l509598l253212l007812
1075.3D51298523k616653j145325j835480P06635j08605M70352J481095J205978J989174
1084D51445694O75354J318550J036339K393761K432746K399598K626228K168007L045845
$$ plain form
1022.3 406903381 407339745 407865982 408211594 410486298 411657639 413725357 415201187 416854630 417810287
1031 417810287 418791199 420339470 420448532 421657906 421651917 422415047 423013268 423962326 424976959 424730263
1040.6 424730263 425076828 423427048 423971252 424518433 424481430 424337425 423649063 424761086 425295448
1049.3 425295448 427070847 427361183 428081703 429252739 430579720 433003349 434410553 438083076 439864769
1058 439864769 441972160 445493813 449021034 452505608 454648972 458278351 461337204 464637566 466516876
1066.6 466516876 467960052 469474106 469778481 469436646 465095482 461069145 457559547 454306335 451298523
1075.3 451298523 448681870 447536545 445701065 446407700 446299095 446769447 448250542 449456520 451445694
1084 451445694 452121048 453439598 454475937 456869698 459302444 461702042 464328270 466496277 469542122
1092.7D69542122J564941K368508J659813R43298R65271M77142J232796R11331J226845
1101.4D80892067K11296j95618r49592Q81843J715927k37922N72052l58505J437454
1110D83969002J940307K176896L262786K200585K197799Q02117R03892M08860J012458
1118.7D98874702J176949O13556J657295J099739J532326K59514J008301J540680L28979
1127.4E08092041N94482O19240J689682J374131K269744J985169J871948J882019N9967
1136.1E20438423j5030j219711j385307j893082j398392j126556k465630j841888k197304
1144.8E06895523j590118k459488k266464j789399k764091k274246k093697n93262
1152.5D91064758p80258L9673L6087r3575J25123r37119N33066J22337O63643Q94127
$$ plain form
1092.7 469542122 471107063 473475571 475135384 476078682 477043953 477521095 478753891 479665222 480892067
1101.4 480892067 481103363 480907745 479958153 480839996 482555923 482318001 482890053 482531548 483969002
1110 483969002 485909309 488086205 491348991 493549576 495747375 496549492 497453384 497862244 498874702
1118.7 498874702 500051651 500665207 502322502 503422241 504954567 505214081 506222382 507763062 508092041
1127.4 508092041 508686523 509305763 510995445 512369576 514639320 516624489 518496437 520378456 520438423
1136.1 520438423 520423393 519203682 517818375 515925293 514526901 513400345 510934715 509092827 506895523
1144.8 506895523 505305405 502845917 500579453 498790054 496025963 493751717 491658020 491064758
1152.5 491064758 490284500 490324173 490360260 490266685 490391808 489454689 489987755 490110092 490773735 491667862
1162.1D91667862J732712K635612K475052L618469K854843L836632L353920L489266
1169.8E15664368M027710L487243M351998M237785N196838N096703N656204N690651
1177.5E53409500M661179M403419L825455L898086L328820L955765M595298M436455
1185.3E86513977M362488L707161L060226K579651K345924J737633J471825J172333
1193F06951218J038856J209564J108933J679191J672783J089287M9248o08749J20048
1201.6F14310379j2550k24686L42522O14280J265335J928139J654053J197472Q14552
1210.3F21889496R14955J270294Q74214N53933J000404J764679J765518J615524J811829
1219F33460846J296654J45874n7907M19693l72353p51495J05819L10784k17705j44692
$$ plain form
1162.1 491667862 493400574 496036186 498511238 502129707 504984550 508821182 512175102 515664368
1169.8 515664368 519692078 523179321 527531319 531769104 536965942 542062645 547718849 553409500
1177.5 553409500 558070679 562474098 566299553 570197639 573526459 577482224 582077522 586513977
1185.3 586513977 590876465 594583626 597643852 600223503 602569427 604307060 605778885 606951218
1193 606951218 607990074 609199638 610308571 611987762 613660545 614749832 614799080 614190331 614310379
1201.6 614310379 614297829 614073143 614415665 615029945 616295280 618223419 619877472 621074944 621889496
1210.3 621889496 622804451 624074745 624948959 625502892 626503296 628267975 630033493 631649017 633460846
1219 633460846 634757500 634903374 634845467 635265160 634892807 634141312 634247131 634557915 634340210 634195518
1228.6F34195518J08262p51839j138001n33409m47082o35834p30782p44590n88570
1237.3F28733673l69797J19782K03361l56254k88811p4806n25055k84653J99471K68364
1247F27625275O25610R24416J038742R76486P50694K09580L9062L67317M51546L13072
1256.6F33321800L75443M71649K76527P20330R44252M50973K63481J374k51160k67
1266.3F36574402R21478J238022Q31490J282386J377869O41403N28412L94363J67313
1274.9F43957138L68576j7319k19268J87912M66690K30789L37982L58200l09906k20261
1284.6F45140533m92630o52999k08893L1585J02387J63040L39737k52457k68173l19824
1294.2F43582306q32520r13772j037445o81534m82407m92859o89354k97546k89879
$$ plain form
1228.6 634195518 634303780 633551941 632413940 631880531 631433449 630797615 630066833 629322243 628733673
1237.3 628733673 628363876 628483658 628687019 628330765 628041954 627967148 627442093 627157440 627356911 627625275
1247 627625275 628250885 629175301 630214043 631190529 631941223 632150803 632189865 632557182 633008728 633321800
1256.6 633321800 633697243 634168892 634445419 635165749 636110001 636560974 636824455 636825829 636574669 636574402
1266.3 636574402 637495880 638733902 639565392 640847778 642225647 642867050 643395462 643789825 643957138
1274.9 643957138 644325714 644308395 644089127 644277039 644743729 644974518 645312500 645670700 645360794 645140533
1284.6 645140533 644647903 643994904 643786011 643817596 643919983 644083023 644422760 644170303 643902130 643582306
1294.2 643582306 642749786 641836014 640798569 640117035 639634628 639141769 638452415 638154869 637864990
1302.9F37864990q86955o44531m72260p37686k721901k450294l7194l99093m87328
1311.6F29027748q4114m81033o97060o08597q04138j239357m90112l28675n30014j75323
1321.2F23589325j82915m20646j039200j005059j381530k252884j883202j478348j354637
1329.9F12590904j542396j460648p07436o20765j046372j409683j242180j221771j000519
1338.6F02339134o00319l97987L22418P04498J053620M00505Q7318o7558j44501Q5488
1348.2F03782616m50058m21181k16026K76260L98369J00326K900N6457R4719p90405
1357.9F02833977q72689m87899l21884o05088j081123m58641J61362L50761M2000L71094
1367.5E99931870p26433j136132L98255n34O61773L17727m81797N14412J545487J388931
$$ plain form
1302.9 637864990 636978035 636333504 635861244 635123558 632401657 629951363 629914169 629515076 629027748
1311.6 629027748 628943634 628462601 627765541 627156944 626352806 625113449 624623337 624294662 623764648 623589325
1321.2 623589325 623406410 622985764 621946564 620941505 619559975 617307091 615423889 613945541 612590904
1329.9 612590904 611048508 609587860 608880424 608259659 607213287 605803604 604561424 603339653 602339134
1338.6 602339134 601738815 601340828 601663246 602367744 603421364 603821869 603909187 603841629 603697128 603782616
1348.2 603782616 603332558 602911377 602695351 602971611 603369980 603470306 603473206 603529663 603624382 602833977
1357.9 602833977 601961288 601473389 601151505 600546417 599465294 599006653 599168015 599518776 599560776 599931870
1367.5 599931870 599205437 598069305 598467560 598467026 599128799 599446526 598964729 599479141 601024628 602413559
1377.2F02413559m2648K80342R1820N7144L8528N303O85157O21872J496125J409492
1386.8F07056694J179657J404953J627388J143990K59628N42564N05371m91562r24110
1395.5F12304573J127930O00776m24385j307640p77321L77884n88340o40831p21856
1404.2F09950790j476249o26564M7416J44539m49524l85818j126404r81102n15671
1412.8F04581413r53483n22080k35595j98555m59443O7635k250252L96843J801758
1421.5F02228241K92244M1695j675911J83715J011734J43090Q61129M38691N74112
1430.2F04098740J36604L60527J3618L66059J349487K04048j301765O35185K472763
1438.9F08335266J224518M94766O58112K39906O62613k12975M81339J38588n85899
$$ plain form
1377.2 602413559 602370911 602651253 602743073 602800217 602838745 602844048 603529205 604151077 605647202 607056694
1386.8 607056694 608236351 609641304 611268692 612412682 612672310 613214874 613720245 613228683 612304573
1395.5 612304573 613432503 614033279 613608894 612301254 611523933 611901817 611313477 610672646 609950790
1404.2 609950790 608474541 607847977 607895393 608039932 607590408 607204590 606078186 605097084 604581413
1412.8 604581413 603627930 603105850 602870255 602671700 602212257 602279892 600029640 600426483 602228241
1421.5 602228241 602520485 602562180 600886269 601069984 602081718 602224808 603085937 603524628 604098740
1430.2 604098740 604235344 604595871 604609489 604975548 606325035 606529083 605227318 605862503 608335266
1438.9 608335266 609559784 610054550 610712662 610952568 611615181 611402206 611883545 612022133 611436234
1447.6F11436234o19469M28810P01523o45447J31416j94168L35808l74451j629486
1456.2F09570770l728523l730354L603172J565628K235222P49969Q43354J824989j524925
1464.9F11409302P91321J433334K802009J841431K361565L191948J555557K229042
1472.6F27615509J767654N672646K675056K463532L449173K661133K875137K222672
1480.3F51402512L280487K005310K664413J878662J970978K651978P5531J796417J352005
1489F69078293R81674N18036K786026L084640J489258K017517K74048q42438J530381
1497.7F80917435J69830k91138K103119J781311K79389J748428J425476J059265l320694
1506.4F85872421l303222K517166O00357K494812J991577R63898k61841J489487J146087
$$ plain form
1447.6 611436234 610816765 611245575 611947098 611301651 611433067 611238899 611574707 611200256 609570770
1456.2 609570770 605842247 602111893 605715065 607280693 609515915 610265884 611109238 612934227 611409302
1464.9 611409302 612200623 613633957 616435966 618277397 620638962 623830910 625386467 627615509
1472.6 627615509 629383163 635055809 637730865 640194397 643643570 646304703 649179840 651402512
1480.3 651402512 654682999 656688309 659352722 661231384 663202362 665854340 665929871 667726288 669078293
1489 669078293 670059967 670578003 673364029 676448669 677937927 679955444 680229492 679387054 680917435
1497.7 680917435 681087265 680796127 682899246 684680557 684959946 686708374 688133850 689193115 685872421
1506.4 685872421 682569199 685086365 685686722 688181534 690173111 691137009 690875168 692364655 693510742
1515.1F93510742R4223m9209k086258L579025J713180k934799j656494J481934L958587
1523.7F97610931J830292k26059L6164J300811l39050O40411J721344J68763P27539
1532.4G03471146k262268q06580K829742J437149J847153J532593j438217p733231
1540.1F98877487M398346Q23670r36356K360229j84555P25480K452087J833954O66427
1548.8G11016769r86480j108094J061173J462021N52673k626190P90710M051514K447739
1557.5G16661835m586335k559127j866608L004379J713028J383362M8599j556167N78308
1566.2G12821274J229248J087952j0148l855819K47040J342468j45951o52923N05905
1574.9G12569046r21173o075287J904755J773452j2283n05676p26471q46100j139603
$$ plain form
1515.1 693510742 693604965 693555756 691469498 695048523 696761703 693826904 692170410 693652344 697610931
1523.7 697610931 699441223 699215164 699251328 700552139 700213089 700853500 702574844 702743607 703471146
1532.4 703471146 701208878 700402298 703232040 704669189 706516342 708048935 706610718 698877487
1540.1 698877487 703275833 704099503 703163147 705523376 705338821 706064301 708516388 710350342 711016769
1548.8 711016769 710030289 708922195 709983368 711445389 711998062 709371872 710162582 714214096 716661835
1557.5 716661835 712075500 709516373 707649765 710654144 712367172 713750534 713799133 712242966 712821274
1566.2 712821274 714050522 715138474 715128326 711272507 711519547 712862015 712716064 712063141 712569046
1574.9 712569046 711647873 705572586 707477341 709250793 709238510 708732834 708006363 707160263 706020660
1583.5G06020660p27539j083831j215439m95758o24237j117173j920471q39462q22296
1592.2F97174454j451798j857757j870194r59472j532975j140976j217270q71353j499786
1600.9F84772873j867905j257324k074051j363449j556625j438904j732254r40094
1608.6F72542267j573639k633667r23691j955185j566849j948318m31824p78122q213272
1617.3F52517700N23987j75781o87332j439667l29132j759720m442291K80685m44641
1626F44043808m9820k640228j625977j45454q28171o36749q94966Q28552k8763m538383
1635.6F33483849j372414J290817L30048M83017J090317J26304Q34389l06320J463623
1644.3F37423630J567039k535133j514931n83000L781128K357330K488175L039474
$$ plain form
1583.5 706020660 705293121 704209290 702993851 702498093 701873856 700756683 698836212 697996750 697174454
1592.2 697174454 695722656 693864899 691994705 691035233 689502258 688361282 687144012 686272659 684772873
1600.9 684772873 682904968 681647644 679573593 678210144 676653519 675214615 673482361 672542267
1608.6 672542267 670968628 668334961 667411270 665456085 663889236 661940918 661509094 660730972 652517700
1617.3 652517700 653041687 652865906 652178574 650738907 650409775 648650055 644207764 644488449 644043808
1626 644043808 643993988 641353760 639727783 639582329 638754158 638117409 637222443 638050995 638022232 633483849
1635.6 633483849 632111435 633402252 633732300 634215317 635305634 635431938 636266327 635960007 637423630
1644.3 637423630 638990669 636455536 634940605 634357605 638138733 640496063 642984238 646023712
1652F46023712P50504q783417K790298L882828J460953J349335J344070J591568J714478
1660.7F52124329J454925N264m60052K718658J824036J721497J851577J558609n73272
1669.4F62225571R16061L184052J259536K851029L152618K61917p73468L578568L478164
1678F80134048J633225J115723J178283L901978M038849Q18023k860565L364411M608688
1686.7F97932663K566528J984330K324066J420898K454453K438964J924134K705993
1694.4G15752029K180024l290787K694321L972091L997040J831n114670N445023M132690
1703.1G29769592J606751J33209P97882m15268J447525K099838P97272Q9874Q52814
1711.8G37179489J676712J545639M7150n42908J684647p85370n229950L536377K887421
$$ plain form
1652 646023712 646774216 637990799 640781097 644663925 646124878 647474213 648818283 650409851 652124329
1660.7 652124329 653579254 653584518 653124466 655843124 657667160 659388657 661240234 662798843 662225571
1669.4 662225571 663141632 666325684 667585220 670436249 673588867 673850784 673077316 676655884 680134048
1678 680134048 681767273 682882996 684061279 687963257 692002106 692820129 689959564 693323975 697932663
1686.7 697932663 700499191 702483521 704807587 706228485 708682938 711121902 713046036 715752029
1694.4 715752029 717932053 714641266 717335587 721307678 725304718 725306549 720191879 725636902 729769592
1703.1 729769592 731376343 731509552 732307434 731892166 733339691 735439529 736236801 736326675 737179489
1711.8 737179489 738856201 740401840 740448990 739906082 741590729 740805359 735575409 739111786 741999207
1720.5G41999207J350936L93753R308J95313J071472Q82416K01263O55976N10177j461868
1730.1G45807953l58429K263565J275330l568116k289657L615112K494583O45447J547546
1738.8G51433334o94732k313538K320328J408691o59713L88412K300949J641769P75528
1747.5G56601028P37381l280K017288q15964q75091K639846J660615J612930J503219
1756.2G65077972o41937M98047J672134J532059J735916j318512l47671K261047J099091
1764.8G71568146R83734J627807R25980j872558J495971K475357j074981k356339l29208
1773.5G73443909L326034J571884o01425J540146J154709J131744l91006j297989J000214
1782.2G80878220J677551Q51898j346054k52914J234130P76368L18069Q55179K61764
$$ plain form
1720.5 741999207 743350143 743743896 743753204 743948517 745019989 745902405 746103668 746759644 747269821 745807953
1730.1 745807953 745449524 747713089 748988419 745420303 743130646 746745758 749240341 749885788 751433334
1738.8 751433334 750738602 748425064 750745392 752154083 751494370 751882782 754183731 755825500 756601028
1747.5 756601028 757338409 757335129 759352417 758536453 757661362 760301208 761961823 763574753 765077972
1756.2 765077972 764436035 764934082 766606216 768138275 769874191 768555679 768208008 770469055 771568146
1764.8 771568146 772551880 774179687 775105667 773233109 774729080 777204437 776129456 773773117 773443909
1773.5 773443909 776769943 778341827 777740402 779280548 780435257 781567001 781175995 779878006 780878220
1782.2 780878220 782555771 783407669 782061615 781808701 783042831 783819199 784137268 784992447 785254211
1790.9G85254211j97296j583862l94592K353286J36338q03757Q27026J066666j44730
1799.5G86513290r10415J489410r6054M66461J332093k67640R3384K31400R5062N82657
1809.2G89529648O57272q87909K69089J052399L03726M65317l54081P3624j02768J75858
1818.8G91182175L80478m58R14154p4616O47812O56281k339935R1323J605988J004181
1828.5G94067383r05304k598419J178360J871872L99170K08892J35575K42157r8801
1837.2G94500885p98416M55322M15039L53394j71509O96945K42920l772125K021026
1845.8G93943481J926041k88238n92423O1493M01154p8736L24784L0059K11716L0899
1855.5G95970230J10169K44903l16315L36533j58844j79367o1035M28772L93982j068
$$ plain form
1790.9 785254211 785056915 783473053 783078461 785431747 785568085 784764328 785591354 786658020 786513290
1799.5 786513290 785602875 787092285 786996231 787462692 788794785 788527145 788620529 788851929 788946991 789529648
1809.2 789529648 790186920 789299011 789568100 790620499 790924225 791389542 791035461 791109085 791006317 791182175
1818.8 791182175 791562653 791562195 792476349 792401733 793049545 793705826 791365891 791457214 793063202 794067383
1828.5 794067383 793162079 790563660 791742020 793613892 794013062 794221954 794357529 794599686 794500885
1837.2 794500885 793702469 794157791 794572830 794926224 794754715 795451660 795694580 791922455 793943481
1845.8 793943481 795869522 795581284 794988861 795050354 795451508 795372772 795697556 795727615 795939331 795970230
1855.5 795970230 796080399 796325302 796008987 796345520 796186676 796007309 795946274 796375046 796769028 796767960
1865.1G96767960M54788o71005l24555j024780k28272J256867K27890K43072l9978
1873.8G96661987j602M578M10614K52304K0447N31234p6141j35498l21808L65448K34909
1884.4G97946472l71322K06069q316P70569r3383j196900O46057M17862k8229N74875
1894.1G98863754q3389q66547L52707N36804J92948r0180R4681L41568m3106J13297
1903.7G99412537k64588k13089K289n5695Q2627J92795J79061K38495N31006m90722
1913.3G99614716o41098l86048J88751M99039j370850J02768J052552N69610K33612
1922G99863052p14569n07431M88129N44052l81165j62658L7918N13229N54810j55487
1931.7H00079880P9651j96228J50985j32522k44751j81046l26996K71759Q6518P62329
$$ plain form
1865.1 796767960 797222748 796551743 796227188 795202408 794974136 796231003 796458893 796701965 796661987
1873.8 796661987 796660385 796664963 797075577 797327881 797348328 797879562 797803421 797667923 797346115 797711563 797946472
1884.4 797946472 797575150 797781219 797772903 798543472 798450089 797253189 797899246 798317108 798288879 798863754
1894.1 798863754 798780365 797913818 798266525 798803329 798996277 798906097 799000778 799342346 799299240 799412537
1903.7 799412537 799147949 798934860 798937149 798881454 798964081 799156876 799335937 799574432 800105438 799614716
1913.3 799614716 798973618 798587570 798776321 799275360 797904510 798007278 799059830 799629440 799863052
1922 799863052 799148483 798641052 799129181 799673233 799292068 799129410 799167328 799680557 800235367 800079880
1931.7 800079880 800159531 799963303 800114288 799981766 799737015 799555969 799228973 799500732 799587250 800349579
1941.3H00349579n09033j237336J118317O15997k29034l85971n4016N4016J38016J3885
1951G99874420j99509J02311L25622J83182m07867J45111J12228j50604j09711j31607
1960.6G99743576M45786J88598K64893j21460Q3237K56423o38351M2496n6153k41394
1970.2G99967651J00785O62307O08826k0828o5918m52042q6288n7068k95944J00708
1979.9H00462189J90277j39237P0191P82013J72271k28958j02234n0201m47235m85306
1989.5H00223770N48554j1216q10165J10779N00107k5254N2796L65371N1957r9717
1999.2H00906982l52478j92413k82593o0959J91803O2180M10233P4081l17993n55725
2008.8G99883118n6229J47934n3253J32065j14212J34735k62375m63791j96533J49612
$$ plain form
1941.3 800349579 799840546 798603210 799721527 800337524 800108490 799722519 799668503 799722519 799860535 799874420
1951 799874420 799674911 799777222 800102844 800286026 799878159 800023270 800135498 799984894 799875183 799743576
1960.6 799743576 800189362 800377960 800642853 800521393 800604630 800861053 800222702 800265198 800209045 799967651
1970.2 799967651 800068436 800730743 801339569 801318741 801252823 800800781 800714493 800657425 800361481 800462189
1979.9 800462189 800652466 800513229 800583420 801365433 801537704 801308746 801206512 801156311 800709076 800223770
1989.5 800223770 800772324 800761108 799950943 800061722 800561829 800536575 800589371 800954742 801006699 800906982
1999.2 800906982 800554504 800362091 800079498 800018539 800210342 800272522 800682755 800756836 800438843 799883118
2008.8 799883118 799826889 799974823 799921570 800053635 799939423 800074158 799811783 799347992 799151459 799301071
2018.5G99301071K04163m15726j59149l87879k65655K289J95617K65427j02158L07389
2028.1G98945389p7439n9814k31705o69327n08117j66931M56466j38473k14691O10
2037.7G97335968J76392L9901k70843L1509m67605j30463j81961l17993J30386L19977
2047.4G96665268M90646l06244l87420j16272J5411m4937k23312j77918o4468M65164
2057G96315918L16391L99628j9226m23356k09350r1400K96707l82004l5629L69263
2066.7G96536942L128J20544j7548J27030P6J32523j93024l44696J55411K4261K05307
2077.3G96749954J21536k0141P0267R536k40707o7368K75040p8201l5095K8381N8212
2087.9G96871414K66037l0212j84174K57645J15661k37121j36948j62124K55813K88468
$$ plain form
2018.5 799301071 799505234 799089508 798930359 798542480 798276825 798279114 798474731 798740158 798638000 798945389
2028.1 798945389 798867950 798808136 798576431 797907104 797398987 797232056 797688522 797550049 797335358 797335968
2037.7 797335968 797512360 797552261 797281418 797312927 796845322 796714859 796532898 796214905 796345291 796665268
2047.4 796665268 797155914 796849670 796462250 796345978 796361389 796316452 796093140 795915222 795850754 796315918
2057 796315918 796632309 797031937 797012711 796589355 796380005 796288605 796585312 796203308 796167679 796536942
2066.7 796536942 796540070 796660614 796643066 796770096 796770172 796902695 796709671 796364975 796520386 796544647 796749954
2077.3 796749954 796871490 796851349 796921616 796931152 796690445 796623077 796898117 796819916 796784821 796813202 796871414
2087.9 796871414 797137451 797107239 796923065 797180710 797296371 797059250 796922302 796760178 797015991 797304459
2097.5G97304459K73819K54898Q1253R3841l96652p172P3700j1444J74561q2779J14593
2108.1G97873077J57547K91367o1035j86920j39618k62375p0419m45099j71357M98810
2117.8G97483978Q29926J10092j40686L76205l17535m55170L357L19748k45285n03082
2127.4G97461548K2583L29666Q12683L71170K07977j6784n66788o28967k98004K32696
2137.1G97927780r6283J17874M41513K50245j96381j32828K64893l03803m48532k29721
2146.7G97594757j5259k54059K67868P67594J69449M10003J62278L9596k38418n09873
2156.4G98393936j12839J13068L61099j4038M40903N22995K25220r003m28696J39084
2166G99631729j03073j94321k64511J0681P52335L18298K72065L04412j54800k87018
$$ plain form
2097.5 797304459 797578278 797833176 797914429 798008270 797611618 797604446 797678146 797666702 797841263 797758484 797873077
2108.1 797873077 798030624 798321991 798260956 798074036 797934418 797672043 797601624 797156525 796985168 797483978
2117.8 797483978 798313904 798423996 798283310 798659515 798341980 797886810 797890167 798209915 797964630 797461548
2127.4 797461548 797484131 797813797 798626480 798997650 799205627 799188843 798622055 797993088 797695084 797927780
2137.1 797927780 797831497 797949371 798390884 798641129 798444748 798311920 798576813 798273010 797824478 797594757
2146.7 797594757 797579498 797325439 797593307 798360901 798530350 798940353 799102631 799142227 798903809 798393936
2156.4 798393936 798281097 798394165 798755264 798741226 799182129 799705124 799930344 799921341 799492645 799631729
2166 799631729 799528656 799334335 799069824 799080505 799832840 800151138 800423203 800727615 800572815 800285797
2175.6H00285797K04239n6534l59955L0289J53351L31192L40423P67289M40597J2360
2185.3H02149048k3499l92456J4191l7537j49765J3199L13645K98690L07618N72891
2194.9H03066025P7209K27204J22070k61765o55212n96695K24457L26996N59158M82788
2204.6H03572235L50189O3553q9645Q4152k59705l69415k92663L16619J32676L94973
2214.2H03902969R69010K50549K44446j08185l60870l10517n11856j57776K36740R6131
2223.9H04250641J24283O51703L46527K44293j33743l80555l738k21252J65176K17972
2233.5H05261307K63214K87399Q1406J21612M9515K28806j44348j64719k30484l98178
2243.2H05355530q8349Q5984M55703M72565J52512L8757J36871m82330n19333j11389
$$ plain form
2175.6 800285797 800490036 800433502 800073547 800103836 800257187 800588379 800928802 801696091 802136688 802149048
2185.3 802149048 802125549 801733093 801747284 801709747 801559982 801573181 801886826 802185516 802493134 803066025
2194.9 803066025 803143234 803370438 803492508 803230743 802575531 801978836 802203293 802530289 803089447 803572235
2204.6 803572235 803922424 803985977 803896332 803980484 803720779 803351364 803058701 803375320 803507996 803902969
2214.2 803902969 804871979 805122528 805366974 805258789 804897919 804587402 804075546 803917770 804154510 804250641
2223.9 804250641 804374924 805026627 805373154 805617447 805483704 805103149 805099411 804878159 805043335 805261307
2233.5 805261307 805524521 805811920 805893326 806014938 806064453 806293259 806148911 805984192 805753708 805355530
2243.2 805355530 805267181 805353165 805808868 806281433 806433945 806472702 806609573 806127243 805607910 805496521
2252.8H05496521j53961J09176P2480P56378O52008J19018o0958m48532o6987j66778
2262.4H06308365N875j84556p3700K59858j8845M60205L40576K28730j25275k23541
2272.1H06977692k03781l63007O6528J7548L58505O7978R9945M37851N4855j23825
2281.7H07390289k40555l05m56161q9417L32184J10474K06375K94418N25513m06952
2291.4H07665863l65219o6452j74332k40173n67322K61459J65177J76468K08969J19934
2301H07184372J36719k55661r3766m30984J12839o2256r7580M33655J5106M22058k44064
2311.6H07120438l69416l52020j6785O54068l36990j55258k47345k75498M79050J90201
2321.3H06690445p48520p4539J355286R8724j123734q63952M95758O52542k55814J75171
$$ plain form
2252.8 805496521 805342560 805451736 805524216 806280594 806932602 807051620 806990662 806542130 806475143 806308365
2262.4 806308365 806314240 806129684 806055984 806315842 806296997 806757202 807097778 807326508 807201233 806977692
2272.1 806977692 806773911 806410904 806477432 806494980 806853485 806921463 807021408 807459259 807514114 807390289
2281.7 807390289 807149734 807149429 806693268 806603851 806936035 807046509 807252884 807547302 808072815 807665863
2291.4 807665863 807300644 807234192 807059860 806819687 806252365 806513824 806679001 806855469 807064438 807184372
2301 807184372 807321091 807065430 806971664 806540680 806653519 806591263 806493683 806927338 806942444 807364502 807120438
2311.6 807120438 806751022 806399002 806382217 807036285 806699295 806544037 806296692 806021194 806500244 806690445
2321.3 806690445 805941925 805867386 807222672 807321396 806197662 805333710 805829468 806482010 806226196 806401367
2330.9H06401367M64554j66016q10852k0141k55738q23593o71920l48130L36991P8125
2340.6H04184647J92260n8059P34787N10025q20237n38024m71497O13403J202851P08236
2350.2H06258392k62146q50525k97012P97424O0273j577378P6676L03116k40937N47638
2359.8H04815521q99124j990204M94614K267609J21383j186981q15506R91364j43586
2368.5H03655090j972274j37635R25980N20859p25174M7989M08554j88294J35346l67585
2378.2H02302856L24860O23703j6785l63769k81448L29437M92477L79715j65100j82190
2387.8H03443756l78952o53534j55105p3090O5994J07651M25491Q8196n25131k01874
2397.4H02143402k42844O6452m730n09262k34451k29l9215k2659m8142l7689j04828
$$ plain form
2330.9 806401367 806865921 806699905 805889053 805868912 805613174 804789581 804117661 803769531 804106522 804184647
2340.6 804184647 804376907 804318848 805053635 805563660 804743423 804205399 803733902 804347305 805550156 806258392
2350.2 806258392 805996246 805145721 804848709 805646133 805706406 804129028 804205704 804508820 804267883 804815521
2359.8 804815521 803916397 801926193 802420807 804688416 804809799 803622818 802807312 803798676 803655090
2368.5 803655090 801682816 801545181 802471161 802992020 802266846 802314835 802723389 802535095 802670441 802302856
2378.2 802302856 802627716 803251419 803234634 802870865 802589417 802918854 803411331 803791046 803625946 803443756
2387.8 803443756 803064804 802411270 802256165 802183075 802249069 802356720 802782211 802870407 802345276 802143402
2397.4 802143402 801900558 801967010 801962280 801453018 801218567 801218338 801179123 801156464 801108322 801070633 800965805
2408.1H00965805n4398K73591k78016n14526k71454j71737N6533j45340L23639P6371
2417.7H00260468k41166J62583n31998o84280j83487j33286m32663j94626J82572Q9111
2427.3G98293228j58386l26309O714k63291l50036l19825l28064l0975l78723k5482
2437G96118851M71344K67715k69928o44455n61828l48359l9138j00022j56173k19422
2446.6G94518585r3689k26440k49024J8387j33209K34299L5400m09775n05066k71301
2456.3G92918167j47323m32358j74179l14637K75269L92303k43911k69699m28009j41297
2465.9G91434326n57480j31530K55432l05405J3428n8365J41525j18179l24402j98135
2475.6G90151215o01273j61209j6785m75235m69589P172m6616j60675J43585R7733
$$ plain form
2408.1 800965805 800911407 801184998 800906982 800392456 800121002 799949265 800005798 799860458 800184097 800260468
2417.7 800260468 800019302 800181885 799649887 798965607 798782120 798648834 798216171 798021545 798204117 798293228
2427.3 798293228 798134842 797808533 797815247 797551956 797201920 796882095 796554031 796523056 796144333 796118851
2437 796118851 796590195 796857910 796587982 795943527 795381699 795033340 794994202 794894180 794738007 794518585
2446.6 794518585 794424896 794198456 793949432 793967819 793834610 794068909 794104309 793694534 793189468 792918167
2456.3 792918167 792770844 792338486 792164307 791849670 792124939 792517242 792273331 792003632 791575623 791434326
2465.9 791434326 790876846 790745316 791000748 790695343 790708771 790650406 790791931 790673752 790349350 790151215
2475.6 790151215 789549942 789388733 789371948 788896713 788427124 788434296 788387680 788227005 788370590 788468323
2485.2G88468323p2022k29492p2327k94723m22516j54800j83945m3564R4833K99378
2494.8G87389145K65350j20468l75824k28882l53851n31998q1253j85089l96042k10266
2504.5G85170822J98441N76095L92914j59836n98449m25721l49884k78778R5978L20969
2514.1G84942551O7291k56806j29623N8670K4338n12161n62134l38287k43302k07977
2523.8G82842560l13950L66059M73327p7896l58429M5166K12860o19888o08444n03693
2533.4G81457672k95563O5308K5558N1117m9972o8970k18811R003r5825l90854n38559
2544G79950104p79724l73001k0676K11410K9602L10975L46832m91791p09457q38929
2553.7G77635345m34265k91443j28707J10626o1341K64893J22147J72119K24380j13449
$$ plain form
2485.2 788468323 788396301 788166809 788094482 787799759 787377243 787222443 787038498 786994934 787089767 787389145
2494.8 787389145 787654495 787534027 787158203 786929321 786575470 786043472 785962219 785777130 785381088 785170822
2504.5 785170822 785369263 785945358 786338272 786178436 785579987 785154266 784804382 784525604 784621582 784942551
2514.1 784942551 785009842 784753036 784623413 784682083 784706421 784194260 783632126 783293839 783050537 782842560
2523.8 782842560 782528610 782894669 783367996 783290100 782931671 782976837 783189697 782569809 781961365 781457672
2533.4 781457672 781162109 781227417 781252975 781304092 781254120 781185150 780966339 780975342 780879517 780488663 779950104
2544 779950104 779170380 778797379 778776703 778988113 779017715 779328690 779675522 779183731 778474274 777635345
2553.7 777635345 777201080 776909637 776780930 776891556 776830215 777095108 777217255 777389374 777613754 777500305
2563.3G77500305n78155p84150m91027l21961p9040k40021J89056K99454j72195o3172
2573G75259094l58658l70559o67267o75125J07498J93176o3629j00403J2436M9896
2582.6G73386459n2337n58625o14624n90972o28739R0027J33362r9945K69699L05633
2592.2G71639938m1656o5537l20816l80554m04281q26111p8049K68326n0125j04523
2601.9G69636612L4714J67312j25732J31760l94593q15124l76969k9297l9978p49130
2611.5G67439575k34375M9973j81198J00936j05972l81622m74625k25906n05066n67627
2621.2G64914093j35879J0223j18713m15345n2337M8828m79126j032944o16302j61744
2630.8G61960754k76718K65961J71051k53677l03650j74408m36096p86591m89578n21088
$$ plain form
2563.3 777500305 776922150 776138000 775646973 775325012 775245972 775005951 775195007 775494461 775322266 775259094
2573 775259094 774900436 774529877 773862610 773187485 773294983 773488159 773424530 773324127 773336563 773386459
2582.6 773386459 773334122 772775497 772160873 771569901 770941162 771031189 771164551 771064606 771334305 771639938
2592.2 771639938 771598282 771532745 771211929 770831375 770427094 769600983 769522934 769791260 769741135 769636612
2601.9 769636612 769671326 769838638 769712906 769844666 769450073 768634949 768257980 768228683 768188705 767439575
2611.5 767439575 767205200 767255173 767073975 767174911 767068939 766687317 766212692 765986786 765481720 764914093
2621.2 764914093 764778214 764788437 764669724 764254379 764202042 764250870 763771744 762738800 762122498 761960754
2630.8 761960754 761684036 761949997 762121048 761867371 761563721 761389313 760953217 760166626 759677048 759155960
2640.5G59155960o12717n24063K20566M45252k40860o72532r12933m36249j28860j27182
2650.1G56166382n88226m29688P6065o92673n18951j18179j50528j34125l61633m03595
2659.8G52844849l65906l09143l23639Q9493o1264j88752k14462q05969l26691P2403
2669.4G50410919j60141n31997n19639j91497j93634l2044k01263j94550j38550n02548
2679G47745056m31061o6070j71128m05731l95126l73917n9280k22550n48400n95932
2688.7G44475861l90854J00021k65579o93283m52042Q0032K54670K12783r0026o44760
2698.3G42586823m33884m15192l89404m93698p22122n41611l03192K65426l5476n9662
2708G39458008m8447r29031q82035n55877j77384j01699k67182o9351l69797m28009
$$ plain form
2640.5 759155960 758543243 758019180 758239746 758684998 758444138 757771606 756858673 756422424 756293564 756166382
2650.1 756166382 755578156 755148468 755224533 754531860 754012909 753894730 753744202 753610077 753248444 752844849
2659.8 752844849 752478943 752169800 751846161 751935654 751874390 751685638 751471176 750665207 750338516 750410919
2669.4 750410919 750250778 749718781 749199142 749007645 748814011 748781967 748580704 748386154 748247604 747745056
2679 747745056 747313995 747247925 747076797 746671066 746275940 745902023 745842743 745620193 745071793 744475861
2688.7 744475861 744085007 744185028 743919449 743226166 742774124 742854156 743108826 743321609 743231583 742586823
2698.3 742586823 742152939 741737747 741348343 740854645 740132523 739590912 739287720 739553146 739517670 739458008
2708 739458008 739409561 738480530 737598495 737042618 736865234 736763535 736496353 736427002 736057205 735629196
2717.6G35629196L0594L8681l3035l36838j047745p21969K04467K12708m58679l02582
2727.3G33214798p6294m92859L2654J2894m88129n24902q18482n88150J82800L96576
2736.9G30850906k87017j5564k5940l37296K55737m57611p02438k82059j49841q7967
2746.5G28760910m16031j07269P8354r2316l88107m38919m59824m86221j65405k10801
2756.2G26074371o7138R9716K48489J9379j70975j92871o10428j78833j43051l47214
2765.8G24731445j32065j10855j18789n48935m77524J21765K66419k14463k72445l94135
2775.5G22850418r85031m09012K30713j9150m32968k46887K8610l58581p71027p01904
2785.1G19185181j55487j1292J450j18409k65960m61884r58633n46341l42255l87039
$$ plain form
2717.6 735629196 735659790 735698471 735665436 735328598 734280853 733558884 733763351 733976059 733517380 733214798
2727.3 733214798 733138504 732645645 732678299 732691193 732203064 731678162 730859680 730271530 730454330 730850906
2736.9 730850906 730563889 730548325 730522385 730185089 730440826 729983215 729280777 728998718 728848877 728760910
2746.5 728760910 728344879 728237610 728315964 728223648 727835541 727396622 726936798 726450577 726285172 726074371
2756.2 726074371 726007233 726106949 726355438 726374817 726203842 726010971 725400543 725221710 725078659 724731445
2765.8 724731445 724599380 724488525 724369736 723820801 723343277 723465042 723731461 723516998 723244553 722850418
2775.5 722850418 721865387 721456375 721687088 721667938 721234970 720988083 721016693 720658112 719887085 719185181
2785.1 719185181 719029694 719018402 719019852 718901443 718635483 718173599 717214966 716668625 716326370 715939331
2794.8G15939331j25275k50320n21164o47964k56653l10974m27247m40750r92965r20258
2804.4G11045761l99170k08587n67551n89676k58713q18100r79461l12806l13491o14243
2814G05983963p84760q76235m80118k78473m46320p15790q73107o45371q90579j130905
2823.7F98862305q57392p30056m35791n51453j080780p74002m01764m61350q01239
2832.4F92768478j011276o80694j173096j473770r45053p88193q12302j015548r09653
2841.1F83958893j140137j619491j730423j395569q97217j526871j444626j369705
2848.8F72834854k017059j181107p31811j008072q52890j006928j290435q90961n51758
2857.4F63303833p57065p37762n43671l01819n43899j100083j375122j097336j024856
$$ plain form
2794.8 715939331 715814056 715563736 715042572 714394608 714137955 713826981 713399734 712958984 711966019 711045761
2804.4 711045761 710646591 710438004 709870453 709280777 709022064 708203964 707224503 706911697 706598206 705983963
2814 705983963 705199203 704322968 703842850 703564377 703118057 702402267 701529160 700883789 699993210 698862305
2823.7 698862305 698004913 697274857 696839066 696287613 695206833 694432831 694031067 693569717 692768478
2832.4 692768478 691757202 691076508 689903412 688429642 687484589 686696396 685884094 684868546 683958893
2841.1 683958893 682818756 681199265 679468842 678073273 677176056 675649185 674204559 672834854
2848.8 672834854 670817795 669636688 668904877 667896805 667043915 666036987 664746552 663855591 663303833
2857.4 663303833 662546768 661809006 661265335 660963516 660419617 659319534 657944412 656847076 655822220
2866.1F55822220j381912j240616j560517j528091j312714j437988j131287j503982
2873.8F44725113j821442j733474j358147j215935j482849j618538j852608j258316
2881.6F32383804p91473n45960n51872r08127o96716j064796q60939k15683l48664
2890.2F26399574p01561o69212m9934J2054l2158k44789o04362o54793l19405K76604
2899.9F23412018k01454m89273l18413m78287n59158p96204m78744K2239m50287q35304
2909.5F18827133n99136j211968j387710j022301j440010r94225j032218j985207j911926
2918.2F07242432j321869r98535j054802j114540j460267j369972k45857L71551n15937
2926.9E99532204j107140k01988K2507J63002P01675K10571K80991R41467J122284
$$ plain form
2866.1 655822220 654440308 653199692 651639175 650111084 648798370 647360382 646229095 644725113
2873.8 644725113 642903671 641170197 639812050 638596115 637113266 635494728 633642120 632383804
2881.6 632383804 631592331 631046371 630494499 629586372 628889656 627824860 626963921 626748238 626399574
2890.2 626399574 625698013 625028801 624978867 624990921 624958763 624713974 624109612 623454819 623135414 623412018
2899.9 623412018 623210564 622721291 622402878 621924591 621365433 620569229 620090485 620112724 619662437 618827133
2909.5 618827133 618227997 617016029 615628319 614606018 613166008 612171783 611139565 609154358 607242432
2918.2 607242432 605920563 604922028 603867226 602752686 601292419 599922447 599676590 600048141 599532204
2926.9 599532204 598425064 598223076 598245583 598408585 599110260 599320831 599601822 600543289 601665573
2935.6F01665573J383438J451836J370964J466293J765480K048111J354599Q84705
2943.3F13390999J254082J708984K094421J591111J676216K133674J785355J808853
2951F27443695J958237J743240J199570J291122J590805J576386J748123J834335J955490
2959.7F42341003J494065J305847J452560J113510J341401J952743J868820J162415
2967.4F54032364J195602J362686J185990J697311J798706J139527R29641R22242Q98742
2976.1F65162811J276551J344070R87167J051331J425095J061172N37109R27964J250686
2984.7F75023956J023026M53949N15442Q34732O20498N59616K51160O51398R57336
2993.4F80891113L08533M38461M41819M9209N3787K34528N06744P5226l36227L58886
$$ plain form
2935.6 601665573 603049011 604500847 605871811 607338104 609103584 611151695 612506294 613390999
2943.3 613390999 614645081 616354065 618448486 620039597 621715813 623849487 625634842 627443695
2951 627443695 629401932 631145172 632344742 633635864 635226669 636803055 638551178 640385513 642341003
2959.7 642341003 643835068 645140915 646593475 647706985 649048386 651001129 652869949 654032364
2967.4 654032364 655227966 656590652 657776642 659473953 661272659 662412186 663341827 664264069 665162811
2976.1 665162811 666439362 667783432 668770599 669821930 671247025 672308197 672845306 673773270 675023956
2984.7 675023956 676046982 676500931 677016373 677851105 678471603 679031219 679282379 679933777 680891113
2993.4 680891113 681199646 681638107 682079926 682129135 682182922 682417450 682924194 682999420 682663193 683022079
3003.1F83022079K2507n19485j0453l70407l10745K57263J01700m22058j13602P9346
3012.7F81736145j049499n00336O1188k67640o4315m77143o38122n21775j31912m89197
3022.4F77657394j268692r67865n98144l95813m96063j32447k81067j115417r62296
3031F71439590n81970m51660p88193r96856o81305n30777p14188o95801n93338r23538
3040.7F64481964q01010n46799o97632r30404j068573p55615m95224q82035q40378
3049.4F57464294p07168j435776j192703o21185l14560l02353r38874p77359r61380
3058F50212936q78524o91605j186218q60825p30438q54416q11462m53873p37534j284332
3067.7F41723709p64847q84018r99260p81211p18842o47812r84535j033249o51360
$$ plain form
3003.1 683022079 683044586 682525101 682514648 682144241 681833496 682090759 682192459 681770401 681656799 681736145
3012.7 681736145 680686646 680186310 680247498 679979858 679915543 679438400 678800278 678278503 678146591 677657394
3022.4 677657394 676388702 675420837 674822693 674426880 673930817 673798370 673517303 672401886 671439590
3031 671439590 670857620 670405960 669617767 668620911 667939606 667408829 666694641 665998840 665405502 664481964
3040.7 664481964 663680954 663134155 662436523 661506119 660437546 659681931 659186707 658304672 657464294
3049.4 657464294 656757126 655321350 654128647 653507462 653192902 652890549 651951675 651174316 650212936
3058 650212936 649334412 648642807 647456589 646595764 645865326 645010910 644199448 643745575 643008041 641723709
3067.7 641723709 640958862 640074844 639075584 638294373 637575531 636927719 635943184 634909935 634258575
3076.4F34258575n83267q81538p95746p23267r60617j144600p54013l80478r96513
3085F27038536j146088r43145j181832j102981l17269l77311j124497p27386q84705
3093.7F19233322j010055o23398r25522q22449o77376q80241j051674r59549j002197
3102.4F11280861q91914o53763p02439o31179q71544r59244j199837j342125q31146
3111.1F03197670k41470n8632p98416j056443j347046j450576m82674n56259j251221
3119.8E95954933j021118n49507q06732j067849p36694n25055q64181j146202r41887
3128.4E88295708p70111p68547r69849o08025o49299j097565r36813j082611n51949
3137.1E80860939k15530o86455j194191j359406j024246j086578o55861l67737p18307
$$ plain form
3076.4 634258575 633675308 632793770 631998024 631274757 630314140 629169540 628415527 628035049 627038536
3085 627038536 625892448 624949303 623767471 622664490 622347221 621969910 620845413 620118027 619233322
3093.7 619233322 618223267 617599869 616674347 615851898 615174522 614294281 613242607 612283058 611280861
3102.4 611280861 610388947 609735184 609032745 608401566 607530022 606570778 605370941 604028816 603197670
3111.1 603197670 602956200 602897568 602099152 601042709 599695663 598245087 597762413 597206154 595954933
3119.8 595954933 594933815 594384308 593577576 592509727 591773033 591247978 590383797 589237595 588295708
3128.4 588295708 587525597 586757050 585787201 585179176 584529877 583432312 582495499 581412888 580860939
3137.1 580860939 580645409 579958954 578764763 577405357 576381111 575294533 574638672 574270935 573552628
3145.8E73552628r23500p63054q36792j113434n46456q63037r83238o78863j206475
3154.5E65637779r06143m70123n29099r47342r53903o76842o99081o07986r61876j102868
3164.1E57782516m70809m46434j449357r60960j67274q26416q46291m24652m52347
3172.8E51737976j108894r73015o69403q76579p34864r59472l44124l58162j047707
3181.5E44665756p20939m33464q99277j558266p19871k93656p72056o52695o69136
3190.1E37946396j167565j060905j96648k44636l82805p92885r75571n42182o11382
3198.8E31971817m81491q63266o16570n71556j162567q25996o73599q32024q22678
3207.5E25122070P4501j93824r07555n27763r49173p65686j35422j64414p45697o47812
$$ plain form
3145.8 573552628 572629128 571866074 571029282 569915848 569369392 568506355 567523117 566844254 565637779
3154.5 565637779 564731636 564261513 563732414 562785072 561831169 561154327 560455246 559847260 558885384 557782516
3164.1 557782516 557311707 556865273 555415916 554454956 554287682 553461266 552614975 552190323 551737976
3172.8 551737976 550629082 549656067 548986664 548110085 547375221 546415749 546071625 545713463 544665756
3181.5 544665756 543944817 543511353 542612076 541053810 540333939 540040283 539268227 538615532 537946396
3190.1 537946396 536778831 535717926 535521278 535276642 534893837 534100952 533125381 532583199 531971817
3198.8 531971817 531490326 530627060 530010490 529438934 528276367 527450371 526776772 525944748 525122070
3207.5 525122070 525196571 525002747 524095192 523567429 522618256 521852570 521717148 521552734 520807037 520159225
3217.2E20159225k21595r14193j155624n68619k32505o60744n03845l02697o58607
3225.8E14940796p71980j046029k89268J19209m35257p35473q18482r59739q48961
3234.5E09154816o5194k73284p23305q12721m98887r4184m29306j52703m03137q92982
3244.2E04809113j018754r22317k37007o9237l12424m37317m00199p07322k27813k27204
3253.8E00249519j197204n26085l47138p45391m80767n1346L014m20341m55323o17294
3263.4D95411644o48766o27021n72243m63638k08016J80206m14505o62651M0131Q8806
3273.1D92123947q12034q20008n38749q77572k79541M9286l40042m73404j81999l56522
3282.7D87493362o48689k49672n65567n73807k67143l26233k88353m83131j24474p6141
$$ plain form
3217.2 520159225 519937630 519023437 517867813 517299194 517066689 516405945 515902100 515599403 514940796
3225.8 514940796 514168816 513122787 512833519 512952728 512517471 511781998 510963516 510003777 509154816
3234.5 509154816 509089622 508816338 508093033 507280312 506781425 506687241 506257935 506105232 505702095 504809113
3244.2 504809113 503790359 502868042 502631035 502561798 502249374 501812057 501411858 500704536 500476723 500249519
3253.8 500249519 499052315 498526230 498179092 497433701 496952934 496901588 496904602 496484261 496028938 495411644
3263.4 495411644 494762878 494135857 493563614 493099976 492891960 493072166 492657661 491995010 492035141 492123947
3273.1 492123947 491311913 490491905 489953156 489075584 488796043 488845329 488505287 488031883 487849884 487493362
3282.7 487493362 486844673 486595001 486029434 485455627 485188484 484862251 484573898 484090767 483966293 483890152
3292.4D83890152l39890K9603k51465p35360m69856n34324n57976q39p3548o12030
3302D80344467r44099p07436Q3809M12827j96648p73926q17909p34482o26984m01687
3311.7D75637932N455l99361n43327k86484o26182l51143m20266l62930m73327m00506
3321.3D71779861L44696n77926q95538p04232p43370n98717p16362k39105n66444o71768
3330.9D66411095n31350n12504n13077q89091k6741j8082n59692l42102o43616p06215
3340.6D61668625n01213n20592o69632p92122p21626m02222n68084p30401l52783j68457
3350.2D56241493o00357j142921m98734m05083n39169k91900o88782j42174k83012
3358.9D51649361j099396r04961m12216k61536n86586m68292l35579l24974m91829
$$ plain form
3292.4 483890152 483550262 483579865 483328400 482593040 482123184 481588860 481030884 481030045 480956497 480344467
3302 480344467 479400368 478692932 478776741 479189568 478992920 478218994 477401085 476666603 476039619 475637932
3311.7 475637932 475643387 475244026 474700699 474414215 473788033 473436890 473016624 472653694 472180367 471779861
3321.3 471779861 472124557 471546631 470651093 469946861 469203491 468604774 467888412 467649307 467082863 466411095
3330.9 466411095 465879745 465367241 464854164 463965073 463938332 463920250 463360558 463018456 462374840 461668625
3340.6 461668625 461167412 460646820 459977188 459185066 458463440 458061218 457493134 456762733 456409950 456241493
3350.2 456241493 455641136 454498215 453999481 453594398 453055229 452763329 452074547 451932373 451649361
3358.9 451649361 450549965 449645004 449232788 448971252 448384666 447916374 447580795 447255821 446763992
3367.6D46763992p43904p79609r88961p56263n02358k95334J99242j06354r30443p59926
3377.2D41100082n44471n80140M3870L7651p64199j183243l38172j44272q39920j75553
3386.9D36611633j10511l01476l2272k44751j31722l66478j008682m25339L23372m41170
3396.5D33872604n51262K14615l39965o50635j33515r994l04375k26326J34125j19057
3406.2D31886215n33638j20773j6327k03133J6175n54352o08635J16234K25601j3886
3415.8D30193481j59835k94533k99530J84707l06968l60604K52953k11411n7144M57878
3425.5D29398994O87561K74964k96135n94063m22554L31955M8065l01933n4321L00293
3435.1D29372826K38494J0071K53754P45468O31981m87823k2164J07155k17247O69632
$$ plain form
3367.6 446763992 446020088 445240479 444251518 443495255 442992897 442697563 442896805 442790451 441860008 441100082
3377.2 441100082 440555611 439975471 440019341 440056992 439292793 438109550 437771378 437627106 436787186 436611633
3386.9 436611633 436501122 436199646 436167374 435922623 435790901 435424423 434415741 433990402 434313774 433872604
3396.5 433872604 433321342 433535957 433195992 432545357 432411842 432401848 432097473 431871147 432005272 431886215
3406.2 431886215 431352577 431231804 431215477 431012344 431028519 430474167 429865532 429981766 430207367 430193481
3415.8 430193481 430033646 429739113 429439583 429624290 429317322 428956718 429209671 428998260 428941116 429398994
3425.5 429398994 430086555 430361519 430065384 429471321 429048767 429380722 429428787 429126854 429072533 429372826
3435.1 429372826 429611320 429621391 429875145 430620613 431252594 430764771 430742607 430849762 430632515 431302147
3444.7D31302147Q34923O41746r50241n80368O95953N31273P41577M51050M08058N8709
3454.4D34134827L75824Q60481K21100K48222K55051M83970M03443K70920L73230P67173
3464D38394241J010819J83410j77688J60904J103859M48723r7428J072502O60859L86619
3473.7D43146820M05922M07372P06863M99802N97038N16014J54877K2964l8719N08957
3483.3D46927910J741791Q01010j28899J442146Q20313n83000O1989N05523O77490
3492D52266273R69773J075859J071663O07986K43721Q65517R65462P91168J95808m9514
3501.6D59003716L38287M9057Q75091J379624J124916Q87260Q34847K8572o49948R78279
3511.3D64849701J128502R39560J021499Q11921R33494L91617N83000N04685M32052
$$ plain form
3444.7 431302147 432137070 432778816 431828575 431248207 431944160 432475433 433217010 433668060 434076118 434134827
3454.4 434134827 434510651 435371132 435592232 435840454 436095505 436579475 436982918 437253838 437627068 438394241
3464 438394241 439405060 439588470 439410782 439571686 440675545 441124268 441026840 442099342 442760201 443146820
3473.7 443146820 443552742 443960114 444666977 445166779 445763817 446279831 446434708 446457672 446418953 446927910
3483.3 446927910 448669701 449470711 449341812 450783958 451604271 451021271 451083260 451588783 452266273
3492 452266273 453236046 454311905 455383568 455991554 456235275 457100792 458066254 458857422 459053230 459003716
3501.6 459003716 459342003 459391060 460266151 461645775 462770691 463657951 464492798 464521370 463871422 464849701
3511.3 464849701 465978203 466917763 467939262 468751183 469684677 470076294 470659294 471163979 471596031
3520D71596031J176987J521492O53686n33142L00064R22509J180610J059876N61676
3528.6D78439789M76990J254043J045990L30658J377373J322937J128387R1439l33443
3537.3D85134163J281013R78585R42154J169662J895027R75037j2512K55508o2408
3546D92556229J627578M47922J244698J614456J297874K381478k90070P78351J023369
3554.7E02681885J015777J464539J27640J790809J238556N02091J193657K446479J049653
3563.4E13511086M08096M128189L64036p78465n14908n20248L540268J813888J698342
3572E23650284J635055J530342J555405J253357J603775N66635K474671J856727P92008
3580.7E36918259J833458K050743J435928L95317L727799J350250j819000K843933
$$ plain form
3520 471596031 472773018 474294510 474948196 474415054 474715118 475637627 476818237 477878113 478439789
3528.6 478439789 478916779 480170822 481216812 481547470 482924843 484247780 485376167 485467606 485134163
3537.3 485134163 486415176 487393761 488335915 489505577 491400604 492375641 492363129 492618637 492556229
3546 492556229 494183807 494631729 495876427 497490883 498788757 501170235 500880165 501658516 502681885
3554.7 502681885 503697662 505162201 505289841 507080650 508319206 508821297 510014954 512461433 513511086
3563.4 513511086 513919182 518047371 518411407 517632942 517118034 516597786 520138054 521951942 523650284
3572 523650284 525285339 526815681 528371086 529624443 531228218 531794853 534269524 536126251 536918259
3580.7 536918259 538751717 540802460 542238388 542633705 546361504 547711754 545892754 548736687
3588.4E48736687J03454K269898L361816K675743K46163P78579L458329j97258K728347
3597.1E64161758K802735P80906L291398M12063q8920J984825K407875K283516K825050
3605.8E80861206J897011p29103M094085p17239Q9073P557373p77015k991944M347649
3614.5E93631096K35519M606133M169426j397667J349296j67884J454277L083763K105522
3623.1F09069481K506637K462044J638108K340507N867310l452797j0834999O258392
3630.9F15854683O214752O032066N10521k970466K365722L679810K456932L95165J391105
3639.5F35930290J345597J713600J448745N22919K013626K937012N302200k244262
3647.3F48969727l833466O179428j527862m077836Q15812O290588M159241L572845
$$ plain form
3588.4 548736687 548840141 551110039 554471855 557147598 557393761 558172340 561630669 561433411 564161758
3597.1 564161758 566964493 567745399 571036797 571448860 571359940 573344765 575752640 578036156 580861206
3605.8 580861206 582758217 582029114 586123199 585405960 585495033 593052406 592275391 589283447 593631096
3614.5 593631096 593866615 598472748 602642174 601244507 602593803 602425919 603880196 606963959 609069481
3623.1 609069481 611576118 614038162 615676270 618016777 623884087 620431290 609596291 615854683
3630.9 615854683 622069435 628101501 628612022 625641556 628007278 631687088 634144020 634539185 635930290
3639.5 635930290 637275887 638989487 640438232 640961151 642974777 645911789 651213989 648969727
3647.3 648969727 645136261 651315689 649787827 645709991 646525803 652816391 656975632 660548477
3655F60548477L906479q437881J738052M461441J264877J419449R689J724244J146087
3663.6F67780914J193695J038437J183472M687042J784668j563186j641999p085495
3671.4F67377548L562241R043884Q359604m011307j7142181M790573P902985L737869
3679.1F83621216k759857J361160L738327J392136O34460L98102J267929M495315L992310
3687.8F98141098j1326447j068Q350373p051697P26776O059647J261062J104813j4572
3696.4F97249985L72009J042938J01242L013687K996064n490799j739273M712753J561966
3705.1G03820572J87530P93305L666077L380584q842087L885193M061127j2563858
3712.8F98388443M127960L955383O00281Q17719K462463J409531l624268J456146N695420
$$ plain form
3655 660548477 664454956 656017075 657755127 662216568 663481445 664900894 664910583 666634827 667780914
3663.6 667780914 668974609 670013046 671196518 675883560 677668228 676105042 674463043 667377548
3671.4 667377548 670939789 679983673 688343277 684331970 667189789 671980362 679883347 683621216
3679.1 683621216 680861359 682222519 685960846 687352982 687987442 688385544 689653473 694148788 698141098
3687.8 698141098 686814651 686813583 695163956 688112259 688839035 694898682 696159744 697264557 697249985
3696.4 697249985 697621994 698664932 698766174 701779861 704775925 699285126 697545853 702258606 703820572
3705.1 703820572 704008102 704801407 708467484 711848068 703005981 706891174 710952301 698388443
3712.8 698388443 702516403 706471786 707072067 707889786 710352249 711761780 708137512 709593658 715289078
3721.5G15289078m058533l778763M888840k1744j157760j249924J744613L184510P56454
3730.2G15596771N624542l634109o724243Q060150j982269r766541K853775L732071
3737.9G13760147N65949L419952K740478l900375M136734J0384903j5095138j3230820
3745.6G02781830J1628952O615295P059632l598862j0753326J0254058q282547m950256
3753.3G10754776P003326M900818K940903n558853L100281N612182p901611q89588
3761G19962234M428101J108399N79223L127747l627091l310470L896331L922043j796112
3769.7G28290405p729797L894882K987747L07541P51038j107025N15594Q53348L337021
3778.4G32100754j502609p633591L518371K679749K057648J529388l696442j72424
$$ plain form
3721.5 715289078 711230545 707451782 712340622 712318878 711161118 709911194 711655807 714840317 715596771
3730.2 715596771 721221313 717587204 710862961 718923111 716940842 707174301 710028076 713760147
3737.9 713760147 714326096 717746048 720486526 716586151 720722885 731107788 716012650 702781830
3745.6 702781830 714410782 721026077 728085709 724486847 713733521 723987579 715705032 710754776
3753.3 710754776 717758102 722658920 725599823 720040970 723141251 728753433 720851822 719962234
3761 719962234 724390335 725498734 726077957 729205704 725578613 722268143 726164474 730086517 728290405
3769.7 728290405 720560608 724455490 727443237 727750778 728501816 727394791 727910385 728763733 732100754
3778.4 732100754 730598145 722964554 726482925 729162674 731220322 732749710 729053268 728880844
3786.1G28880844J654053J050949O99081j30233L10745P2784p3776o14166J993637
3794.8G33843918L591003m601211m244232L280868N292206L999176j1885986p906418
3802.5G21369324O755371M125061N316620M668426j1400757k807159N326157J244125
3810.2G34597168M44031J207504Q16498K308502M960251n431748j3063659P488861
3817.9G33327408O079712L448791j357040j7332611M952926O479035K789230K523117
3825.7G40910568j433410m392395M67147K103272L982010R45434r016418M249496P609635
3834.3G45425339o619721j33590P071380r555054k253189P219315n652924Q23059O267624
3843G42592239l110885l028870L084412J520157M30755J430130j307678K842941N867234
$$ plain form
3786.1 728880844 730534897 731585846 732284927 732154694 732465439 732538223 732464447 731850281 733843918
3794.8 733843918 737434921 732833710 728589478 731870346 737162552 741161728 729275742 721369324
3802.5 721369324 728124695 732249756 737566376 742234802 730834045 728026886 733353043 734597168
3810.2 734597168 735041199 736248703 737065201 739373703 744333954 738902206 725838547 733327408
3817.9 733327408 739407120 742855911 741498871 724166260 729119186 735598221 738387451 740910568
3825.7 740910568 739477158 735084763 735551910 737655182 741637192 742582626 733566208 737815704 745425339
3834.3 745425339 738805618 738672028 745743408 736188354 733935165 741154480 735501556 736324615 742592239
3843 742592239 739481354 736452484 739536896 741057053 741487808 742917938 741610260 744453201 750320435
3851.7G50320435p070237j634521j6415253N031357J0728836j436386k19116L045044
3859.4G42350159K593002K126999n968704J143722N920487p486573l426818M780349
3867.1G42032623M909363M829331q571396p621842M627075O635209K318191j0919495
3874.8G38239059J540833M268417O6452K342072L985138n495758n729752O127472J204910
3883.5G46548843K6703J380310j1658172L914489N369568J451264L990555k555008
3891.2G48468552r167176L349228M170456j320648N11703O55900L061294R69696q698273
3899.9G42000732N630265n2796m750900M700775m314728j94168J247101Q55484K590332
3908.6G47712097k35367l69644j27258M48685J58691K0370J745911J277008l993454
$$ plain form
3851.7 750320435 743250198 741615677 725200424 730231781 740960617 739524231 739305115 742350159
3859.4 742350159 744943161 747070160 741101456 742245178 748165665 740679092 737252274 742032623
3867.1 742032623 746941986 751771317 743199921 735578079 740205154 746840363 749158554 738239059
3874.8 738239059 739779892 744048309 744114761 746456833 750441971 744946213 739216461 745343933 746548843
3883.5 746548843 746575546 747955856 736297684 740212173 745581741 747033005 751023560 748468552
3891.2 748468552 739301376 742650604 746821060 745500412 746012115 746668015 749729309 750699005 742000732
3899.9 742000732 747630997 747578201 742827301 747528076 743213348 743019180 744266281 745121765 747712097
3908.6 747712097 747476730 747107086 746979828 747428513 747587204 747607574 749353485 750630493 746637039
3917.3G46637039k228393M341430r46350k873916K902984J738892R27429l565140k488327
3926G44445648L188400J721192M48074k145767k89078K168961l157883p25860J909790
3934.6G47563477K30712O09436L36686N32226L92227n56564K079849J632157m756089
3943.3G48064117j002883J601486Q75168J058197k208558L7156j55716j284409K288437
3952G49272995K30789k17819M84848M44489L63922j340180j31531Q2245O38199K08206
3961.6G50036163j162948J151657J009979o01349o07986K55737M61350o12946k31857
3970.3G49697800R05761L78266j66092P5531K29721M12750q62121n17121O22559J00860
3980G50877914K42463m65775m01916R02862M62570p92618l91922N03769L14942N69763
$$ plain form
3917.3 746637039 744408646 748750076 747803726 744929810 747832794 749571686 750499115 746933975 744445648
3926 744445648 747634048 749355240 749803314 747657547 747368469 749537430 746379547 745653687 747563477
3934.6 747563477 747794189 748403625 748740311 749272537 749664764 749108200 751188049 752820206 748064117
3943.3 748064117 747061234 748662720 749537888 750596085 748387527 748424683 748268967 746984558 749272995
3952 749272995 749503784 749285965 749770813 750215302 750579224 749239044 749107513 749189758 749827957 750036163
3961.6 750036163 748873215 750024872 751034851 750433502 749825516 750081253 750542603 749929657 749697800
3970.3 749697800 750603561 750981827 750815735 750891266 751120987 751533737 750671616 750154495 750777054 750877914
3980 750877914 751120377 750654602 750252686 751155548 751618118 750825500 750433578 750937347 751252289 751822052
3989.6G51822052k57187l50952K38800l50037n56259r88693M43802J573257O27518
3998.3G52202301J36795j77307
4000.2G52161789
$$ plain form
3989.6 751822052 751564865 751213913 751452713 751102676 750546417 749557724 750001526 751574783 752202301
3998.3 752202301 752339096 752161789
4000.2 752161789
##END=$$ End of the data block
