##TITLE=$$ Begin of the data block
##JCAMP-DX=5.00 $$ ACD/SpecManager v 10.08
##SPECTROMETER/DATA SYSTEM=Varian
##DATE=20 Nov 2012 13:42:16
##DATA TYPE=INFRARED SPECTRUM
##DATA CLASS=XYDATA
##ORIGIN=
##OWNER=
##NPOINTS=3735
##FIRSTX=399.26403809
##LASTX=4000.35498047
##MAXX=4000.35498047
##MINX=399.26403809
##MAXY=77.99900818
##MINY=30.87641144
##XFACTOR=1.0000000000
##YFACTOR=0.000000100000000
##FIRSTY=58.05113220
##DELTAX=0.96440572
##XUNITS=1/CM
##YUNITS=TRANSMITTANCE
##XYDATA=(X++(Y..Y))
399.3E80511322L864594M486007m241180k862892l580284l504258L29209M302864k076378
407.9E77229004j0058937k07329O352577K485657K814636N935517J454849j183357
415.7E84822617j812287J78261N697746j6331291p833099O274528O196213P43294k939606
424.3E74996376m970055j478653M207345j97678o27289j308975n504761l545799j82877
433E61387634J843949m13971L16314N01824j927910k403221k784767K578201J454163
441.7E60552216m25950O724396M306641r37119Q41027N23376M006N201530K352142
450.4E79142265k523498J142959n836l529930J130676L095818K52418K015000j413651
459.1E79306221k559471K04773M89311L20358j42364j178436l98407j417275m781837
$$ plain form
399.3 580511322 584375916 588861923 584620743 581757851 578177567 574673309 575002518 579305382 577229004
407.9 577229004 567170067 566962738 573315315 575800972 578615608 584551125 586005974 584822617
415.7 584822617 583010330 583188591 588886337 572555046 564721947 570996475 577192688 577935982 574996376
424.3 574996376 570026321 568547668 572755013 572557335 571930046 570621071 565116310 561570511 561387634
433 561387634 563231583 562817612 563133926 563635750 561707840 559304619 556519852 559098053 560552216
441.7 560552216 560126266 566850662 571157303 570220184 571061211 571584587 571588593 576790123 579142265
450.4 579142265 576618767 577761726 577755890 574225960 575356636 578452454 578704872 580719872 579306221
459.1 579306221 576746750 576951523 577440834 577761192 577618828 576440392 576041985 574624710 569842873
467.7E69842873j852761J305313K73056k423629n248452R48830l137665n886993j82877
476.4E53637695K696419K682190k332878j263085k53219r72138r1934o073227L50685
485.1E48380508L911477J428833J352424k02064N4664Q86536M337311r01032k581825
493.8E56666832O37016k792473l857269k315025J343994j763496k884255J68610j592408
502.5E43611526J80817j666984k4071K14615m052086j238403r68552j773949r35974
511.1E33346939R74693R4338k639275k216148k351685m596252k717514q92182k618103
519.8E16384811q90655k149544j940384L99056P40585P10907l166695p35016N8289
528.5E09411354n37758M93164M43421J004181L15055J362725M07638K017441K711525
$$ plain form
467.7 569842873 567990112 569295425 569568481 567144852 561896400 562845230 559707565 553820572 553637695
476.4 553637695 556334114 559016304 556683426 555420341 555167122 554194984 554103050 548029823 548380508
485.1 548380508 552291985 553720818 555073242 554871178 554925842 555812378 560149689 559248657 556666832
493.8 556666832 557303848 554511375 550654106 548339081 549683075 547919579 545035324 545203934 543611526
502.5 543611526 543792343 542125359 542101288 542315903 538263817 537025414 536056862 534282913 533346939
511.1 533346939 534321632 534415970 531776695 529560547 527208862 522612610 519895096 519002914 516384811
519.8 516384811 515494156 513344612 511404228 511803284 512543869 513254776 510088081 509353065 509411354
528.5 509411354 508873596 509366760 509810181 510814362 511129417 512492142 512899780 514917221 517628746
537.2E17628746L17001K726746M269752L416329L09296p35398P88498J864548J393890
545.9E31979408j036148j023979P12128K381935R72824n11932j279374j824493j61972
554.5E30208397m98123j416092j917420K12136L74450k873230l202400l212318k188645
563.2E15486755k571563k539368k768745l113785k868157m045524p0076j742592k533455
571.9D93233490l63235k862092l133010j412316K330246J222763K671662K807502O81649
580.6D95176659L161277L368683L540001K638283L401718L225632K447738K527657
588.3E19487648J426086J364212Q70209K020226Q29658k78816M24118m1313K25029
597E26327057L33176q4382j619834L40156J002808j192627k59285J23024P42759L90473
$$ plain form
537.2 517628746 517945747 520672493 524942245 528358574 528667870 527932472 528720970 530585518 531979408
545.9 531979408 530943260 529919281 530631409 533013344 533986168 533474236 532194862 530370369 530208397
554.5 530208397 529710274 528294182 526376762 526588898 526963348 524090118 520887718 517675400 515486755
563.2 515486755 512915192 510375824 507607079 504493294 501625137 497579613 497509537 495766945 493233490
571.9 493233490 492870255 490008163 486875153 485462837 487793083 489015846 491687508 494495010 495176659
580.6 495176659 498337936 501706619 505246620 507884903 511286621 514512253 516959991 519487648
588.3 519487648 520913734 522277946 523148155 525168381 525998039 525719223 526143341 526102028 526327057
597 526327057 526660233 526575851 524956017 525296173 526298981 525106354 524847069 524970093 525712852 526103325
606.6E26103325L05443N81932l19939M39682P29103P32765O97480l27912o64253M11720
616.3E28689346m2801J215477L395729K356911K663231J800728J383858K037620Q16536
624.9E44316635O60477J161880J123009J587296K231979M81872m03327J033554J621933
633.6E53815308J452789J181984J316566L61977M6120L19900K23427N67436m6577L52173
643.3E59591103P24563L13568L40996N46265R99908J266937J521454K96288j173210
651.9E64427872j246682J7586J362763J203956M63410o74439j0681Q85124J92986J104965
661.6E67726860J624756J90353j80511L59535O1989l633042j1539192R024315P300415
670.3E70935478J999397p30133L31002K535438J310158n41954N42526K29721l10211
$$ plain form
606.6 526103325 526408768 526990700 526670761 527110443 527839546 528572311 529269791 528941879 528277626 528689346
616.3 528689346 528646545 529862022 533257751 535614662 538277893 540078621 541462479 543500099 544316635
624.9 544316635 544977112 546138992 547262001 548849297 551081276 551563148 551159821 552193375 553815308
633.6 553815308 555268097 556450081 557766647 558128624 558174744 558494644 558718071 559285507 559238930 559591103
643.3 559591103 560315666 560629234 560970230 561516495 562516403 563783340 565304794 565601082 564427872
651.9 564427872 563181190 563198776 564561539 565765495 566228905 565554466 565543785 566428909 566621895 567726860
661.6 567726860 569351616 569541969 569361458 569720993 569782982 566149940 554610748 563635063 570935478
670.3 570935478 572934875 572204742 572535744 575071182 576381340 575839386 576381912 576611633 576301422
678.9E76301422K20947L83835P25632J475220J823158J111183O09245M59824l1357
687.6E83079109q53996j79367Q83407l6125O15998O14700k247963j745529Q80699N78041
697.3E81588974p04041m67720j031570k135048j681862j023140o13861j318092j992607
705.9E70621033j020050q1864O21720O75850L60755O96602J208153J536751R43451
714.6E75562401J714477K436867R88541J307831J806793J866874L180771L476372K775154
723.3E95116081K259712J439515J551246K974320K228584J666641K009964J544190
731F10790253J643638K399788K805901J129570L65982Q39882M18930k5826K33994J699524
740.7F22301636J873893O48346M17405k48642j727105j563682j091385j144371j490059
$$ plain form
678.9 576301422 576522369 576906204 577631836 579107056 580930214 582041397 582650642 583110466 583079109
687.6 583079109 582225113 582045746 582929153 582893028 583509026 584123726 581875763 580130234 581010933 581588974
697.3 581588974 580884933 580417213 579385643 577250595 575568733 574545593 573931732 572613640 570621033
705.9 570621033 569600983 569519119 570140839 570816689 571177444 571874046 573082199 574618950 575562401
714.6 575562401 577276878 579713745 580702286 582010117 583816910 585683784 588864555 592340927 595116081
723.3 595116081 597375793 598815308 600366554 603340874 605569458 607236099 609246063 610790253
731 610790253 612433891 614833679 617639580 618769150 619135132 619975014 620393944 620368118 620602112 622301636
740.7 622301636 624175529 624823875 625241280 624992638 623265533 621701851 620610466 619466095 617976036
749.3F17976036k458839j816025p85446j430397j369858p46651j812324j881562k005615
758F03669319l500175k320290p35245q38356j893844k217522k08435J015243J120644
766.7E94091339J524773J721229K028618K626305L148689K691078K209320K354088
774.4F12395439L356095L544845L098412M041977L806953L684082L724251L315811
782.1F40967865L078003J988754N76782J63193J464844J909485K187652J765213J204987
790.8F55306778J505432J167221J686936J901779K116012J686554J299134J418914
798.5F68088760J333847J373139M08935R49707J555176J482468J269531J894760K310257
807.2F80666580J167603Q56247l59879p0648Q2703K34756Q60291J13678J087646J158829
$$ plain form
749.3 617976036 615517197 613701172 612915726 611485329 610115471 609368820 607556496 605674934 603669319
758 603669319 600169144 597848854 597113609 596275253 594381409 592163887 591955452 592970695 594091339
766.7 594091339 595616112 597337341 599365959 601992264 605140953 607832031 610041351 612395439
774.4 612395439 615751534 619296379 622394791 626436768 630243721 633927803 637652054 640967865
782.1 640967865 644045868 646034622 646611404 646774597 648239441 650148926 652336578 654101791 655306778
790.8 655306778 656812210 657979431 659666367 661568146 663684158 665370712 666669846 668088760
798.5 668088760 669422607 670795746 671204681 672154388 673709564 675192032 676461563 678356323 680666580
807.2 680666580 681834183 682690430 682330551 682259903 682342606 682577362 683437653 683551331 684638977 685797806
816.9F85797806O77032o35452m66003O10427p21893j063766o48651m18168j749878
825.5F81381454j001663o94046k451324j778794n20324l84980k654495k713623j757736
834.2F67424469j178284j664886l574524j647720j430893j506501r97009k324066j272888
842.9F51827698q57392j881408k340546j336594j018447k334137k109642r18656q05549
851.6F38225327j418686r65271p40013k188645l696060l072815k044716j912193j073494
860.3F21113434j95656Q31070J394577K181168L881530L971253M115677M711265M647446
868.9F46651764M051666M538117N456237M389115L782806L664704L520278K224656
876.7F78279343J406402J446381K59247q72345q64716q75168j871414j676636k411499
$$ plain form
816.9 685797806 686474838 685839386 685373383 685983810 685261917 684198151 683549500 683131332 681381454
825.5 681381454 680379791 679685745 677234421 675455627 674935303 674550323 671895828 669182205 667424469
834.2 667424469 666246185 664581299 661006775 659359055 657928162 656421661 655424652 653100586 651827698
842.9 651827698 650970306 649088898 646748352 645411758 644393311 642059174 639949532 639030876 638225327
851.6 638225327 636806641 635841370 635101357 632912712 629216652 626143837 624099121 622186928 621113434
860.3 621113434 620917778 621748848 623143425 625324593 629206123 633177376 637293053 642004318 646651764
868.9 646651764 650703430 655241547 660697784 665086899 668869705 672534409 676054687 678279343
876.7 678279343 679685745 681132126 681391373 680519028 679654312 678779144 676907730 675231094 672819595
885.3F72819595k113037j084137k088165k761612l131027k309189k219467k447510
893F54665451k342224k322006k068253k126160j693496j460419r07669j916046k422066
901.7F37407112j385994j929931k713204l584061l218803k781944l006058l493271
909.4F15293846l683624l073845l538132l914451m668084m316406l292274m227600
917.2E84579430m327927l712921l651962l600388l178177j711426j156768j186448
924.9E62053413l82499l21312n26848n50232J76163J249962J289291M63257L59955
933.6E63811150J043090R91288J211319J681709J740150J075402J234245K772942L425560
942.2E78986855K848968P69806l67775N84793K33154j503067k370605l263702l742295
$$ plain form
885.3 672819595 670706558 669622421 667534256 664772644 661641617 659332428 657112961 654665451
893 654665451 652323227 650001221 647932968 645806808 644113312 642652893 641745224 639829178 637407112
901.7 637407112 636021118 634091187 631377983 627793922 624575119 621793175 618787117 615293846
909.4 615293846 611610222 608536377 604998245 601083794 596415710 592099304 588807030 584579430
917.2 584579430 580251503 576538582 572886620 569286232 566108055 564396629 563239861 562053413
924.9 562053413 561670914 561349602 560822754 560272522 560448685 561698647 562987938 563451195 563811150
933.6 563811150 564854240 565845528 567056847 568738556 570478706 571554108 572788353 575561295 578986855
942.2 578986855 581835823 582605629 582237854 582822647 583055801 581552734 579182129 575918427 572176132
950.9E72176132l502540m383660m660759n031547o207238n673446o261139o610260
958.6E29845543o111984p010727p439537p577668o820755p488937p729187p750397
966.3D71916351q417854p880440q560371p979584q509216q902397r320412r066925
974.1D03279152p725792q875923q322525q968048p843628p266884p050819n543747
981.8C41681786n755997l991356m648666l719750l301773k648506j938839k644634
989.5C13032265j044884j320953j76907j346931l78476N35374l67966R37977k17190
998.2C09652309R63383J26476M07982N80387L03097J245423k12765P04822j47705P2041
1007.8C13695450o25839m52290J54095q42762P5035j420994P00836N64938k72999m5471
$$ plain form
950.9 572176132 568673592 564289932 559629173 554597626 548390388 542716942 536455803 529845543
958.6 529845543 523733559 516722832 509283295 501705627 494884872 487395935 479666748 471916351
966.3 471916351 463498497 455618057 447057686 439078102 430568886 421666489 412346077 403279152
974.1 403279152 395553360 386677437 378354912 369386864 361543236 354276352 347225533 341681786
981.8 341681786 335925789 331934433 327285767 323566017 320264244 317615738 315676899 313032265
989.5 313032265 311987381 310666428 310489521 309142590 308764114 309299488 308931522 309869499 309652309
998.2 309652309 310615692 310742168 311150150 311730537 312033634 313279057 313066292 313771114 313623409 313695450
1007.8 313695450 313069611 312617321 312771416 311928654 312003689 310582695 311283531 311848469 311575470 311529999
1017.5C11529999O637J502991J32217J461850N31864J335850J509418J174431K613525
1026.1C21798782N74913J966324R31816J306877J991005J702424J961326J007195K247314
1034.8C35487976K42653J080818J308975M21563o0425l92800J080208l02543L62243
1043.5C39228668p71751Q16803O18667r02862J445885P12356K208786N28412R51157
1052.2C44836121J950073J962700K950210K004738L666229K734452L917503L086624
1059.9C67108650L511811N061264M071235O303711N113068N026397L264657J979751
1067.6D01440544J364594j023064j795235m513931n020332o405487n135155l536453
1075.3C75375481l353806k126350k944603r91364p78236J568298J164169N42908J646042
$$ plain form
1017.5 311529999 311536636 313039627 313171844 314633694 315165558 316501408 318010826 319185257 321798782
1026.1 321798782 322373695 324340019 325271835 326578712 328569717 330272141 332233467 333240662 335487976
1034.8 335487976 335730629 336811447 338120422 338541985 338481560 338088760 339168968 338866425 339228668
1043.5 339228668 338456917 339273720 339892387 338989525 340435410 341147766 343356552 343884964 344836121
1052.2 344836121 346786194 348748894 351699104 353703842 357370071 360104523 364022026 367108650
1059.9 367108650 370620461 375681725 379752960 386056671 391169739 396196136 399460793 401440544
1067.6 401440544 402805138 401782074 399986839 395472908 390452576 384047089 378911934 375375481
1075.3 375375481 372021675 369895325 366950722 365959358 365181122 366749420 367913589 368456497 370102539
1084C70102539O90155K643204J739921K941246K703095K484512K842179K445716L392373
1092.7C91984940J868057K986908K151794K417336J728554J180191K253761n3711Q51135
1101.4D07368965Q0795M90647K65922k42347N00221N9051K003785R33952K110786K030297
1111D15602074J150818J577072J829414L158341R44404K013130J851387J320267J748886
1119.7D31195793L39737O79703L23753J098862M90532J112823J448441J065636J714553
1128.4D39469833J479721K805672K095413K188950J798935J756401J530456j6479M16298
1137D53525200j090584j399727k511787k855225k308121l363685l087311m018555l512916
1145.7D29377289l817978l180313k655754k795334k422524k973022j358452k485657
$$ plain form
1084 370102539 370792694 373435898 375175819 378117065 380820160 383304672 386146851 388592567 391984940
1092.7 391984940 393852997 396839905 398991699 401409035 403137589 404317780 406571541 406517830 407368965
1101.4 407368965 407449760 407940407 408206329 407963982 408464203 408523254 410527039 411460991 413571777 415602074
1111 415602074 416752892 418329964 420159378 423317719 424262123 426275253 428126640 429446907 431195793
1119.7 431195793 431535530 432215233 432538986 433637848 434128380 435241203 436689644 437755280 439469833
1128.4 439469833 440949554 443755226 445850639 448039589 449838524 451594925 453125381 453108902 453525200
1137 453525200 452434616 451034889 448523102 445667877 443359756 439996071 436908760 432890205 429377289
1145.7 429377289 425559311 422378998 419723244 416927910 414505386 411532364 410173912 407688255
1153.4D07688255j259651n05104o73294J09673m79317R21631k04811J185684J376495
1162.1D08159561J553650K907028K124977L359986L321495M274063M231186N212593
1169.8D35144539N691032N505753O035538N179786O572113O101837N985489N571938
1177.5D81788025N823440O874810O201095O491700N320701N161820N102729N138741
1185.3E27903061N003014M079551M630242L642006K889747K905502K602578K517166
1193E56172867J824226J420670J594047J329232O38084P30820O13861L43971P10030
1201.6E65377808O93016N35774M50897N74684O45943J132812J646958J683121J776008
1210.3E74517021J610832J614838J785622K101364J955871J800194K214356J999740
$$ plain form
1153.4 407688255 406428604 405923500 405250206 405359879 404880562 405802193 405597382 406783066 408159561
1162.1 408159561 409713211 412620239 414745216 418105202 421426697 425700760 429931946 435144539
1169.8 435144539 440835571 446341324 452376862 457556648 464128761 470230598 476216087 481788025
1177.5 481788025 487611465 494486275 500687370 507179070 512499771 517661591 522764320 527903061
1185.3 527903061 532906075 536985626 541615868 545257874 548147621 551053123 553655701 556172867
1193 556172867 557997093 559417763 561011810 562341042 562979126 563709946 564323807 564667778 565377808
1201.6 565377808 566070824 566606598 567057495 567632179 568278122 569410934 571057892 572741013 574517021
1210.3 574517021 576127853 577742691 579528313 581629677 583585548 585385742 587600098 589599838
1218E89599838J413918J403694J599731J160393L10974J44615j02157q04634n26200
1226.7E94200172j20658m58985j062240p76139m59442q40301j008301r07974m91181
1235.4E88074951q12836q50181l89595n84908m60701n99022o91413l06168K8191M27360
1245E83835678J23139J11122R78622J417198J014328L18871K41279M27895P12776Q70056
1254.7E90050964J028023J155548N85861J09063K00348M94995N72738M53224L77579
1263.4E95028343N42259M54560N11245J051751Q28170P74346J153717Q23288K74467
1272F01442146L65944O18820O23131M61426J01128O9084j95389j95618k59132k35405
1281.7F02796135j82266q87986o38885l74527j46790j28097n83839m45595l38631k40059
$$ plain form
1218 589599838 591013756 592417450 594017181 595177574 595488548 595633163 595531006 594726372 594200172
1226.7 594200172 594079514 593620529 592558289 591782150 591322708 590482407 589474106 588566132 588074951
1235.4 588074951 587262115 586411934 586022339 585437431 584976730 584377708 583686295 583380127 583408318 583835678
1245 583835678 583958817 584069939 585048561 586465759 587480087 587798958 588040237 588468132 589180908 590050964
1254.7 590050964 591078987 592234535 592820396 592929459 593129807 593624802 594197540 594650764 595028343
1263.4 595028343 595570602 596025162 596536407 597588158 598416328 599190674 600344391 601167679 601442146
1272 601442146 601808090 602426910 603050041 603511467 603612595 603681679 603486290 603290672 603031540 602796135
1281.7 602796135 602613869 601725883 601086998 600712471 600565681 600437584 599853745 599408150 599069519 598829460
1291.3E98829460m56467n35736q03260p47528o66504j116143p84340q12759q68072
1300E92038651p62063o47468n66368q36678p07168o95992j424179j820984r34639p93075
1309.7E82850037o18058k56729j038856q61397l10936k52609l05825k79464n96924
1318.3E78329239j348534o85844k39525p07130j061707j322441j710816k045173j910477
1327E67297592j994095k053947j724777k003708k367363k289200k024460j307983j283989
1335.7E50248070j301461j273612j043969j086235q17795J156579J206474O62117j64261
1344.4E47585907n9967L59611M8562J07955l41568K671P8163k56462J63154o942p45163
1355E46935921l14598K43835p15561n41305l60146r36432p25479j066055j046753L95622
$$ plain form
1291.3 598829460 598372993 597837257 597033997 596286469 595619965 594503822 593719482 592906723 592038651
1300 592038651 591276588 590629120 590062752 589226074 588518906 587822914 586398735 584577751 583643112 582850037
1309.7 582850037 582231979 581975250 580936394 580074997 579764061 579511452 579205627 578926163 578329239
1318.3 578329239 576980705 576294861 576055336 575348206 574286499 572964058 571253242 569208069 567297592
1327 567297592 565303497 563249550 561524773 559521065 557153702 554864502 552840042 551532059 550248070
1335.7 550248070 548946609 547672997 546629028 545542793 544724998 545881577 547088051 547750168 547585907
1344.4 547585907 547525940 547885551 547934113 548042068 547700500 547703171 547781334 547524872 547688026 547681084 546935921
1355 546935921 546621323 546865158 546149597 545608292 545248146 544311714 543586235 542520180 541473427 541869049
1364.6E41869049P60002l32985k01339l31345m82292L84445k8152J033477M89426j034088
1374.3E42126198k29912J324730J597977j66932M79241Q44688Q69942N65681r384J139222
1383.9E48541451R84268J079216O18438Q52433K558784K270279J643028J160012R11941
1392.6E60619850O69060n95970j780014O81915L42712r61227k167511m52080R37577
1401.3E57294312o22063m83208o57577k611237q37669K29416o68679j212730n71861
1409.9E49858704r83849j272316p01408n33142n73388p19871p54967n48477L63960
1418.6E44135246l579941J19324K774582J077614K32239r55963R71222J033363j9074
1427.3E45788612M80004k85950J11313J092567J804505L12805L56789J859512M16870
$$ plain form
1364.6 541869049 542629051 542296066 542094727 541763382 541281090 541665535 541637383 542670860 543160286 542126198
1374.3 542126198 541896286 543221016 544818993 544652061 545131302 545975990 546845932 547411613 547402229 548541451
1383.9 548541451 549525719 550604935 551223373 552075806 554634590 556904869 558547897 559707909 560619850
1392.6 560619850 561288910 560692940 558912926 559594841 559937553 558976326 556808815 556356735 557294312
1401.3 557294312 556672249 556189041 555531464 552920227 552082558 552311974 551643295 550430565 549858704
1409.9 549858704 548874855 547602539 546901131 546367989 545794601 545074730 544319763 543771286 544135246
1418.6 544135246 540555305 540674629 543449211 544526825 544759064 543803101 544774323 545807686 545788612
1427.3 545788612 546268616 545982666 546093979 547186546 548991051 549303856 549660645 551520157 551937027
1436E51937027k419395N82199L500709J552925P77626J095047Q7967Q56362j72654
1444.7E57797813O44646P60841p0571j018563K41432Q85430j367455o19888n77965
1453.3E56675720L61176j10474k259102m831695l457680M355736J126747K308082P77321
1462E54945831Q35076J937294k461281K270470K251205K902107K030869K579574L952179
1470.7E71243324J891632K950745K335701O908417L810539K492599M292145L827667
1478.4E99752769M015503K498207K534028K134933L846283K916145K123337K518959
1486.1F22340164o5689K524605K211418L24020M93927M238472L856545J424026K635689
1494.8F39983177N64537k130394L195229J506195k39411K383576J982193N68161K116928
$$ plain form
1436 551937027 549517632 550099831 553600540 555153465 555931091 557026138 557114105 557970467 557797813
1444.7 557797813 558442459 559203300 559132729 558114166 558355598 559241028 557873573 557253685 556675720
1453.3 556675720 557036896 556926422 554667320 549835625 546377945 550733681 551860428 554168510 554945831
1462 554945831 555780907 557718201 555256920 557527390 559778595 562680702 564711571 567291145 571243324
1470.7 571243324 573134956 576085701 578421402 585329819 589140358 591632957 595925102 599752769
1478.4 599752769 603768272 606266479 608800507 610935440 614781723 617697868 619821205 622340164
1486.1 622340164 622274475 624799080 627010498 627334518 627828445 632066917 635923462 637347488 639983177
1494.8 639983177 640547714 638417320 641612549 643118744 642879333 645262909 647245102 647813263 649930191
1503.5F49930191K514038K563782o907807r553146N605316M148026L470382K363587
1511.2F54134369J175842l85666J954117N78232q39615j534958j989593O020660L223038
1519.9F62336426l650208l856506J435623N007782J624374j876525M39834K200012
1527.6F63660812J48621R70612K041015m8141L76815k325668j748581K812348J044159
1536.3F66931992J523437J230240l805695p603683N067673J533813j204452L106918
1544F66780243r07593j697006K419357J266632M18701k337341j855697J990966Q16574
1552.7F66894836o20880m778747K99606L852615J473694o758270p309952M66309N132446
1561.4F58651657K757416J299286l1586k626038l55148R24835M38919q56933o420593
$$ plain form
1503.5 649930191 652444229 655008011 648100204 638547058 644152374 648300400 651770782 654134369
1511.2 654134369 655310211 654924545 656878662 657456894 656617279 655082321 653092728 659113388 662336426
1519.9 662336426 658686218 654829712 656265335 661273117 662897491 661020966 661460800 663660812
1527.6 663660812 663809433 664780045 666821060 666772919 667149734 664824066 663075485 665887833 666931992
1536.3 666931992 668455429 669685669 665879974 658276291 663343964 664877777 663673325 666780243
1544 666780243 665872650 664175644 666595001 667861633 668280334 665942993 664087296 666078262 666894836
1552.7 666894836 666273956 661495209 661794815 665647430 667121124 660362854 653052902 653519211 658651657
1561.4 658651657 661409073 662708359 662676773 660050735 659695587 660620422 661059341 660202408 653781815
1570F53781815J501998J817093q0795K23236J002503q40989q816299K788849K737121
1578.7F54114532M33655k42691j079330n81436r36127n43823m37317q19016q17718
1587.4F49090729j076508r10263j356964m56390o80771o87485j250534j427307m00696
1596.1F40843811j188316o96526j667747j084061j126404j610679q00896j895523p38678
1604.7F30034981q50868j296692k194214j159249j344451k179795k68020k000924j552162
1613.4F17188606j956253o36024k039376j0024757K733688Q42438l62091j824837l29017
1622.1F03592377j432534o050262J061287R6207l5439l343162k404366L41415p36274
1630.8E91089249l48358r71108P58667K00844p235108j510696J663170J076813J396446
$$ plain form
1570 653781815 655283813 657100906 657020111 657243347 658245850 657404861 648588562 651377411 654114532
1578.7 654114532 654548187 654305496 653226166 652644730 651708603 651164780 650727463 649908447 649090729
1587.4 649090729 648014221 647103958 645746994 645290604 644609833 643922348 642671814 641244507 640843811
1596.1 640843811 639655495 638958969 637291222 636207161 635080757 633470078 632669182 630773659 630034981
1604.7 630034981 629184113 627887421 625693207 624533958 623189507 621009712 620741692 618740768 617188606
1613.4 617188606 615232353 614596329 612556953 602532196 605265884 606108322 605746231 603921394 603592377
1622.1 603592377 602159843 596109581 597170868 597267075 597231636 593888474 591484108 591825523 591089249
1630.8 591089249 590740891 589769783 590528450 590729294 583494186 581983490 583646660 584723473 586119919
1639.5E86119919J068687n24978R46159k0790J663360J975136k564659q43620j541329
1648.1E86277885L140755K681694K578278K564888o732331n644226O855545N534439
1655.9E97256927K673378J871300J715088J954308J914787J904411O7101q37746L663750
1664.5F12183304K879829K054405K005806J260033k174301J220436L892822J956139
1672.3F25278473L857613L693962k54822m43840M053306L214150J591911J025086N98526
1680.9F42614365M535293M694214q63647m045182M647065N836257L090973J222306
1688.6F61731644K506027K037735K807083K557297J683731L008957K419357n450592
1696.4F73301239L006821N144806M727630k618179n065613P419663M462051J425552
$$ plain form
1639.5 586119919 587188606 586663628 587609787 587588997 589252357 591227493 588662834 587819214 586277885
1648.1 586277885 589418640 592100334 594678612 597243500 590511169 584866943 591722488 597256927
1655.9 597256927 599930305 601801605 603516693 605471001 607385788 609290199 609357300 608519554 612183304
1664.5 612183304 615063133 617117538 619123344 620383377 618209076 619429512 623322334 625278473
1672.3 625278473 629136086 632830048 632575226 632131386 636184692 639398842 640990753 642015839 642614365
1680.9 642614365 647149658 651843872 650980225 646935043 651582108 657418365 660509338 661731644
1688.6 661731644 664237671 666275406 669082489 671639786 673323517 676332474 678751831 673301239
1696.4 673301239 676308060 681452866 686180496 683562317 678496704 685916367 690378418 691803970
1704.1F91803970K22321R90219o4774J919785K776871N78842q4686J680374J438064
1712.8G01260986R24836j471024r60083M268036M55856p411270M172897L402787J522750
1721.4G06165771P14951k90527N5542J757049R71527L21274J208954R75876j757431
1730.1G10122986k49939L538666J969909n628509l962097N886230L798981P29523J537323
1738.8G17743073k068177j079864M639435J400222j730346P30438K417679Q80356N96694
1747.5G23529510J40229l0518M238587j15662m46854M161148K103882J887818J427612
1756.2G36895752j530304J570282K350006J597061J963883k814789J36490L802109
1763.9G43970490J575698J027604J398315N73654k454834J975861L088150j641083
$$ plain form
1704.1 691803970 692026291 693016510 692951736 694871521 697648392 698227234 698142548 699822922 701260986
1712.8 701260986 702185822 700714798 699754715 704022751 704478607 697067337 701240234 704643021 706165771
1721.4 706165771 706880722 706590195 706645737 708402786 709374313 709695587 710904541 711880417 710122986
1730.1 710122986 709873047 713411713 715381622 709753113 705791016 711677246 715476227 716205750 717743073
1738.8 717743073 715674896 714595032 719234467 720634689 718904343 719634781 722052460 722932816 723529510
1747.5 723529510 723669739 723639221 727877808 727762146 727315292 731476440 733580322 735468140 736895752
1756.2 736895752 735365448 736935730 739285736 740882797 742846680 740031891 740168381 743970490
1763.9 743970490 745546188 746573792 747972107 748545761 746090927 748066788 751154938 749513855
1771.6G49513855l062286J50528M411850J685028j089249J765366P64236Q69522n73807
1780.3G54435043j341095J876374K204742Q18176j633529r0714J646424P19223L37829
1788.9G58972473R57565k72674m03366k546158n35126L680496M21143r98154K019883
1797.6G61296082K014770r82437j751175J812057n31158N01404J704330j34811N37720
1806.3G64466782j36719n26962J131286J001053j500244J5945J237793O61469R74274
1815G67324677J25579o9961p05719M36554Q98590k0676O73905l31650O97098M64553
1824.6G69492950k772979O85653K017670J006928j345902m090958J490174K465515
1832.3G68949051M23889O84280M47007K98690K8534l05862R51157j72501R4452J47781
$$ plain form
1771.6 749513855 746451569 746602097 751013947 752698975 751609726 753375092 754139328 755008850 754435043
1780.3 754435043 753093948 754970322 757175064 757993240 756359711 756268997 757915421 758634644 758972473
1788.9 758972473 759930038 759657364 759253998 756707840 756172714 759853210 760274353 759276199 761296082
1797.6 761296082 763310852 762328415 760577240 762389297 761858139 762359543 764063873 763929062 764466782
1806.3 764466782 764330063 763803101 764934387 765935440 764435196 764451141 765688934 766350403 767324677
1815 767324677 767450256 767380295 766674576 767111130 768009720 767989044 768662949 768331299 769028397 769492950
1824.6 769492950 766719971 767405624 769423294 770430222 769084320 764993362 766483536 768949051
1832.3 768949051 769372940 770057220 770504227 770802917 770831451 770525589 771476746 771304245 771398697 771546478
1842G71546478R82819m65088o224670K697525K767868j64872j19781P28836P50809
1850.7G72499924k28730J73417p7439K69547M6005m50363r7504l18909O7368N8975
1860.3G71942291P08161L44009K70538L07541M959P6294j000976J58157j458664j816177
1869.9G69536133J578445J527558P16705K26898M10919n6152J92947L01133M88739
1878.6G74923325K83813n67627j94092o01806K67028J43433k91290K68936L80402J482086
1888.3G76094208n64575k121125R66263J366196L31650J98288q69217j434861P41730
1896.9G74708557L21732K59094P94830J80969O5918J2894K69318l03192N4245K41394
1906.6G76605759n39933p15103l65371k2431L32337P32269k75955L47061L83072M60357
$$ plain form
1842 771546478 772529297 772064209 765839539 768537064 771304932 771140060 771020279 771749115 772499924
1850.7 772499924 772271194 772444611 772367172 772636719 772682724 772232361 772134857 771815948 771883316 771942291
1860.3 771942291 772650452 772994461 773264999 773572540 773577499 773653793 772652817 772810974 771352310 769536133
1869.9 769536133 771114578 772642136 773358841 773585739 773996658 773940506 774133453 774434586 774923325
1878.6 774923325 775207138 774639511 774445419 773843613 774110641 774254074 773962784 774231720 774612122 776094208
1888.3 776094208 775529633 773408508 774374771 775740967 776072617 776270905 775401688 773966827 774708557
1896.9 774708557 775030289 775289383 776084213 776265182 776331100 776343994 776613312 776310120 776364365 776605759
1906.6 776605759 776065826 775350723 774985352 774962921 775295258 776027527 775751572 776098633 776481705 776942062
1916.2G76942062R98688k726211p86133J471252O06919j01548k050476n33676J401749
1924.9G75222626R30557j5793J84860J62125K32697N6457m32205J11084l52631R5749
1934.6G76195526J8082j85166K47727j67313j69601k49024R13620o84127j628418J897125
1944.2G76188431P69348j037064j72805P48443N6229k98767o4774q392K91519k3193
1953.8G76448975p706J51291O23627J81427m76609j20849k02408m7379j29623P8964
1963.5G76499710N6915o637J7776o65664J86157J025619O33927j16349k28347l43323
1973.1G77059784k64511O4468k7084L13492j15433k30789J87454J60065J61819L11203
1982.8G77620468M68521l44238n94559j06582J19247p55920q13294R57184J89590j114273
$$ plain form
1916.2 776942062 777940750 775214539 774428406 775899658 776506577 776405029 774354553 773820877 775222626
1924.9 775222626 776153183 776137390 776322250 776484375 776717072 776773529 776341324 776452408 776099777 776195526
1934.6 776195526 776213608 776028442 776276169 776108856 775939255 775690231 776603851 775919724 774291306 776188431
1944.2 776188431 776957779 775920715 775747910 776496353 776552582 776253815 776189041 776180649 776472168 776448975
1953.8 776448975 776441269 776592560 777216187 777397614 776921005 776800156 776597748 776550369 776420746 776499710
1963.5 776499710 776556625 776549988 776567764 775902100 776088257 777113876 777747803 777631454 777403107 777059784
1973.1 777059784 776795273 776859741 776832657 777146149 777030716 776799927 776987381 777147446 777309265 777620468
1982.8 777620468 778088989 777744751 777150192 777043610 777162857 776406937 775593643 776550827 776740417 775626144
1992.4G75626144L88642Q08944l738j75323k1363n4474o4544j41678L47824J55334
2002.1G76865768m49523m03977J15738L18985l24402j80740r8877j59607q5297l5171
2011.7G75562897J91192k55203j99432K1362l75366o36597j01700Q8883j36566L0212
2021.3G74189682J602R6741k37732k59247q0109k69699k34222m09698m2038L585k74810
2032G72484055k05918q3389l18756m89121J39847K35596Q3542k6322k05154o94122
2041.6G70920258l79258K14692j78071R8267k98004k47269O6986l7460M84314J0757
2051.2G70655212K6856j18179m18168k41241k6245M9133m18701J83334J64643o2256
2060.9G69794388L5095O7062K59629n17121n23452N7678N66101L70788j82952n8976
$$ plain form
1992.4 775626144 776014786 776823730 776819992 776644669 776623306 776568832 776504288 776362610 776710434 776865768
2002.1 776865768 776416245 776012268 776128006 776446991 776122589 775941849 775842972 775683365 775598068 775562897
2011.7 775562897 775754089 775498886 775299454 775320816 774945450 774308853 774207153 774296036 774159470 774189682
2021.3 774189682 774191284 774288025 774050293 773791046 773710937 773441238 773207016 772797318 772755280 772758865 772484055
2032 772484055 772278137 772194748 771875992 771386871 771526718 771762314 771845856 771819534 771614380 770920258
2041.6 770920258 770541000 770755692 770577621 770675888 770377884 770130615 770197601 770160141 770644455 770655212
2051.2 770655212 770682068 770563889 770145721 769904480 769878235 769927368 769508667 769692001 769856644 769794388
2060.9 769794388 769829483 769896545 770156174 769639053 769115601 769173279 769739380 770110168 769927216 769868240
2070.5G69868240K7542N2948k51998k518K85339M79660R0714p53098k05993M30526
2080.2G70021362J67847l17383J4649L814l66745k06070M22974N87769j69297J71814
2089.8G70330734j53808l31421k3499q011N01252j86844j52130Q010l0365q8424j23062
2100.4G69742432M70962P858K20871J86387K04772P1259o54602k07825K0371N61065
2110.1G70623550J52283j80435J49689r6588J83105K03400J45340j09024q2627j80740
2119.7G70807953k60162q8807J31073K78626m29611P3852K73514R4223K5253l88260
2129.4G70517654M8294K1363N3024k50320l662R1552n25589o3019K36817O51321J95694
2140G70973129k10190P8583m425l07770n16357Q1482m6921J26343J93024l15018O9809
$$ plain form
2070.5 769868240 769895782 769948730 769696732 769694214 769979553 770459213 770549927 769796829 769590836 770021362
2080.2 770021362 770189209 769871826 769886475 769890289 769523544 769317474 769740448 770328217 770158920 770330734
2089.8 770330734 770176926 769845505 769822006 769813995 770315247 770128403 769976273 769984283 769953918 769865494 769742432
2100.4 769742432 770213394 770221252 770442123 770628510 770833282 770904541 770249939 770042114 770062485 770623550
2110.1 770623550 770775833 770595398 770745087 770648499 770831604 771035004 771180344 771071320 770988693 770807953
2119.7 770807953 770547791 770458984 770590057 770868683 770439072 770512924 770786438 770880661 770905914 770517654
2129.4 770517654 770565948 770587311 770640335 770390015 770386353 770477905 769952316 769889297 770126114 770777435 770973129
2140 770973129 770762939 770841522 770837097 770529327 770012970 770094452 770047531 770173874 770366898 770051880 770121689
2150.6G70121689L18603K35291K58713R2621n03617M654J83945j69678k02179j18561
2160.2G70221481P70645J89667k62298m8828K52304K98156j14593N33294j8310r1705
2169.9G71729813O942k25753K13546L0518K38876r3002K13013N56335L90396L13492
2179.5G73374176k28119o2027k6321K12631J0757q2244J59530L71399O25992q926J68457
2190.1G74515305J02920N3330L1662L1356M16489k51312j46256K594J07422J62964
2199.8G75026474J43127O45447M28848J8921k22549P6218J00631J94321k5024k38953
2209.4G76147461M20227K71378O0577k97394j03912M6387J14135N35965L21350L99857
2219G77916031k05612j60218q2779l26538K3880K32087Q34274M11148m2725l79028
$$ plain form
2150.6 770121689 770440292 770675583 770934296 771026917 770523300 770527954 770711899 770542221 770340042 770221481
2160.2 770221481 770992126 771181793 770919495 770870667 771122971 771421127 771306534 771839828 771821518 771729813
2169.9 771729813 771736755 771511002 771724548 771755066 771993942 771900940 772113953 772670288 773060684 773374176
2179.5 773374176 773146057 773084030 773057709 773270340 773281097 773198853 773358383 773729782 774355774 774346848 774515305
2190.1 774515305 774618225 774671555 774703217 774734573 775151062 774899750 774753494 774756088 774863510 775026474
2199.8 775026474 775169601 775815048 776243896 776262817 776040268 776116486 776217117 776411438 776386414 776147461
2209.4 776147461 776567688 776839066 776899643 776602249 776498337 776544724 776658859 777194824 777516174 777916031
2219 777916031 777710419 777550201 777467422 777140884 777164764 777396851 778231125 778642273 778599548 778220520
2228.7G78220520p6065K07977k48718J52893k17667j25503J17035L96118M46243j50985
2238.3G78721848K47345R6893q2092j46256k9068k01035j93099K71453k10723j37406
2248G78337860j86310J56632M33044K1820k9297N2414O7749l11203O5003j93939l36380
2258.6G78077393J91116L80859L75672q9188N5466l28293l9063L31574J31912J10397
2268.2G79197845j26647K05383l14560q0109j89132j77689N11551J03149M47312k6245
2277.9G79550858q3313J06124J4344O2790J2741L26538k72293l4714j86997J4878o0883
2288.5G79450073o11038M578l96729K4109l36914k15988l29971m04053P24640n92041
2298.1G77316666j91651k53143k19574N1346o15998L50037n73578n22232n62897o53457
$$ plain form
2228.7 778220520 778144455 778352432 778103714 778256607 778038940 777913437 778030472 778426590 778872833 778721848
2238.3 778721848 778969193 779066086 778983994 778837738 778808670 778607635 778414536 778685989 778475266 778337860
2248 778337860 778151550 778308182 778741226 778763046 778733749 778786163 778853912 778542709 778607712 778413773 778077393
2258.6 778077393 778268509 778649368 779025040 778935852 778991318 778663025 778623962 778955536 779087448 779197845
2268.2 779197845 779071198 779276581 778962021 778881912 778692780 778515091 779026642 779129791 779577103 779550858
2277.9 779550858 779467545 779573669 779588013 779650803 779663544 779990082 779717789 779683075 779496078 779510956 779450073
2288.5 779450073 778839035 778843613 778446884 778470993 778134079 777918091 777588120 777184067 777908707 777316666
2298.1 777316666 777125015 776871872 776652298 776703644 776087646 776437683 775864105 775341873 774778976 774125519
2307.8G74125519l82996o45447j44424q21457J13678k41089N8823R7656j027527L44696
2317.4G71477432n84411j031876j293259j043396n56945j142960m52881k70309K88391
2326.1G65389786p22504Q6517J02921j118012p21206n33142N06744n53818J82801q14743
2335.7G61805344q11005J473389k96784j095123j879273q34045l20358L51867Q25730
2344.4G59219742l6545J598892K027054K627640J254577j432876k269745j480637r80300
2353.1G60527802j565247j860962j657944m08706m62189j631622j713715j260147J172180
2361.8G51139450J254196p84225p26853J160660J863403J611557P42264J251679J640091
2370.4G59152222N85403K251816J354065K40021P14492l6087R99527J510468R23233
$$ plain form
2307.8 774125519 773742523 773097076 772952652 772131195 772244873 772003784 772062607 772160263 771132736 771477432
2317.4 771477432 770893021 769861145 768567886 767524490 766967545 765824585 765371704 765101395 765389786
2326.1 765389786 764667282 764753799 764856720 763738708 763017502 762484360 762991104 762437286 762620087 761805344
2335.7 761805344 760994339 762467728 762170944 761075821 759196548 758362503 758042145 758394012 759219742
2344.4 759219742 759183197 760782089 762809143 765436783 766691360 765258484 762988739 761508102 760527802
2353.1 760527802 758962555 757101593 755443649 755034943 754572754 752941132 751227417 749967270 751139450
2361.8 751139450 752393646 751609421 750882568 752043228 753906631 755518188 756260452 757512131 759152222
2370.4 759152222 759737625 761989441 763343506 763583527 764298019 764261932 765261459 766771927 767695160
2379.1G67695160M69437P01065J420745J315690N47637q1253J48392K35520K6626j04065
2388.8G72374954n798R8572Q1024J19934k81296n57251k81982K65960J77460J01624
2398.4G72093201n2414m47388k84958l20587J72119J19476m35256n86930j99966K92511
2408.1G70349808k94266J6327O1417j84784p3548l30505m50211p66144k51312l2654
2417.7G68044128L05024J10168n71442j81198k01797Q5068k34070k83432l13645n52826
2427.3G66205978O0501k51693j29166j05667l15552n63659n82581j41373j86309Q2473
2437G64072952j76544j33209n44663o45065K1744m80194k62375O3629j33743n21698
2446.6G61260834q1330K68174j15662k17819p03659r9488l07769p45011j24740j99051
$$ plain form
2379.1 767695160 768164597 768865662 770286407 771602097 772149734 772068481 772216873 772452393 772479019 772374954
2388.8 772374954 772369156 772467728 772548752 772668686 772387390 771830139 771548157 771814117 771991577 772093201
2398.4 772093201 772040787 771593399 771308441 770987854 771159973 771279449 770844193 770257263 770057297 770349808
2408.1 770349808 770055542 770071869 770133286 769948502 769874954 769544449 769094238 768328094 768076782 768044128
2417.7 768044128 768349152 768459320 767887878 767706680 767504883 767589951 767355881 767072449 766758804 766205978
2427.3 766205978 766266479 766014786 765885620 765779953 765464401 764900742 764318161 764176788 763990479 764072952
2437 764072952 763896408 763763199 763218536 762573471 762595215 762115021 761852646 761916275 761782532 761260834
2446.6 761260834 761179504 761447678 761332016 761114197 760410538 760311050 760003281 759258270 759133530 758934479
2456.3G58934479j99051q7967q6517m64173K3575J18332k35367m85000r72062m8065
2465.9G56498184r842q4457j98212l84140J86463j28479l67356p75757l21807j76774
2475.6G54237823k99072Q5449l98559j27564p5378l6926k79465m24194K3422l06015
2485.2G52399521k69165l39661j48010l35922n70069P0343N2567j13526j983j7090
2494.8G50727005m32358j46789Q9569j79672j53122l43247l35846l28674p3013j38016
2504.5G48685837k63672k53754m21676j12992n7068M0055k65198k53830J16272j67618
2514.1G47046356k55508m33197m26102j68915J39313j16196l17688J73874K24228m70657
2523.8G45395508q38242J7319j95313o22406j65481K56882J61438r85260m94004K19574
$$ plain form
2456.3 758934479 758735428 758647461 758560944 758096771 758120346 758238678 758003311 757518311 756546249 756498184
2465.9 756498184 756488342 756403885 756205673 755821533 756007996 755879517 755512161 754736404 754414597 754237823
2475.6 754237823 753938751 754024200 753625641 753498077 753422699 753385773 753106308 752682114 752705536 752399521
2485.2 752399521 752130356 751790695 751642685 751306763 750736694 750807037 750859604 750746078 750744095 750727005
2494.8 750727005 750294647 750147858 750237427 750057755 749904633 749561386 749225540 748896866 748823853 748685837
2504.5 748685837 748422165 748168411 747746735 747633743 747576675 747616730 747351532 747097702 747213974 747046356
2514.1 747046356 746790848 746357651 745931549 745762634 745901947 745785751 745468063 745641937 745866165 745395508
2523.8 745395508 744557266 744574585 744379272 743756866 743591385 743848267 744009705 743024445 742530441 742750015
2533.4G42750015m2419l41721o13403j43890l56293l61405q5373q6441j74408l04183
2543.1G40240479j78071m88739m25338l08686q0490o2561m95605m10614k72522p6142
2552.7G37441711k18963j12763Q3008l08456n49164m42276l16925k99912j30310k24685
2562.4G34921265k78244m78592l77350r4834k92892j79901l45612l34472l33939l7537
2572G32167892J50452k91595r2926n45502n21851k4414k18582m37317m12826J43814
2581.6G29917145o409l29971k07978K01035J22147n87769q15735n04150R1095k52533
2591.3G27626877k35596M7684l40195m00543l73764l8986k0371q8577l91159n47714
2600.9G25237656k59705m11758k03629P5302L15018j50833q39310p51953p5913L63236
$$ plain form
2533.4 742750015 742707596 742365875 741752472 741608582 741252289 740890884 740805511 740719070 740544662 740240479
2543.1 740240479 740062408 739573669 739148331 738839645 738759155 738696594 738200989 737790375 737517853 737441711
2552.7 737441711 737222748 737109985 737192993 736884537 736335373 735893097 735576172 735276260 735145950 734921265
2562.4 734921265 734643021 734164429 733787079 733692245 733399353 733219452 732873840 732539368 732205429 732167892
2572 732167892 732318344 732026749 731933823 731388321 730866470 730842056 730623474 730186157 729773331 729917145
2581.6 729917145 729910736 729580765 729372787 729573822 729695969 729108200 728292465 727788315 727879410 727626877
2591.3 727626877 727391281 727438965 727098770 726698227 726324463 726285477 726265106 726176529 725785370 725237656
2600.9 725237656 724977951 724566193 724362564 724437866 724752884 724602051 723762741 723010788 722934875 723298111
2610.6G23298111l91083m86831j85700n4474l08151p57217m81110j73721L6468p28760
2620.2G19767532p01141j18408k57263k747l08685l97873p59430j167069m07562K02026
2629.9G15849380q3999o15540l91388k70004n24063o93665n20095n90821n74951q011
2639.5G11576843k82745n59464k76107j72882r70078p61871K60925l61557n87845p84531
2649.1G07080688p20291K5788r3537o70929r09271k97699n02853o25153k68097k01645
2658.8G02817001j02310m49829r9411k57797n09262m06952r87625q78525m47846J26191
2668.4F98803635J65329l59345n44433m12446K6169k16140m64936m21371q19016o39343
2678.1F95118103q087j63880n37490o62308n98908k41317k17285l01667k92968j32065
$$ plain form
2610.6 723298111 722907028 722420197 722234497 722180023 721871872 721114655 720633545 720459824 720496292 719767532
2620.2 719767532 719066391 718947983 718690720 718687973 718379288 717981415 717221985 716054916 715647354 715849380
2629.9 715849380 715765381 715149841 714758453 714488449 713964386 713270721 712750626 712159805 711584854 711576843
2639.5 711576843 711294098 710734634 710458527 710285645 709315567 708553696 708814621 708453064 707865219 707080688
2649.1 707080688 706360397 706386185 706292648 705621719 704712448 704414749 703911896 703286743 703018646 702817001
2658.8 702817001 702714691 702264862 702165451 701907654 701398392 700991440 700003815 699125290 698677444 698803635
2668.4 698803635 698968964 698609619 698065186 697652740 697678909 697462769 696997833 696576462 695757446 695118103
2678.1 695118103 695110016 694946136 694408646 693746338 693147430 692906113 692688828 692387161 692094193 691962128
2687.7F91962128j08109m64706l38822k60696n43976m48913n16816r04236l39431J41220
2697.4F88177643k95944m87061n06897j82571k94190q04138o64978m43802l07464k64512
2707F83926086l00140k36664r6359p10373r95789l01589j56937j14060l87039q00400
2716.6F79826736p64999m04129k99072l69797K19879j96991p83996m68903J4801M6921
2726.3F76820450o54450n42831m90418l85818j80511o46592n57022k72369p3929k06223
2735.9F72810287j56707j08490m55170k70691m76608o48041k40631m501n6992l77274
2745.6F70015182k89459n9662m08554m70199L3416R461o50406p79114j71356j09253
2755.2F67120056j74942j04141l61176l03802l16620j93024k32391k07214J36184m09317
$$ plain form
2687.7 691962128 691854019 691389313 691050491 690789795 690245819 689796906 689280090 688375854 688036423 688177643
2697.4 688177643 687881699 687394638 686887741 686705170 686410980 685606842 684941864 684498062 684190598 683926086
2707 683926086 683625946 683389282 683292923 682582550 681586761 681285172 681128235 681014175 680627136 679826736
2716.6 679826736 679061737 678657608 678358536 677988739 678208618 678011627 677227631 676758728 676773529 676820450
2726.3 676820450 676166000 675623169 675132751 674746933 674566422 673919830 673362808 673090439 673016510 672810287
2735.9 672810287 672653580 672545090 672089920 671819229 671342621 670694580 670453949 670449448 670392456 670015182
2745.6 670015182 669725723 669666061 669257507 668787308 668820724 668830185 668179779 667400665 667229309 667120056
2755.2 667120056 666945114 666840973 666479797 666175995 665859375 665666351 665433960 665226746 665362930 664953613
2764.9F64953613n77850j91574l20435n39245j71509j12839l14712K34069n7220m30527
2774.5F62471771m41665q46863o36521j49002j08490n11093n41305n68238k39257J63650
2784.2F58592987n50079n59616k21939n25971n15442o5079j04751o35910p33719q68912
2793.8F53811569q46176m03747j36261l85743o37588l67203m12979q75549o89087j93177
2803.4F48864059p27996j106339p75299n90973m74243o52313r21402j176834o19507
2812.1F41819153j40000n75485n33752p86095j278458j164627q31146o14891o82678
2820.8F35212021j033516r57794m76952q02154j128998j071129r33914q42667r10835
2829.5F27054062q77075r11980p90253j168632j208763j047287j186257l37143n96008
$$ plain form
2764.9 664953613 664375763 664184189 663863754 663324509 663153000 663040161 662725449 662959518 662902298 662471771
2774.5 662471771 662030106 661183243 660546722 660397720 660289230 659778137 659236832 658668594 658429337 658592987
2784.2 658592987 658042908 657483292 657261353 656735382 656219940 656154861 656050110 655414200 654680481 653811569
2793.8 653811569 652965393 652561646 652425385 652039642 651402054 651034851 650621872 649746323 649057236 648864059
2803.4 648864059 648136063 647029724 646254425 645663452 645189209 644536896 643615494 642438660 641819153
2812.1 641819153 641679153 641103668 640569916 639783821 638505363 637340736 636509590 635894699 635212021
2820.8 635212021 634178505 633220711 632743759 631941605 630812607 629741478 628807564 627964897 627054062
2829.5 627054062 626176987 625265007 624474754 623306122 622097359 621050072 619863815 619526672 618930664
2838.2F18930664j790161j698265j083450j207390j576920j659088j902580j569443
2845.9F06443367j385422j714554j949348k034760j582298j288872j039581q10242
2853.6E94638290j017913j145859q70972n61752m40636n58357r37576j216202j181030
2862.3E86707993o48804q24547j126442j298981j877136j281967j396256j709785j476288
2870.9E75067787j919098j604538j623802j777916j912803k286492j803703j750221
2878.7E60389214j894150j239128j106949j722603j535683j296768j085777o94161
2886.4E49813995q41026n26848p52105p80182j16158k89268k85340J7853j2436n81550
2896E45646935q17681p03697l68118o142m22173l44009j86119m91142r34182o67915
$$ plain form
2838.2 618930664 617140503 615442238 614358788 613151398 611574478 609915390 608012810 606443367
2845.9 606443367 605057945 603343391 601394043 599359283 597776985 596488113 595448532 594638290
2853.6 594638290 593620377 592474518 591603546 591041794 590601158 590042801 589105225 587889023 586707993
2862.3 586707993 586059189 585234642 584108200 582809219 580932083 579650116 578253860 576544075 575067787
2870.9 575067787 573148689 571544151 569920349 568142433 566229630 563943138 562139435 560389214
2878.7 560389214 558495064 557255936 556148987 554426384 552890701 551593933 550508156 549813995
2886.4 549813995 548972969 548446121 547694016 546913834 546797676 546508408 546223068 546240921 546228485 545646935
2896 545646935 544829254 544125557 543757439 543751297 543329124 542985115 542798996 542307854 541373672 540705757
2905.7E40705757j51787q65936q17528o26983j289521j368370j331978j568260j344223
2914.3E31341171j171913j561661j314354j338539j959190j977921j252060r51881
2922.1E19813652j431961r04655q91114r27696k81105m21219j22261L42140L67089
2930.7E15542870j84098L06092J020889M67033P54509J140404J701813J799698J405487
2939.4E23954697K034530K084618J818657K021522K302437K315636J978264J710624
2947.1E40220985J766091J993789K101403K302589K262230J551437J382218K284088
2954.8E55864830K228394J831817J897698J792144K064743J844445J703262J552124
2962.6E70779457J185112J490822J605301J515007J385155J026268P28912J467247
$$ plain form
2905.7 540705757 540553970 539688034 538870506 538243523 536954002 535585632 534253654 532685394 531341171
2914.3 531341171 530169258 528607597 527293243 525954704 523995514 522017593 520765533 519813652
2922.1 519813652 518381691 517477036 516585922 515658226 515377121 514955902 514833641 515175781 515542870
2930.7 515542870 515358772 515664864 516685753 517152786 517907295 519047699 520749512 522549210 523954697
2939.4 523954697 525989227 528073845 529892502 531914024 534216461 536532097 538510361 540220985
2947.1 540220985 541987076 543980865 546082268 548384857 550647087 552198524 553580742 555864830
2954.8 555864830 558093224 559925041 561822739 563614883 565679626 567524071 569227333 570779457
2962.6 570779457 571964569 573455391 575060692 576575699 577960854 578987122 579716034 581183281
2970.3E81183281K104568J880494J345977P82128J524391J385307Q19245J385078J196785
2979E93607254J078453J087837Q55065P39441P81898O35605O38504J241341Q89930
2987.6F01555328O61850J002465N11818K38266M19044M24118O09245N89638L4676k3194
2997.3F06023254J61210K06909Q5945l23372o0844Q5334J7090K75650m80499q00705
3006.9F05189972m9973J28212J91651j39961o13709p84950o96717j84364p13425q68225
3016.6F01458511n02395q28362m46205k33765m55665n74570m48112p24526j445312
3025.2E95799599j010018o86416n94292k34528n38826j210823j200027k88200l84446
3033.9E89652023q62922q62656j121292j007385j002579r96857n75104n74531q55255
$$ plain form
2970.3 581183281 583287849 585168343 586514320 587296448 588820839 590206146 591025391 592410469 593607254
2979 593607254 594685707 595773544 596628609 597368050 598149948 598785553 599424057 600665398 601555328
2987.6 601555328 602217178 603219643 603731461 603969727 604388771 604812889 605422134 606011772 606046448 606023254
2997.3 606023254 606184464 606391373 606477318 606153946 606093102 606178436 606195526 606471176 605990677 605189972
3006.9 605189972 605139999 605268211 605459862 605319901 604706192 603921242 603224525 603040161 602326736 601458511
3016.6 601458511 600956116 600127754 599681549 599447784 598992119 598417549 597969437 597244911 595799599
3025.2 595799599 594789581 594103165 593508873 593274345 592735519 591524696 590324669 590036469 589652023
3033.9 589652023 588789101 587926445 586805153 585797768 584795189 583798332 583223228 582648697 581793442
3042.6E81793442j280976j391487r24949o31066n44357r36012j080208p30057j062355
3051.3E73211975j035614p28683p63550o92215r28688j453819j465493q50219r28879
3060E64364815j240959q36182l91159p63474j363830n52941m01649j291046j336670
3068.6E56186905r97734n88684m44451o96449j425056j559220j041946p54471o37894
3077.3E48041000q50143o58226q50678q48312n81627j347656j273308r33761j008225
3086E39689064r94072j290207q57467m97475j252442j166915n93338q74367p10411
3094.7E31452370q79860j493492j318894r02252m27055p38030j059837o53801q73222
3103.4E23105927j352273j067924n20058n50651r78089j188469r79385q48083o82526
$$ plain form
3042.6 581793442 580512466 579120979 578196030 577564964 577020607 576084595 575004387 574274330 573211975
3051.3 573211975 572176361 571447678 570684128 569991913 569063225 567609406 566143913 565293694 564364815
3060 564364815 563123856 562287674 561896515 561133041 559769211 559216270 558814621 557523575 556186905
3068.6 556186905 555189171 554600487 554156036 553459587 552034531 550475311 549433365 548678894 548041000
3077.3 548041000 547190857 546532631 545681953 544833641 544252014 542904358 541631050 540697289 539689064
3086 539689064 538694992 537404785 536547318 536049843 534797401 533630486 533037148 532162781 531452370
3094.7 531452370 530572510 529079018 527760124 526857872 526430817 525692787 524632950 523979149 523105927
3103.4 523105927 521753654 520685730 520165672 519615021 518636932 517448463 516469078 515620995 514938469
3112E14938469p52449r84726q87108j222343j139069q07724q51173r24225q78258p29866
3121.7E05761528j260376q61282l95775j328507j563720j114998o40145o93779j145668
3130.4D96757278p85751o40373j120033p92199n60112p75337p16591r60006q80471
3139D89526405j060295j297607o94695p56569j159019o99463j92680q51250j209412
3147.7D81605415p99636q07419j200638j258583m55971m71153o72417p28683j088829
3156.4D74122086j000481j278610j239930r53292l29590l37448r80454p20787r07707
3165.1D66373787r17587j069374r67293l52288o91032j107788p24373R0599o61430
3173.8D59973221j119232o48537q54454j041069j284752n11169r8038n15480j111794
$$ plain form
3112 514938469 514186020 513201294 512314186 511091843 509952774 509145050 508293877 507369652 506491394 505761528
3121.7 505761528 504501152 503639870 503244095 501915588 500351868 499236870 498596725 497902946 496757278
3130.4 496757278 495971527 495331154 494211121 493418922 492858810 492083473 491366882 490406876 489526405
3139 489526405 488466110 487168503 486473808 485717239 484558220 483858757 483666077 482814827 481605415
3147.7 481605415 480805779 479998360 478797722 477539139 477083168 476612015 475939598 475210915 474122086
3156.4 474122086 473121605 471842995 470603065 469649773 469320183 468982735 468002281 467281494 466373787
3165.1 466373787 465456200 464386826 463419533 463067245 462376213 461268425 460544052 460634651 459973221
3173.8 459973221 458853989 458205452 457350998 456309929 455025177 454514008 454415970 453900490 452788696
3182.4D52788696j287079n49049n36232n41305o35262o80733q66127j023903l82347
3191.1D46286659n62057p35817n89371n54314n29708m75541o01348q60596q38051j098442
3200.8D39441414p20902n31387m56619k86064n85366n87806o81382m02145j005363
3209.4D34184380r55315l9139o73179p77321q29087p47566m13704m27780j96533l85246
3219.1D28739510p77131q30268o62461o92253l47900l76702m41475l24058q05664m09660
3228.7D23071938m07334n54199l92761o08712n25665n34858m04892o41289p89604m71650
3238.4D17740974j28974k59629o11076n03311n76248k37923o47736q09364r155m33998
3248D13523560r23233o24238Q2360k17133o04477l62358m49524m01535r09652n98412
$$ plain form
3182.4 452788696 451501617 450952568 450416336 449875031 449239769 448559036 447692909 446669006 446286659
3191.1 446286659 445724602 444988785 444399414 443845100 443315392 442839851 442238503 441377907 440539856 439441414
3200.8 439441414 438720512 438189125 437732506 437446442 436861076 436273270 435591888 435189743 434184380
3209.4 434184380 433229065 433189926 432516747 431739426 430910339 430162773 429749069 429321289 429124756 428739510
3219.1 428739510 427962379 427132111 426469650 425777397 425429497 425052795 424611320 424287262 423481598 423071938
3228.7 423071938 422664604 422110405 421717644 421108932 420583267 420048409 419643517 419002228 418212624 417740974
3238.4 417740974 417612000 417352371 416741295 416237984 415661736 415423813 414776077 413966713 413957558 413523560
3248 413523560 412600327 411976089 412058449 411841316 411236839 410874481 410424957 410023422 409113770 408515358
3257.7D08515358L6278n93071q92296l33519R6092k35824n10674n76096m61463j69793
3267.3D04874992K8801j05819o29959o46363n9051N4512q78258p30896K59209o7902
3276.9D02099266n97267m45366k71263l93753k04239l07655p18804m97474k54288p5531
3286.6C98333626j65138m75312m65698l89824m58832R4414o1493j146126n02090N3825
3296.2C94817352m25224n01251l41454k67677l89977j76658j76773k95334j23596r0599
3305.9C92028809m18282m42390m56047q33016k87094j97029j14670j84555j111336
3314.6C87984390o96029j12458j76773p26890p08924j43661j99738k47688m82979l56216
3324.2C84133034l81394n52826n24978k76795j54075q19779m71611q9760l42865o23130
$$ plain form
3257.7 408515358 408551636 407958565 407066269 406732750 406828842 406593018 406082344 405506248 405044785 404874992
3267.3 404874992 404903793 404797974 404168015 403521652 403462601 403517113 402638855 401907959 402167168 402099266
3276.9 402099266 401501999 401056633 400785370 400391617 400187378 399879723 399160919 398663445 398409157 398333626
3286.6 398333626 398168488 397693176 397227478 396837654 396378822 396473236 396411743 395265617 394763527 394817352
3296.2 394817352 394392128 393890877 393549423 393281746 392891769 392715111 392538338 392243004 392119408 392028809
3305.9 392028809 391610527 391168137 390712090 389879074 389591980 389394951 389280281 389095726 387984390
3314.6 387984390 387288361 387175903 386999130 386272240 385563316 385419655 385219917 384972229 384489250 384133034
3324.2 384133034 383751640 383198814 382673836 382397041 382242966 381423187 380951576 380861816 380518951 379895821
3333.8C79895821o00205l62396p90405m01307j61857j86691J11084k54021p73506r38149
3343.5C75538368o29196n94597m96597l87726k27013j3465k88887p09000r36890j50871
3353.1C71104126l12042j028481l24135K9564n67436q60977l7384J74293p78389j178512
3362.8C66220627l41225P0458l56102m27170j029473o95991K15530J00975l45192o75125
3372.4C62737312l86352l49007l06778p99293r17969J32675J0605m67682k42004j83983
3382.1C59227524r19152o13746P0076m80347k32582j8692k54593l83377r6970J50376
3391.7C56448517m06723l06549r9335l06358m54941m81644O6033K61650l42255m88205
3401.3C53890190l11966k12478j53351m42047O0730N3901k74772J25808k08511l0060
$$ plain form
3333.8 379895821 379295616 378933220 378142815 377741508 377579651 377392960 377504044 377250023 376476517 375538368
3343.5 375538368 374909172 374314575 373817978 373430252 373203239 373189774 372900887 372191887 371254997 371104126
3353.1 371104126 370792084 369763603 369439468 369469032 368901596 368040619 368003235 368177528 367399139 366220627
3362.8 366220627 365879402 365949860 365593758 365166588 364137115 363441124 363656654 363757629 363412437 362737312
3372.4 362737312 362350960 362001953 361695175 360895882 359977913 360110588 360121193 359653511 359411507 359227524
3382.1 359227524 358308372 357694626 357764702 357284355 357051773 357033081 356778488 356395111 356298141 356448517
3391.7 356448517 356041794 355735245 355635910 355329552 354874611 354392967 354459000 354720650 354378395 353890190
3401.3 353890190 353578224 353365746 353212395 352770348 352831078 352884979 352610207 352736015 352527504 352497444
3411C52497444J61476m54139p57676l4179M42390o4239J33094j61018n23071j48506
3420.6C51091576l3608K18239K64168K9068m8561K20756J74332j75057m20761m5891
3430.3C51274261K22512o5079L75404Q1711l81012J20507O35566N11856j86157l72772
3439.9C52216797L51715R19037k29340j12571M08058K06108O89049o15578k20986N21660
3449.6C54133949K45972O81076K72675P209o9923P07779Q42857M22859N90363L7498
3459.2C57872314R1172L47786L57284k43339L12843R12209K04124M51851K12555K81257
3468.8C60800056N08309R69238Q11844n89409K44293J047364Q25081N78727K38152
3477.5C65433655M91752N95780P3776j70135N63545P20520P17239N29824L49922O58798
$$ plain form
3411 352497444 352658920 352204781 351447105 351412926 351855316 351791077 351924171 351763153 351240082 351091576
3420.6 351091576 351057968 351276207 351540375 351569443 351520882 351741638 351915970 351740913 351320152 351274261
3430.3 351274261 351496773 351431694 351807098 351888809 351507797 351628304 352263870 352775726 352589569 352216797
3439.9 352216797 352568512 353487549 353258209 353145638 353553696 353759804 354448853 353833275 353612289 354133949
3449.6 354133949 354379921 355060997 355333672 355340881 355270958 355978737 356821594 357244453 357834816 357872314
3459.2 357872314 357963486 358311272 358668556 358425217 358738060 359650269 359854393 360306244 360518799 360800056
3468.8 360800056 361308365 362277603 363089447 362500038 362744331 363791695 364616776 365195503 365433655
3477.5 365433655 365925407 366521187 366594963 366424828 366988373 367708893 368426132 368955956 369305878 369964676
3487.2C69964676K31819K24953N84640O46477P49588Q06656L72848K9641M6272L79257
3496.8C74036827R44367N49011M03785L89519Q60634R29794l19976J92604J242790
3505.5C79229355J363144M10537L60222k80609m04167J619988J045417Q88596M10194
3514.2C84642677J78185Q90579L52211P79991K54936M95987J289788J323738O95190
3522.9C90903282o95991N50804R45167Q22373Q68149M98428o0349J45073J122094J088066
3532.5C96187096Q73146J27639J235123P84836l25661J650162Q89664M76112P06520
3541.2D02604637P81479R37119J462326J207580o74782M807r4261J914634J528893
3549.9D09672432R72443J709137j235657J198044R94072J005172K312928K65159J334610
$$ plain form
3487.2 369964676 370196495 370421448 371006088 371652565 372402153 373208809 373581657 373611298 373657570 374036827
3496.8 374036827 374981194 375530205 375933990 376323509 377184143 378113937 377793961 377986565 379229355
3505.5 379229355 380592499 381003036 381363258 381082649 380678482 382298470 383343887 384232483 384642677
3514.2 384642677 384820862 385711441 386063652 386843643 387098579 387594566 388884354 390208092 390903282
3522.9 390903282 390207291 390758095 391703262 392525635 393393784 393892212 393831863 393976936 395099030 396187096
3532.5 396187096 397060242 397187881 398423004 399207840 398882179 400532341 401422005 401898117 402604637
3541.2 402604637 403386116 404323235 405785561 406993141 406318359 406323166 406228905 408143539 409672432
3549.9 409672432 410644875 412354012 411118355 412316399 413310471 414315643 416628571 416893730 418228340
3558.5D18228340J147118K55546N40047K266731Q19969N95437M523582q65555q41408
3567.2D26669807K84806l57857L980713J577873J074066J465569J631393J146012J141166
3575.9D38613548K028046P89680K898026J611366K70233J538849J116410J207695J367721
3584.6D51441574M169083L89709l056793J410255O41709M098472L188668K529068Q38546
3593.2D65650291R05610L502502j539192K601852L437119O3247K274781J81656J085090
3601.9D78162956K489510K012214K325707L500061K299042k226486L721313j48926
3609.6D92135391K14997Q631248L11966l093185L350296q13713N051727M798164j077537
3618.3E09509354N68161q53844K083435M075470K550545J419830J721344J868172L071937
$$ plain form
3558.5 418228340 419375458 419631004 420171051 422437782 423257751 423853188 428376770 427511215 426669807
3567.2 426669807 426954613 426596756 430577469 432155342 433229408 434694977 436326370 437472382 438613548
3575.9 438613548 440641594 441431274 444329300 445940666 446210899 447749748 448866158 450073853 451441574
3584.6 451441574 455610657 456000366 452943573 454353828 454995537 459094009 462282677 464811745 465650291
3593.2 465650291 466555901 470058403 468519211 471121063 474558182 474621429 476896210 477077866 478162956
3601.9 478162956 480652466 482664680 484990387 488490448 490789490 488563004 492284317 492135391
3609.6 492135391 492350388 500981636 501293602 498200417 501550713 500737000 505788727 510586891 509509354
3618.3 509509354 510077515 509223671 511307106 515382576 517933121 519352951 521074295 522942467 526014404
3627E26014404P095757l656883j2170296O304512O801529O301765j0376k151107L443031
3635.7E37972336L683357K002373K83317J931115K416992K865371J508522l65867K850952
3644.4E55148468N296402N774612m252472l441963O221199l080482m377480J421471
3652.1E58709755P511063N511207M045448K579689j0221061L689880O768837J428108
3659.8E80022926P67823Q08029K512169Q95233J110573J031227J188698N473899J313744
3668.5E95124321k904587j273804o370582N658302J0294113Q442955o097755k0798721
3676.2E82074242P675171J0548210M685249l365173R51805L755913K180595J762009
3683.9F10268021K46391O69479M705658N298920j2687149j865921R392815o959916
$$ plain form
3627 526014404 533110161 529453278 517282982 523587494 530389023 536690788 536680412 534529305 537972336
3635.7 537972336 541655693 543658066 543941383 545872498 548289490 551154861 552663383 552297516 555148468
3644.4 555148468 560444870 566219482 561967010 558525047 564746246 561665764 557288284 558709755
3652.1 558709755 566220818 571732025 575777473 578357162 568136101 571825981 578594818 580022926
3659.8 580022926 580790749 581598778 584110947 585006180 586116753 587147980 588336678 593810577 595124321
3668.5 595124321 592219734 590945930 584575348 590233650 600527763 608970718 602872963 582074242
3676.2 582074242 589749413 600297623 604982872 601617699 602569504 606325417 608506012 610268021
3683.9 610268021 610514412 611183891 615889549 621188469 608501320 606635399 616028214 609068298
3691.6F09068298J740074O686020J718254K528992j45111n35889R87511Q40950M094849
3700.3F26983948K002907q891488j004638O699791J563568j21002N33485L482590L303795
3709F34552956r452706N133477K143287j4053764Q302955N393792j80893J617317L818703
3717.7F37275124R05494m784279J486054N865669n539245m212113O181450Q28552k62108
3726.3F37744598k556762J476516M405137K12783N936890m140472p026673J1448593
3734F47500610q89053j2993469J108284K855186J068077M960594L409272m991074N346909
3742.7F47375336J3087463j7302399j4891662J3880005P598190O369171p582779j1286354
3750.4F37246971J3378258q303146n718346Q691063O326294L528213n800247L350067
$$ plain form
3691.6 609068298 610808372 617494392 619212646 621741638 621596527 621060638 622048149 622889099 626983948
3700.3 626983948 628986855 620095367 619090729 625790520 627354088 627233086 627766571 631249161 634552956
3709 634552956 625100250 630233727 632377014 618323250 626626205 632019997 631839104 633456421 637275124
3717.7 637275124 638180618 633396339 634882393 640748062 635208817 630996704 637178154 638006706 637744598
3726.3 637744598 635187836 636664352 641069489 641282272 647219162 643078690 636052017 647500610
3734 647500610 646611557 633618088 634726372 637581558 638649635 643610229 647019501 642028427 647375336
3742.7 647375336 660462799 643160400 628268738 642148743 649746933 656116104 648533325 637246971
3750.4 637246971 650625229 642322083 636603737 645294800 651621094 655149307 649349060 652699127
3758.2F52699127M910431j0547943J80893O095886J354752L63388L024521m602814
3765.9F53478241l784027N245437N541764j977463j0716858L748551M248352Q13522
3773.6F56597519J584320J57318J366119Q04291L194428j305237r312744L814926K927475
3782.3F59828415J865234K636795m586029o99539J520081N68618J098023L5171J248932
3790.9F63515701K69623k44675l86200J639405L295440n730514l998489L088684M969177
3799.6F66418152O556702r945450j0973130O022644M829178O515351N573196j2865219
3807.3F62131424m096069O105651K703476Q70514M65699M6997J719284O206283l785400
3816F72367859j5846787P222290P109909N393296j717453k1823960N625077P184982
$$ plain form
3758.2 652699127 657609558 647061615 647242508 653338394 654693146 655056534 658081055 653478241
3765.9 653478241 649694214 654939651 660481415 658503952 647787094 651535645 655783997 656597519
3773.6 656597519 658181839 658339157 659705276 660509567 663703995 662398758 653086014 656900940 659828415
3782.3 659828415 661693649 664330444 659744415 659044876 660564957 661133575 662231598 662266769 663515701
3790.9 663515701 663785324 663540649 663154449 664793854 668089294 662358780 658360291 661448975 666418152
3799.6 666418152 672974854 663029404 652056274 658078918 662908096 669423447 674996643 662131424
3807.3 662131424 658035355 664141006 666844482 667714996 668180695 668227692 669946976 676153259 672367859
3816 672367859 656521072 663743362 670853271 676246567 674529114 652705154 658330231 665515213
3823.7F65515213L180923K803269j391068m455108J753082L106461L127212j090774
3831.4F72549210r842301O193543Q330383q171539J342315R838944j2633820m582443
3839.2F63024292R140854o922379J599655Q247910l346405l266068L385087J752548
3846.9F73615494J33667J448517j021271L212509N965576r328461k473373k0877151
3854.6F50675507Q231277J4755096r54971r39941L096008K406693J779937p101898
3862.3F71947708J675415Q212814r581146n820770P303009P631073N978851j4498291
3870F72848663j0755005P944336R630967K342605j4499054L391419O406173K96708
3877.7F77606812L048782L762588j0851974o372604R353637J821213K771759N936661
$$ plain form
3823.7 665515213 668696136 671499405 670108337 665653229 667406311 670512772 673639984 672549210
3831.4 672549210 662706909 668900452 677230835 669059296 670401611 680240555 667606735 663024292
3839.2 663024292 672165146 665242767 666842422 675090332 671743927 668477859 671862946 673615494
3846.9 673615494 673749161 675197678 674176407 677388916 683354492 674026031 671552658 650675507
3854.6 650675507 658906784 673661880 672706909 671766968 674862976 677269669 679049606 671947708
3862.3 671947708 673623123 681835937 672254791 666434021 673737030 681368103 687346954 672848663
3870 672848663 662093658 670037994 679668961 682011566 667512512 670903931 677310104 677606812
3877.7 677606812 680655594 684418182 673566208 667193604 676547241 678368454 681140213 687076874
3885.4F87076874j5798950J418533M980392J305390M586944k928390r655304L671112
3893.2F74656601L582687j862716K519226J758728K819595N70221j1256485O514740
3900.9F79302597N30701n508499O003189n132065k456055J251221K485046L208618
3908.6F79684753K11716O41251l80783M3487Q4000m10843K092895J827622o369553
3917.3F77424545k799606P271118j070251m672242M252243K717438Q11157m052429
3925F79881973l349075K761612J737594J190720j498260k12708K373734l153916j128464
3933.7F78603210J576767K0218J188660J002502m68521k08053k30103J632996O47430
3942.3F83765106n519638l86200K579270K253646J465836k974472R55811l63541k057953
$$ plain form
3885.4 687076874 671277924 672696457 677676849 678982239 683569183 680640793 670985489 674656601
3893.2 674656601 678239288 676376572 678895798 680654526 683474121 684044342 672787857 679302597
3900.9 679302597 679833298 674324799 680327988 675195923 672739868 673991089 676476135 679684753
3908.6 679684753 679896469 680537720 680156937 680200424 680284424 679873581 681966476 683794098 677424545
3917.3 677424545 674624939 681896057 680825806 676153564 680405807 683123245 683934402 679881973
3925 679881973 676532898 679294510 681032104 682222824 680724564 680511856 682885590 679731674 678603210
3933.7 678603210 680179977 680200195 681388855 682391357 681922836 681714783 681484680 683117676 683765106
3942.3 683765106 678245468 677859268 680438538 682692184 684158020 681183548 682139359 681775818 679717865
3951F79717865K753830K10266m69589n875M2649l10593j037216J124496K76642O19507
3960.7F82921982m94385k194061L95431M12598M46320R87167P22046K81143q59070
3969.3F82619171q61664N74570J10474o22330Q78143M20151n75714n0583L06397l39051
3979F82459564k29492Q63113J41373l42560J58158J02996n49926j45417j6632P0954
3988.6F82512131J264114k13241o78177J95312J95999j37863p30057R45588Q94699
3997.3F84248505n4169j50757n5694
4000.2F83987885
$$ plain form
3951 679717865 682471695 682681961 682212372 682206497 682249146 681938553 680901337 682025833 682302475 682921982
3960.7 682921982 682427597 680233536 680628967 681041565 681487885 682475052 683197098 683478241 682619171
3969.3 682619171 681757507 682332077 682442551 681820221 682698364 683118515 682542801 682492218 682798615 682459564
3979 682459564 682230072 683093185 683234558 682891998 683050156 683153152 682603226 682457809 682441177 682512131
3988.6 682512131 683776245 683563004 682884827 683080139 683276138 683138275 682408218 683353806 684248505
3997.3 684248505 684194336 684043579 683987885
4000.2 683987885
##END=$$ End of the data block
