##TITLE=$$ Begin of the data block
##JCAMP-DX=5.00 $$ ACD/SpecManager v 10.08
##SPECTROMETER/DATA SYSTEM=Varian
##DATE=20 Nov 2012 13:42:12
##DATA TYPE=INFRARED SPECTRUM
##DATA CLASS=XYDATA
##ORIGIN=
##OWNER=
##NPOINTS=3735
##FIRSTX=399.26403809
##LASTX=4000.35498047
##MAXX=4000.35498047
##MINX=399.26403809
##MAXY=78.12814331
##MINY=30.94308853
##XFACTOR=1.0000000000
##YFACTOR=0.000000100000000
##FIRSTY=55.81979370
##DELTAX=0.96440572
##XUNITS=1/CM
##YUNITS=TRANSMITTANCE
##XYDATA=(X++(Y..Y))
399.3 558197937 565701790 566236725 567021103 570286674 565942726 565031052 569889908 566855392 562175941
407.9 562175941 559713173 557587547 563504524 574057236 575967789 573918877 574898262 576401215
415.7 576401215 573432732 571395683 569032402 553781662 556351471 566175957 575848236 571424103
423.4 571424103 564279785 565261917 561790733 560912781 562168350 564214363 569305611 570120125 566362953
432.1 566362953 562101288 562533073 564395866 559269257 552015076 549743423 551723595 553232613 551023598
440.7 551023598 551379814 558265800 564067612 567960014 567696266 566724854 568345795 569962730 574021378
449.4 574021378 574861908 572559891 570979462 570464439 572903328 575547371 580299530 577724113 563124199
458.1 563124199 569512711 576655006 574403381 568036156 565959129 568590622 567780533 565016632 565850410
466.8 565850410 570002975 571465302 566467896 564096146 563002586 558272972 557488174 557418671 556618767
475.5 556618767 552804031 547938461 548035164 549773483 549324303 547887726 550339050 549975777 547192955
484.1 547192955 550651855 551844597 554788513 555409851 552461929 553515472 552177505 550168381 551079521
492.8 551079521 551723137 550706558 549686165 548118439 545382538 544921989 544716415 545804214 543993073
501.5 543993073 540682869 542983437 542282028 541139030 540260963 536898117 533971291 533200874 532341003
510.2 532341003 529827881 529495697 528781586 527996941 526538963 523365402 519746437 516379051 516233063
518.9 516233063 516092873 515076904 513328285 513179092 511990776 508982010 508827744 507959633 507748451
527.5 507748451 506816063 507011337 507555771 506707649 507878304 507541428 509574089 511933289 512633667
536.2 512633667 513853493 514122887 517385635 522444420 525529289 526283722 527553749 529512520 531026268
544.9 531026268 532378922 532611580 532883911 532700653 531725845 531753616 532636223 531556435 530114555
553.6 530114555 530959244 530005264 526621284 523897133 523937836 523484268 521186867 520019760 517385025
562.3 517385025 514246368 511697464 509546776 506886330 503189011 501390724 499707298 496596489
570 496596489 492352180 490320473 488968620 488031616 487914124 485759811 485830727 486869431 489602852
578.6 489602852 492376480 494795685 498269691 500925598 504253426 506581573 509905853 513014679
586.4 513014679 516420403 519789047 521158295 522786102 523693886 524644279 525229950 525865746 525439758
595 525439758 524925919 526126938 526734390 527539673 525823250 524273453 524668274 524561806 525217552 524184380
604.7 524184380 523662186 524063110 524435005 525956268 526799126 527524529 528436775 529150543 530176697
613.4 530176697 530842667 530070534 528852997 528497124 530019188 532547073 534631081 537217102 539283524
622 539283524 540770836 542239838 543536530 544526215 546061554 547752762 549213600 551069908 551309204
630.7 551309204 551612511 552918701 554824066 556522484 556131821 556528664 557618179 559054146 559809380
639.4 559809380 558907776 558804779 558347092 558436470 559004860 558363991 558957634 561041489 562518425 562786102
649 562786102 563000221 563537064 564224434 565151863 565395851 564418564 564493599 566226006 566462021 565569534
658.7 565569534 566246490 567234306 568426437 569919777 569535332 570079880 571131096 571055336 568532562
667.4 568532562 553621826 561887589 569477997 571539955 572548256 573115959 574661064 575988922
675.1 575988922 576257095 576547318 576671867 577377510 577420959 578167610 579511337 580706253 581561050 581380386
684.7 581380386 582976799 584746246 584559822 584806137 585124168 583735771 582650719 582869720 582253227
693.4 582253227 581635666 582526741 583334732 581608887 579042053 578833618 578686638 577066422 575760536
702.1 575760536 575098076 573812981 571987419 571328545 571089706 570376968 570950470 572664528 573513260
710.8 573513260 573556366 573270226 573376274 574353828 575821266 577606010 579896088 582800446 584608994
719.5 584608994 586590500 590438576 593614082 595035820 596465187 598774147 600888138 603490410
727.2 603490410 606448441 608588028 610185928 611794930 613192558 614952202 617233620 618688164
734.9 618688164 619971695 620597229 620685234 620991554 621897087 623567467 624263039 625005150 625407944 624793930
744.5 624793930 623699875 621920319 620655403 619658051 618739586 616714478 614010582 613027191 611312904
753.2 611312904 609425964 608977509 606509819 604353561 604270248 601719513 598154984 596594162 595399055
761.9 595399055 593811493 592512169 592669716 593855820 594520493 595530815 597769470 600749588 603168869
770.6 603168869 605109062 607236862 609377518 612419777 616363449 619719810 622918396 626668701
778.3 626668701 630278053 634361229 638065681 640472260 642253342 644665909 647098999 648315659
786 648315659 649823380 650847321 652186432 653937988 655060196 656677628 658333511 660298309 662241898
794.7 662241898 664051895 665214081 665875015 667200546 669458466 671376266 671939240 673291779 674268799
803.4 674268799 675352020 677526169 679427490 680703201 681232910 682121887 682336197 683130112 683776093
812 683776093 683759460 683931274 683760986 684962769 684994507 684929581 685940247 686208496 685980759 685276718
821.7 685276718 684900055 683953171 682323532 679844055 679165115 679656525 678032837 676589432 675467987
830.4 675467987 674215240 672224655 669500732 666571426 664779053 663949203 661657486 659661179 658089828
839 658089828 655957336 653308945 652039642 651972427 649902267 648351517 647406158 645013351 642986603
847.7 642986603 641929474 640758514 639523430 638759689 637424850 635530777 633808823 631708107 629026031
856.4 629026031 626967621 625050011 622710152 621160469 620270004 620569534 622353401 625004120 628703690
865.1 628703690 633307838 637939873 641817245 646637115 651480255 655449753 660034256 664946594
872.8 664946594 669573059 672714081 675839615 678017731 679413071 681005173 681023560 680623779 680012741
881.5 680012741 678446655 675886765 674513626 673168488 670613785 668624649 666315918 663618546
889.2 663618546 660733948 658563690 656975861 655205765 653240509 650820007 648236618 645401001
896.9 645401001 643229828 641717758 640820007 639878120 637898064 635744057 633392334 631119728 628612823
905.6 628612823 625663567 622633591 619026794 615529556 612462196 608863106 605150871 601565666
913.3 601565666 597624245 593413963 588487892 583282433 578822441 575097351 571221542 568138123
921 568138123 566470337 564796906 562872429 561154060 560345573 560478287 560828629 561151962 561673660
929.7 561673660 561981773 562727242 563496399 563387871 563941269 565025711 566807632 568863487 570063553
938.4 570063553 571368866 573188171 575585098 578214760 580551300 581917191 582239304 582801437 582926788
947.1 582926788 581242523 578942070 576342278 572662506 568395004 564023819 559184799 553707962
954.8 553707962 547863922 542163353 536056023 529261932 522583084 515962906 508629913 501077423
962.5 501077423 494343033 486841927 478746033 470277672 461999664 454089546 446073112 439128075
970.2 439128075 430201569 420816727 411928482 403354187 395240059 385885162 377370491 368658562
977.9 368658562 361908302 355090637 347944412 342037354 335870934 331944122 327410011 323597412
985.6 323597412 319707737 316733265 314717808 312128220 311399517 309869690 310045528 309810085 309430885
994.3 309430885 309649143 309616013 310127182 309718437 310930519 310853634 311659889 312377968 312040386 312490749
1004 312490749 312460251 313811302 313258762 313347340 313245926 313122196 313032455 311995659 312805271 312033920
1013.6 312033920 312492428 311327057 310396042 311300659 311186199 312019749 312058029 314519463 315489807
1022.3 315489807 316622963 318402004 318934422 321104660 322320518 324372215 324708977 326022911 328091354
1031 328091354 329434166 331573868 332332611 334111137 335477753 337500839 338078613 338250008 338627129
1039.6 338627129 338421516 339389114 338334274 338657074 338120575 338333511 339135857 338849869 339843063
1048.3 339843063 339798431 341795311 342654686 344357452 346619110 348952370 352075844 353181038 356806107
1057 356806107 359522362 363111916 367448502 371564255 376450195 380886993 386372871 390337448 395005112
1065.7 395005112 397946472 400052872 402361565 402293968 399922867 394519653 390004845 384069176 378787308
1074.4 378787308 374591980 370568695 368304672 365886002 365778847 364702339 365594826 366792526 367621155
1083 367621155 369885788 371243401 373626976 374897118 377789688 379355164 381552162 385270081 387717018
1091.7 387717018 391795120 394133148 397006111 399076576 400881195 402821350 404251671 406343918
1099.4 406343918 407004128 408035622 407275047 407505875 407770462 407811165 408868179 408261642 409889755
1108.1 409889755 411032410 412394333 414576569 417083206 419141884 420301590 423103294 424600754
1115.8 424600754 426356392 427226105 428537712 430771027 431376686 432504539 433374062 434383965 434466743
1124.5 434466743 435129890 436149979 437741432 440014458 441141930 443115044 444776039 447516136
1132.2 447516136 449355392 451010475 452772141 452519875 453428955 453080673 451639938 449133987 446161156
1140.9 446161156 442984695 439233894 436361237 432149429 428840714 425347672 422197304 419237251
1148.6 419237251 415788040 413520775 411167259 409944344 407503662 406576881 405747643 404703407 405402565
1157.3 405402565 405128174 405716171 405348129 406793480 408232651 409790497 412948456 414847374 418531418
1166 418531418 422070732 426316643 430709305 435223236 440658493 445793152 451696358 457784195 464041481
1174.6 464041481 469437065 475573997 481685982 487573013 494061966 500488472 507101440 512618637
1182.4 512618637 518281212 523189812 527646294 532701988 537088737 541027374 544987946 548612251
1190.1 548612251 551092606 553961029 556671791 558615646 560208931 560840340 561876984 563052177
1197.8 563052177 563683891 563962021 564396057 565201797 565834808 566268120 566281929 566988144 568211288 569790840
1207.4 569790840 571875267 573520317 574974136 576015129 577290535 579259224 581518097 583909531
1215.1 583909531 586077499 588083000 589820251 591505470 592992249 593802185 594553833 595202522 595610123
1223.8 595610123 595802956 595410194 594893608 594195824 593274574 592362671 591740227 591222992 590307693 589184570
1233.5 589184570 588513298 588497734 587912598 586835022 586209259 585727615 585095444 584310875 583931656 584204788
1243.1 584204788 584318275 584117775 584118462 584412231 585084534 585950623 586602058 587117119 587712517 588539963
1252.8 588539963 589557228 590423203 591490173 592376328 592608604 592898483 593187675 593627663 594460678
1261.4 594460678 594930763 595124054 595781898 596537209 597201691 597844353 598269958 599065018 600191727
1270.1 600191727 601175461 601724052 602281647 602981110 603337250 603648758 603681526 603516235 603149567 603145676
1279.8 603145676 603284836 602797470 602403259 601832695 601473465 601246452 600611763 600321388 600209923 599860344
1289.4 599860344 599568214 599033012 598520317 598497772 597591667 596279984 595358810 594387321 593793640 593154526
1299 593154526 592198334 591203957 590443802 589862747 589447708 588843765 588204536 587187996 584988518 583660965
1308.7 583660965 583010864 582238388 581733818 580855942 580431213 580343018 579913445 579302139 578828163 578073425
1318.3 578073425 576708488 575842667 575361748 574975090 574197350 572672615 571105347 569584274 567797432
1327 567797432 565957184 563813591 561437302 559457321 557448654 555460854 553604813 552074013 550428581
1335.7 550428581 548707733 547619972 546585045 545656815 545530777 546282578 547397041 548326645 548145523
1344.4 548145523 547925644 548086510 548188324 548079453 547595177 547750092 548014450 547880936 547679291 547662697
1354 547662697 547155647 546799927 547282677 546582260 545903473 545645027 544632149 543746376 542383003 541342735
1363.7 541342735 542353745 543489227 543288994 543003578 542411079 541891594 542575150 542620087 542844315
1372.3 542844315 542503090 541494064 541594467 543076286 544575844 544551697 545334549 546185341 546928787
1381 546928787 547536392 547702408 548532486 549493141 551022148 551473160 551873856 554488525 556845284
1389.7 556845284 558353996 559542274 560849495 561440964 560391541 558842201 559843292 560283279 559118652
1398.4 559118652 556775131 556356544 557188110 556533928 555856323 555246315 553259468 552496109 552774963
1407.1 552774963 552266808 551142311 550493507 549147148 547742233 547006149 546541290 545951385 545097275
1415.7 545097275 544449730 543474846 542839394 539806862 541204567 543957329 544565659 544136353 542908287
1424.4 542908287 544460526 545901642 546180267 546766701 546104050 545848618 546776543 548605804 549236565
1433.1 549236565 549942856 552232971 552982025 550602684 550816917 554025345 555738144 556232872 556785851
1441.8 556785851 556864700 557849274 558215790 558914604 559263268 559080811 557840767 558459625 559812012
1450.5 559812012 558496361 557349548 556544266 557007217 556432571 553878021 548344765 544833984 549801979
1459.1 549801979 551587677 554498215 555075302 555844612 557724342 554955368 557761269 560108147 563111420
1467.8 563111420 564959755 567719116 572391167 573943710 575827980 577759171 584791641 589567680
1475.5 589567680 592442703 596100807 600073662 604063683 606221962 608902245 610964203 614438057
1483.2 614438057 617601738 620023880 622505608 622690125 624957733 626951408 627777710 628280411 632528915
1491.9 632528915 636223717 637465210 640073776 640198746 637787018 641295166 642618408 642763977 645857239
1500.6 645857239 647574615 647757187 649768295 651351547 652628250 644848251 638726616 645595474
1508.3 645595474 648921814 652561111 655026321 655760956 655167465 657253647 657790375 656787109 655324020
1517 655324020 653142853 659001083 661805801 657291336 653804245 656516342 662008438 663754578 661959076
1525.7 661959076 662436295 664454041 664065933 665305786 667414551 666936569 667763672 665786209 662638626
1534.3 662638626 665661774 667543640 669052658 668953323 661838303 656663971 664056015 664722672 663074036
1543 663074036 666257324 665568237 664804306 667051849 668446884 669229202 666776886 664219055 666054230
1551.7 666054230 667514038 667199631 662229843 662781830 666559601 667168198 655813141 647676620 652147141
1560.4 652147141 658504868 661915817 663231583 662629547 659444046 659232407 660655746 661393356 660266418
1569.1 660266418 653987274 655861740 657961884 657833328 657454147 658119583 656862946 648266525 651644440
1577.7 651644440 653987427 654193649 654516602 653772964 653030014 652297897 651876602 651182022 650306168
1586.4 650306168 649563446 648447189 647376556 645926132 645532074 644900360 644255142 642914352 641252213
1595.1 641252213 640936584 639984932 639434662 637914696 636692200 635294685 633674812 632919426 630863037
1603.8 630863037 630163994 629554749 628000565 625418015 624345779 623060036 621011276 621154213 619318352
1612.5 619318352 617710457 616039886 615479965 613166847 602943687 605728378 606525841 606040649 604368553
1621.1 604368553 603736687 601757050 596452065 597457466 597257690 597131920 593669510 591328850 591814117
1629.8 591814117 591473007 591394653 590302696 590926514 590994415 583722725 582788849 584516945 585449333
1638.5 585449333 586867027 588110542 587607460 588291626 588172607 589619789 591241722 588356438 587045822
1647.2 587045822 586522102 590239334 592828331 595424232 597739029 589788628 583067818 591171227
1654.9 591171227 597892189 601092911 603054161 604334183 605732536 607795334 609851379 609713326
1662.6 609713326 609384270 613310928 615913620 617404022 619266319 620791054 619176369 620890541
1670.3 620890541 624711800 626518059 630228500 633785095 633555717 632789421 636755829 640062256 641858902
1679 641858902 643487320 644169159 647946396 652404022 651011963 643771210 650873337 657479324 660467682
1687.7 660467682 661868439 664525146 666679687 669587936 672341232 674481506 677428589 678924408
1695.4 678924408 673751526 677095337 682139130 687141418 685319138 679318237 686485672 691331100
1703.1 691331100 692507858 691780090 692499847 692404327 695187225 698412857 699154663 699080811 700579910
1711.8 700579910 702411346 703386917 701986542 701067276 704777451 705297241 697178345 701502914 705101929
1720.5 705101929 706658554 707502441 707324829 707438583 709074173 710313721 710724640 711739349 712657776
1729.1 712657776 710581436 710571823 714361420 716395187 710250015 705471573 711891174 716065674 717148972
1737.8 717148972 718949356 717266617 715551300 719709549 721361694 719782257 720587311 723119888
1745.5 723119888 723834305 724217224 724373627 724836502 729291611 728752213 727811584 732071075 734251938
1754.2 734251938 736184616 737772217 735799255 736964569 739392929 741328430 743837891 741614532
1761.9 741614532 741582108 744972153 746252136 747076492 748560638 749120407 746322784 748603668 751858978
1770.6 751858978 750281219 746282501 745905838 750979462 752734604 752033463 754234772 754908295 755823135
1779.3 755823135 755064316 753707504 755724030 757615128 758449402 757419968 757477112 758825607 759386902
1788 759386902 759742813 760720139 760455780 759783401 756752777 756403198 760242310 761021118 760602798 762284775
1797.6 762284775 763522034 762381287 761418381 763411407 762504883 762966461 764754944 764635239 765016327
1806.3 765016327 765118942 764906158 765540543 765879593 764195633 764876709 766535568 767043457 767973938
1815 767973938 768346100 768573608 767592392 767689972 768475342 768535233 769481430 769085617 769794846 770086746
1824.6 770086746 767091904 768242645 770440674 771298828 769511490 765510712 767357178 769770813
1832.3 769770813 770228119 771122818 771607208 771711349 771454544 771119537 772157516 771912537 772296524
1841 772296524 772634125 773394699 773207474 767053452 769564133 772179871 771620560 771458893 772564316
1849.7 772564316 773696136 773422012 773488693 773339691 773397293 773397827 773068161 773133850 772697296 772701645 772762070
1860.3 772762070 772971649 773023376 773636780 774231186 774237823 774634476 774019928 773656235 771814270 770486069
1869.9 770486069 771900864 773153305 774109650 774400711 774717102 774977951 775382080 775506821 775782166
1878.6 775782166 775865860 775300064 775369415 774895706 775171890 775289078 774907837 775053558 775187454 776681137
1888.3 776681137 776406326 774326019 775274963 776726685 776971588 776911774 776198044 775215607 775884247
1896.9 775884247 775943985 775950165 776550751 776879349 777059784 777015076 777248001 776984329 777199478 777410965
1906.6 777410965 776760559 776206436 775958252 775542831 775643082 776792145 776638794 776722260 777118835 777703552
1916.2 777703552 778662872 775763397 775258560 776861191 777262726 777332764 775535889 774812241 776194000
1924.9 776194000 777295303 777041855 776927567 777248459 777427673 777552795 777583847 777688446 777000732 776832199
1934.6 776832199 776819229 776892395 777216110 776977081 776864548 776684647 777570648 776769714 775082626 776802750
1944.2 776802750 777454300 776697159 776445389 776981506 777298355 777159882 777223434 777249222 777355957 777352829
1953.8 777352829 777265244 777245789 777838287 778174438 777886429 777686005 777481384 777420197 777316818 777623978
1963.5 777623978 777612076 777493057 777561493 776728210 776730957 777815704 778420868 778058929 777801590 777734451
1973.1 777734451 777648468 777981567 778108749 778011551 778087921 778218079 777902222 778036880 778439331 778398056
1982.8 778398056 778330154 777951508 777941971 778009338 777977371 777332993 776606445 777376404 777298355 776066666
1992.4 776066666 776623154 777928543 778107910 777741394 777625427 777682648 777776260 777550049 777759018 777633591
2002.1 777633591 777523804 777852859 777775497 777833405 777466965 777029495 776881790 776959152 776688004 775856400
2011.7 775856400 775896606 776199799 776178207 775954514 775368195 774908218 775134583 775266495 775073929 775137329
2021.3 775137329 775106735 775121613 774860382 774606323 774472961 774185181 773815842 773318710 773510818 773655624
2031 773655624 773577347 773509140 773375854 773269501 773035583 773059845 772791595 772555466 772474518 772322998 771637573
2041.6 771637573 771219559 771657944 771456680 771585922 771545181 771233368 770991440 770713959 771399078 771528397
2051.2 771528397 771509323 771381454 770961761 770892334 770860672 771054306 770832748 770744629 770673294 770627747 770592728
2061.9 770592728 770578308 770911942 770578842 770229492 770131454 770549393 770966187 770895004 770802460 770560989
2071.5 770560989 770928345 771159973 771034164 770919647 771206818 771333084 770750732 770948334 771169815 770997238
2081.1 770997238 770725632 770569839 770713806 770554962 770292816 770498199 770965042 770974731 771231079 771163025
2090.8 771163025 770921326 771110077 771098785 771298599 771190186 771029434 770722961 770763626 771173325 771163330
2100.4 771163330 771375885 771223526 771320267 771687012 772160034 772174683 771334381 771230392 771420898 771582642
2110.1 771582642 771407776 771328506 771648331 771800232 771874847 771945038 772202225 771945114 771801071 771626892
2119.7 771626892 771393738 771411514 771474152 771757126 771300278 771411972 771709213 771617050 771712189 771510315
2129.4 771510315 771698303 771769028 771728897 771453247 771462097 771509781 771074905 771204834 771307907 771773529
2139 771773529 771854782 771360016 771316147 771525650 771446838 770981598 771104202 771071472 771225586 771385422 771222305
2149.6 771222305 771485291 771512604 771809845 772232208 772265167 771745758 771548538 771765518 771579895 771564560
2159.3 771564560 771570587 771778870 771783447 771844864 772230148 772657547 772961884 772880478 772997131 772501373 772431030
2169.9 772431030 772967148 772948914 772844849 772897568 773262177 773169632 773506775 774142303 774615555 774952469
2179.5 774952469 774451370 774211731 774157486 774199142 774118500 774211731 774530563 774604263 775055008 775278168
2189.1 775278168 775410080 775481033 775816650 776034698 775868378 776237946 776375275 776279907 776130447 776227036
2198.8 776227036 776325836 776552582 777010880 777013550 777174149 777259521 777480087 777649384 777584152 777284393
2208.4 777284393 776996689 777525253 777994232 778264008 778098145 777766571 777613678 777918549 778593216 778762512
2218.1 778762512 778879623 778774948 778955383 778734512 778422623 778756485 778539505 778654175 778969879 779376144
2227.7 779376144 779480133 779395218 779516373 779376602 779447708 779145966 779042816 778862915 778848343 779500885
2237.4 779500885 779777145 779882584 780056381 780368271 780005569 779967117 780065384 779657059 779720001 779421387
2247 779421387 779215546 779320145 779803848 779981232 779864578 780126190 780126266 780397263 780201035 779856186 779702530
2257.6 779702530 779641190 779769363 779609299 779756317 779953918 780192566 779961548 779733124 780094986 780335922
2267.3 780335922 780277557 780266113 780485840 779813995 779433212 779597931 779803619 780065765 780045700 780422363
2276.9 780422363 780590591 781062012 781281433 781186523 781068573 780766754 780980148 780807953 780745926 780256271
2286.5 780256271 780183182 780264664 779690628 779769974 779580307 779812546 779278412 778907471 779043503 778600464
2296.2 778600464 778766632 778219528 778310776 778263168 778130722 778007050 777471085 777860184 777007446 776779175
2305.8 776779175 776637268 775764542 775166626 774456406 774155579 772986526 772797852 772489777 772359314
2314.5 772359314 772551270 771902771 772169724 771401443 770280304 769144974 768822021 768234558 766459808
2323.2 766459808 766473236 766606598 766483307 765730667 765600739 765131607 764583588 764768372 763569336 763541489
2332.8 763541489 763442841 763546066 763103714 761790085 761684113 761866074 761224823 759484787 759877930
2341.5 759877930 759886475 759325485 759347382 759930191 761857605 763612061 766475830 767541428 765770721
2350.2 765770721 763635559 762027893 760580597 758890839 756289444 754197540 754851303 755216217 754528961
2358.9 754528961 752644119 751014633 752338867 753076172 753430634 753456497 754724808 755604477 755059814
2367.6 755059814 756153641 758414307 760533981 761169052 762591095 763796768 764237671 765025558 765825577
2376.2 765825577 767186203 767919464 768735275 769829483 770774231 771729126 772683868 773400192 773483810
2384.9 773483810 773997803 774288483 774089355 773924789 773696823 773619537 773422775 773313904 773085480 772933807
2394.6 772933807 772964249 773167343 773348160 773073425 773027267 773216705 773154449 772630005 772391968 772431412
2404.2 772431412 772300339 771887436 771338120 771344604 771183853 771042099 771061707 771191177 771069031 770521774
2413.8 770521774 770379028 769811401 769491119 769482498 769643326 769811020 769188614 769072342 768987045 768903275
2423.5 768903275 769037247 768696365 767865982 767327728 767507935 767205200 766861801 766601334 766433182 766191711
2433.1 766191711 765677948 765709534 765842056 765722427 764974136 764666519 764562302 763813477 763597107 763703995
2442.8 763703995 763772354 763442764 762951736 762510376 762499313 762717972 762616196 762718430 762324066 761775818
2452.4 761775818 760990295 760363464 760264435 759819489 759812393 759795227 759661102 759468002 759233704 759175262
2462.1 759175262 758850555 758589325 758306503 758328323 758206482 757772369 757529373 757238159 757023392 756842880
2471.7 756842880 756673813 756280670 755921249 755633850 755451279 755292282 754921722 754881210 754805832 754774399
2481.3 754774399 754547195 753901138 753463974 753311386 753356400 753160629 752904510 752729797 752529907 752321243
2491 752321243 752161636 752075882 751954651 751966858 751912308 751675339 751402206 751300735 751108093 750944977
2500.6 750944977 750741959 750465317 750552063 750171356 749814835 749518433 749092484 749186707 749189911 748882217
2510.3 748882217 748501053 748663330 748652344 748486862 748324966 747846680 747973633 747692184 747356720 747331314
2519.9 747331314 747059784 746891403 746811066 746809006 746338272 746196671 746022644 745288544 744813538 744886703
2529.6 744886703 745205536 744756546 744345093 744083862 743855667 743597336 743037109 743110962 743152161 742763748
2539.2 742763748 742230988 741969452 741953201 741894913 741505280 740601807 740309067 740383606 740586090 740520172
2548.9 740520172 739732513 738895721 738479767 738640823 738534470 738392181 738444519 738423233 737986450 737213440
2558.5 737213440 736921463 736680908 736670761 736566849 736181793 735904388 735409164 735115662 735178146 735128555
2568.1 735128555 734622726 734114990 733735886 733748856 733816986 733383484 732930603 732331543 732266083 732180328
2577.8 732180328 731679077 731513367 731296158 730996017 730795593 731049805 731106110 731098404 731020660 730182419
2587.4 730182419 729410858 728973236 728851852 728574829 728560867 728820953 728511353 728087769 727953873 728267746
2597.1 728267746 728234558 727897186 727365189 726585999 726254959 726254959 726304398 726024628 725825500 725666046 725576096
2607.7 725576096 725617142 725367813 724955444 724062576 723419037 723199310 723192596 723143005 722523270 722141571
2617.3 722141571 722189331 722192001 721513977 720662155 720238266 720109787 720134430 719763184 719202118 718445053
2627 718445053 717770615 717354126 717155457 717168045 716677933 716056519 715939636 715693817 714816055 714193954
2636.6 714193954 713779831 713352585 712973785 712288284 711787109 711384659 711420898 711157837 710357437 710010452
2646.3 710010452 709471741 709154053 708842545 708261719 707886963 707642288 707333527 706645584 705942307 705197296
2655.9 705197296 704667969 704206314 703833084 703731155 703540573 703631821 703578873 703340530 702708206 701723709
2665.5 701723709 701067886 700529175 700340576 700327682 700016479 699375610 699042053 698962326 698377228 697878723
2675.2 697878723 697866287 697527771 696904144 696720200 696428909 696242599 695868607 695047836 694695740 694138107
2684.8 694138107 693703842 693475952 693110886 692793579 692339478 692147446 691702499 691174698 691143646 690937119
2694.5 690937119 690080795 689620132 689548264 688926315 688757401 688693466 688397598 687966232 687258530 686925049
2704.1 686925049 686520309 686105804 685590134 684922562 684501953 684070435 683490372 683051682 683082962 683040771
2713.8 683040771 682833481 682385178 681535950 680640488 680075912 679732513 679455566 679634171 679235611 678505478
2723.4 678505478 678322830 678250427 678055878 677303467 676973495 677072372 676841660 676344681 675575638 675316238
2733 675316238 675379410 675348434 674919815 674083252 673766098 673700714 673168869 672659836 672660141 672478027 671836853
2743.7 671836853 671444092 671448975 671382370 671090851 670652847 670480118 670446014 670092392 669739456 668983307
2753.3 668983307 668473740 668761139 668632889 668132477 667722778 667378082 666972809 667106400 667422409 666931610
2762.9 666931610 666509705 666339035 666195602 666063156 665474548 664703751 664625244 664675293 664083176 663745117
2772.6 663745117 663658295 663540115 663234329 662817078 662757187 662716141 662441711 661779175 661076202 660463867
2782.2 660463867 660212021 660099945 659654236 659379196 658766327 658232574 658004456 657675018 657250443 656368713
2791.9 656368713 655900574 655608063 654955597 654507904 654347534 654027939 653089523 652400360 652060089 651276016
2801.5 651276016 650354843 649637527 649130554 648742828 648183365 647329025 646478729 645991211 645456390 644446564
2811.2 644446564 643523483 642706680 641928635 641472168 641026840 640229874 639253082 638730049 638097305 636800232
2820.8 636800232 635468903 634706078 634389191 633786926 632848396 631555367 630347366 629601593 628852577
2829.5 628852577 627994232 627059822 625832634 624384232 623706818 623082428 621846275 621027870 620217819
2838.2 620217819 618771362 617172966 616041679 614592133 613033943 611562157 609572906 608211784
2845.9 608211784 606844978 604892273 602862740 601028900 599589920 598165436 597108040 596097794
2853.6 596097794 595235138 594390259 593231239 592342377 591771469 591391296 590492058 589211922 588087273
2862.3 588087273 587544022 586886826 585564461 584549942 582916718 580905418 579207191 577468033 576004753
2870.9 576004753 574300652 572401733 570900116 569594650 567484970 565234032 563841209 562168503
2878.7 562168503 560262413 558907585 557606430 555905228 554480095 553496017 552351799 551361198 550975037
2887.3 550975037 550518990 549459534 548563309 548069191 547805939 547545700 547577972 547783356 547133064 546437721
2897 546437721 545739937 545102158 545086555 544832306 544349442 544091530 543833275 542929687 542184868 541724968
2906.6 541724968 540844688 539992409 539054260 538157806 537306671 536482048 534958992 533198662 532076683
2915.3 532076683 530354805 528380585 526308365 524473572 523268738 522082748 520710144 519325371
2923 519325371 518677254 517768021 517126312 516909828 516180611 515919304 516012726 516576538 516830139 516837273
2932.7 516837273 517316093 517774086 518869247 520363159 521996994 523957214 525960007 527516975 528956299
2941.3 528956299 530898476 532985382 535313797 537664604 539750404 541876831 543927002 545668182
2949.1 545668182 547747803 549691429 551226158 553172684 554904900 557033882 559208794 560877380
2956.8 560877380 562701454 564389114 566366615 568418579 570537834 572254601 573465958 574899101
2964.5 574899101 576484947 577970848 578858185 580245056 582074203 583664703 585154381 586591949
2972.2 586591949 587855797 588624840 590075607 591565666 592794380 594142189 595068054 596223679 597214050
2980.9 597214050 597996216 598681450 599670525 601018906 601713448 602356949 603349457 604151154 604540253
2989.6 604540253 605045204 605526962 605810890 606270142 606862717 607619362 608224678 608504448 608101234 607898407
2999.2 607898407 608414879 608427315 608279228 608372498 608297119 608176003 608169479 607657166 606988792 607020836 607199745
3009.8 607199745 606767235 605752335 605226097 605128288 605051270 604675026 603758202 603085289 602349014 601798096
3019.5 601798096 601311722 600658379 600257835 599578171 599020767 598328590 597093353 596263466 595877495
3028.1 595877495 595286598 594770660 594213371 592989273 591984673 591429749 590820122 589891319 588717461
3036.8 588717461 587695541 586670036 585820503 585364952 584948959 584074821 583062782 581930428 580402908
3045.5 580402908 579473495 579027901 578006325 576803970 576093941 575271301 574412346 573654213 572664604
3054.2 572664604 571893654 570894699 569821815 568675766 567217712 566240692 565308914 564428673 563904572
3062.9 563904572 563003998 561489487 560604362 560165863 558847198 557739601 557023621 556074028 555331078
3071.5 555331078 554765816 553928680 552757759 551786385 551033859 550465202 549744949 548633575 547307281
3080.2 547307281 546161995 545498657 544131279 542747459 542353554 541674652 540727119 539853783 538903542
3088.9 538903542 537777863 536300087 535666466 535611076 534387016 533167839 532227669 530825729 530129471
3097.6 530129471 529443550 528542442 527858543 526635284 525369682 524397469 523477020 522684364 522009392
3106.2 522009392 521285286 520696831 519963150 518544044 517302437 516382980 515414696 514670448 513827133
3114.9 513827133 512577171 511307297 510659485 509989052 508694305 508023186 507641716 506256943 505107613
3123.6 505107613 504706459 503845673 502476349 501261597 500668221 499944839 498736992 498181114 497617683
3132.3 497617683 496115723 494762917 494112549 493569984 492685623 491783218 491081848 490309982 489224319
3141 489224319 488009148 487425423 487072372 486118469 484774933 483893661 483682365 482809677 481529427
3149.6 481529427 480490761 479558868 478835411 477688065 476848335 476289215 475467415 474697762 473754044
3158.3 473754044 472983551 472036743 471158485 470276260 469295197 468881645 468090553 467177505 466415329 465501137
3168 465501137 464681473 463987732 463270531 462443581 462024117 461382446 460641403 460172539 459392662 458238029
3177.6 458238029 456756935 455866432 455430489 455001678 454492912 453667831 452705345 451899147 451512451
3186.3 451512451 450895538 450152359 449433479 448544235 447604675 446909142 446539383 445731659 445125237 444735107
3195.9 444735107 444149323 443270988 441992416 441361313 440874557 440238724 439703674 439106903 438394012
3204.6 438394012 437924576 437765312 436908531 436075592 435336838 434457932 434160271 433904648 433198280 432234268
3214.3 432234268 431654663 431182671 430794601 430224075 429398384 428904610 428290596 427861595 427432709 426960335
3223.9 426960335 426495743 425827560 425244598 424567451 424273338 424056435 423560028 422986221 422344666 421486740
3233.5 421486740 420713043 420740395 420489998 419705162 419066582 418593483 418225899 417914886 417268448 416310501
3243.2 416310501 416528091 416602516 415656204 415253830 414671135 413687820 413249550 413294106 412981567 412666702
3252.8 412666702 412148666 411193390 410994949 410728874 409960899 409473152 408981056 408406067 408444214 408223534
3262.5 408223534 407470474 407221413 406686172 406553307 406660690 405848465 405210876 405131874 405118103 404289055
3272.1 404289055 403300400 403002930 403243065 403316383 402146416 401373215 401772957 402106056 401583138 400688057
3281.8 400688057 400540161 400507812 400214119 399748993 399037704 398449478 397854195 397681503 397897148 397596931
3291.4 397596931 397095947 396795235 396680527 396500397 396007919 395740509 395357552 394934082 394776001 394394226
3301 394394226 394082985 393623352 393127899 392911491 392708473 392610016 392210197 391360550 390993576 390976410
3310.7 390976410 390089226 389085922 388771057 388794441 388731041 387897034 386964264 386962967 387422676 386917648
3320.3 386917648 386276703 386192017 385572281 385013199 384386177 383911362 383479729 382755775 382788734 382642403
3330 382642403 382059631 381631851 381478157 381070595 380210953 379893036 379467239 378826103 378223724 377503777
3339.6 377503777 377364159 377534676 377356682 377095909 376728592 375845757 375073814 374534264 373855324 373284035
3349.3 373284035 373223457 373549080 373362694 372452431 371366959 370779381 370102882 369304085 369242058 368997383
3358.9 368997383 368407593 368183517 368085480 367540474 366879578 366212349 365416298 365026627 364862900 364893951
3368.6 364893951 364592094 364069939 363784142 363246269 362793083 362488060 362254219 361543121 360865974 360951805
3378.2 360951805 360425682 359605179 359412460 359373627 358975792 358728142 359083443 358800316 357913208 357716789
3387.8 357716789 357891197 357780037 357414474 356898689 356103516 355085106 355197449 356005249 355925407 355023460
3397.5 355023460 354221306 354275093 353886147 353758888 354594841 354504967 354187546 353775940 353388138 353534966
3407.1 353534966 353762665 353500938 352690887 352759018 353003387 352386742 351294060 351133652 351914749 352239380
3416.8 352239380 352531357 352349854 352385674 352339363 351632156 351880417 351961555 351831131 352070198 352178116
3426.4 352178116 352022552 351570396 351363792 351616821 351666031 351396255 351785088 352081413 351877861 352141266
3436.1 352141266 352693672 352986908 352933807 352985916 353591461 354178085 353500481 352897301 353207245 354233246
3445.7 354233246 355214272 354298058 354183578 355009041 355272789 355188332 355168991 356055641 356726227 357188301
3455.3 357188301 357183533 357207451 357847862 358086739 358763275 359176407 359172287 359281120 359538956 360020142
3465 360020142 360598221 361172714 361193771 362022018 362642593 362423515 362633209 362794952 363150177 363450089
3474.6 363450089 364105797 365234947 366046219 366299934 366627274 367381973 367588425 367595215 367847900 368744392
3484.3 368744392 369380989 369494781 370255089 370538788 370733986 371628456 372296181 372468643 372953033 373754883
3493.9 373754883 374353943 374967079 375168228 375429039 376208191 376912766 377441711 378262329 378581276 378415947
3503.6 378415947 379035568 379708099 380440865 381038628 382338600 383056107 382268143 383385735 384657059
3512.2 384657059 385266533 385511513 385808487 386682396 387107048 387756348 387710762 387771988 388730698 389959679
3521.9 389959679 391008377 390606956 391144638 392659454 393538704 393256607 393029633 394193192 395441055
3530.6 395441055 395600395 396096992 397529182 398022156 399166374 399797096 399677544 401478348 402621498
3539.2 402621498 403096123 403303070 404275665 405630188 406336060 406584167 406471977 407795601 407777557
3547.9 407777557 409217072 410984688 411732407 413313332 412713432 413839455 415049667 416115494 417743378
3556.6 417743378 418011894 419591408 420557938 421208954 421985359 424086800 425002365 424821777 428856773
3565.3 428856773 428908577 427957687 426790314 425934906 430794067 433502655 435139580 436641731 437847939
3574 437847939 439010811 440541496 442339630 442409058 444834251 446441994 446912804 448664131 450118866
3582.6 450118866 451179886 452456322 457355766 457911949 454555626 456644058 456848221 460654221 464447327
3591.3 464447327 466919022 466770935 467308693 470755959 469125290 471920929 475714798 476568069 479345398
3600 479345398 479344215 480480194 483443108 485043716 486673775 489595642 491470833 490623322 494153862
3608.7 494153862 492604408 493780289 502724228 502596397 499967346 504037323 503012276 507696114
3616.4 507696114 512115135 510413322 511400185 510557404 512406464 516283226 518916397 521437302 524258156
3625.1 524258156 525745201 527191429 533921204 530327988 518754044 526226540 532953339 539269753
3632.8 539269753 539192238 537163239 540829239 544042206 545877838 546174622 548165779 550729065 553090820
3641.5 553090820 553827057 554227524 557863922 562226677 567896919 564870949 559709549 564491997 562560081
3650.1 562560081 560054131 561237946 568015022 572814445 576935081 580137405 569468575 573568764
3657.9 573568764 580901947 582608910 584058495 584734879 586487160 587122192 588485641 590054359 591270981
3666.5 591270981 596702576 598555717 595661659 594457436 587633553 592267380 602537041 611415825
3674.3 611415825 605958023 585127220 592077026 602765656 607408600 603082237 603863029 608182259
3682 608182259 610575409 612145348 612644806 613310127 617345581 622681885 611167145 609610214 618723297
3690.6 618723297 610967369 612932281 619423904 620036240 622484360 622776604 622663078 625024910 625725174
3699.3 625725174 628499794 630976601 622387085 620721855 627535934 629459305 629572105 630070343 633954620
3708 633954620 638345718 628901978 632635880 634493523 620780220 628732224 634612579 635319176 636721115
3716.7 636721115 639257584 639228439 634862251 637085419 642676926 636998940 634330330 640808716 641469879
3725.4 641469879 640134811 635995369 637941589 642871399 643420868 649263763 645209198 638798332
3733.1 638798332 649186249 646982956 635484047 638224411 641271515 641713028 645526047 649136047
3740.8 649136047 645353394 650211563 663914108 646329117 629178238 643583374 650562286 657400665
3748.5 657400665 651668472 640756226 653635178 644874573 639964561 648102188 653783264 657409897
3756.2 657409897 652021637 655404510 660620270 650565948 649644699 655419769 657517395 658061752
3763.9 658061752 660798035 655651169 651101303 656349258 662464066 661416397 651231461 654654617
3771.7 654654617 658701248 659105301 659994049 660242081 661999054 662590332 665634689 664330292 655156860
3780.3 655156860 659476547 662642059 663810196 665118790 660375366 660525055 662539902 663763504
3788 663763504 664990234 664817276 665572205 664932709 664998703 665354385 666903076 669705048 663755035
3796.7 663755035 661210098 665064468 669132996 674751205 664760437 654022369 660041428 664910736
3804.4 664910736 672350388 678732605 664069748 659504547 666481323 669685516 670204544 670350189
3812.2 670350189 670849838 672949295 678649216 673314896 658183899 666408997 673241043 677903137
3819.9 677903137 676620636 655611115 661512527 669015808 671323013 673507690 672106552 668156052
3827.6 668156052 670859222 673826218 676891632 676390610 665859604 670916367 679292603 672062149
3835.3 672062149 671997147 680532913 669340286 665470123 673531189 666806183 670554886 679477386
3843 679477386 674126205 669886475 674088516 675988464 676493530 678718643 676485443 678729172 686405334
3851.7 686405334 679947052 679066772 656564713 662325668 675936279 673585434 672824402 676790314
3859.4 676790314 679113007 680576935 674345245 676741714 684852905 675198135 669617920 676468582
3867.1 676468582 683577728 689310913 674990921 665060577 672875214 681954803 683762589 669820023
3874.8 669820023 673776474 679987335 679720459 682300644 687056351 677776337 669920654 678562469
3882.6 678562469 680551910 683694839 688905792 672376633 674843674 680162811 682355270 687677536
3890.3 687677536 683208923 672268982 675970688 680062180 679037933 681551743 683082886 685740967
3898 685740967 685505905 674147949 682397461 683949585 677483902 682821045 677642288 676398544 677490997
3906.7 677490997 678767166 681610870 682011490 683077927 683076096 683133545 682923813 682666245 684432220
3915.3 684432220 685361710 680028076 677541580 683834915 682779922 678576355 682896500 685523376
3923.1 685523376 686123657 682295532 679498367 681914978 683022919 684365692 683025818 682541809 684933548
3931.7 684933548 681979980 681059875 682585220 682386856 683592987 684895630 684827881 683867264 683196945
3940.4 683196945 685688095 685959854 680013275 680471649 683148499 684367599 685214386 683060837 683753891
3949.1 683753891 683111572 681566696 684236984 684644165 684511642 684471512 684410858 685018463 684677887 685143356
3958.7 685143356 684673309 684974823 685177841 683588028 683803101 684164352 685053482 685897980 685389633
3967.4 685389633 685469284 684908981 684255371 685714035 686269608 684956665 684849548 685146713 684967041
3976.1 684967041 685049973 685201874 685258484 685242004 685295486 685940323 686118317 685114059 685028152 685295868
3985.7 685295868 685727539 685810699 684871979 685221024 685118790 684729385 685587997 686273117 685820923 684584427
3995.4 684584427 685041656 686041336 686548767 686415100 685896530
4000.2 685896530
##END=$$ End of the data block
