##TITLE=$$ Begin of the data block
##JCAMP-DX=5.00 $$ ACD/SpecManager v 10.08
##SPECTROMETER/DATA SYSTEM=Varian
##DATE=20 Nov 2012 13:42:06
##DATA TYPE=INFRARED SPECTRUM
##DATA CLASS=XYDATA
##ORIGIN=
##OWNER=
##NPOINTS=3735
##FIRSTX=399.26403809
##LASTX=4000.35498047
##MAXX=4000.35498047
##MINX=399.26403809
##MAXY=78.25228882
##MINY=30.92714882
##XFACTOR=1.0000000000
##YFACTOR=0.000000100000000
##FIRSTY=58.81622696
##DELTAX=0.96440572
##XUNITS=1/CM
##YUNITS=TRANSMITTANCE
##XYDATA=(X++(Y..Y))
$$ plain form
399.3 588162270 588361244 568970604 563372116 568063087 573860817 575816383 576775246 582578888 579599113
407.9 579599113 566800575 568043709 577999191 577042274 572643280 575389404 577140999 577890282 580067635
416.6 580067635 579259987 584580154 589746666 576033440 569725456 569128838 573514595 575323753 576339073
425.3 576339073 580253677 578634300 571245766 566186409 565153008 564609184 561401711 559678535 562417679
434 562417679 564094353 561420898 558325424 559048347 558622704 556800079 558657303 563816414 569319496
442.7 569319496 571712036 574583244 575384941 575382004 577577705 577637405 578718872 579404526 578260918
451.3 578260918 577673225 579404678 581493759 579548378 579192352 580571175 577044411 575504646 576905327
460 576905327 579428024 574274483 567626419 568076935 566841164 567920265 572776070 575692596 574682999
$$ packed form
399.3E88162270J98974j9390640n598488M690971N797730J955566R58863N803642k979775
407.9E79599113j2798538J243134R955482r56917m398994K746124J751595P49283K177353
416.6E80067635q07648N320167N166512j3713226o307984n96618M385757J809158J015320
425.3E76339073L914604j619377p388534n059357j033401n43824l207473j723176K739144
434E62417679J676674k673455l095474P22923m25643j822625J857224N159111N503082
442.7E69319496K392540K871208Q01697k937K195701N9700J081467O85654j143608
451.3E78260918n87693J731453K089081j945381l56026J378823l526764j539765J400681
460E76905327K522697n153541o648064M50516j235771J079101M855805K916526j009597
$$ plain form
468.7 574682999 568892021 567211380 569490395 566521378 563562317 564482193 563534927 558462715 553444939
477.4 553444939 552427826 555188332 555755424 552583389 552999954 553254967 550588570 552795029 558027725
486.1 558027725 560215530 557088737 557014732 557576218 554049911 552318802 553150101 555323105 555034065
494.7 555034065 552708435 549606476 547354317 549617310 549955940 548917923 547040024 543643951 541783066
503.4 541783066 540687370 543038063 540735130 533985901 534769859 538168678 536967964 533477821 533769073
512.1 533769073 533738518 530396690 525472260 524033546 523699837 521302452 519230957 515348969 515734406
520.8 515734406 514382057 511510048 512065620 511237068 511506348 511047516 511231575 512035599 511748123
529.5 511748123 511469955 512516022 513832512 512300110 512788734 514165344 515414963 516171570 515988770
$$ packed form
468.7E74682999n790978j680641K279015k969017k959061R19876r47266n072212n017776
477.4E53444939j017113K760506N67092l172035M16565K55013k666397K206459N232696
486.1E58027725K187805l126793p4005N61486l526307j731109Q31299K173004k89040
494.7E55034065k325630l101959k252159K262993L38630j038017j877899l396073j860885
503.4E41783066j095696K350693k302933o749229P83958L398819j200714l490143K91252
512.1E33769073l0555l341828m924430j438714l33709k397385k071495l881988L85437
520.8E15734406j352349k872009N55572q28552K69280m58832J84059Q04024k87476
529.5E11748123k78168J046067J316490j532402M88624J376610J249619P56607j82800
$$ plain form
538.1 515988770 518335686 521923370 526463547 528991089 530605087 533075600 534687386 533909569 531785049
546.8 531785049 533112946 533985405 532486839 531508942 531833572 532108803 531155090 531571960 530510139
555.5 530510139 528386765 527745209 527024345 525925713 523159714 520129318 517772064 515521698 512929840
564.2 512929840 511353302 508968811 504630814 501994514 498788605 495182571 492273102 491410294 490124054
572.9 490124054 487206459 486430893 487711716 491491737 492702942 494228592 496349754 495993729 497462387
581.5 497462387 501337318 505003166 508007431 513460541 517528305 519054794 520702286 522696991
589.3 522696991 524334221 524916801 526032448 526516685 527447128 528225365 527979584 528305092 528082695
597.9 528082695 528079834 528203125 527645340 526268768 526349449 527391853 526683922 526713409 526913490 526719208
$$ packed form
538.1E15988770K346916L587684M540177K527542J613998K470513J611786p77817k124520
546.8E31785049J327897Q72459j498566r77897L24630K75231r53713M16870j061821
555.5E30510139k123374o41556p20864j098632k765999l030396k357254k250366k591858
564.2E12929840j576538k384491m337997k636300l205909l606034k909469q62808j286240
572.9D90124054k917595p75566J280823L780021J211205J525650K121162l56025J468658
581.5D97462387L874931L665848L004265N453110M067764J526489J647492J994705
589.3E22696991J637230N82580J115647M84237R30443P78237k45781L25508k22397
597.9E28082695k861J23291n57785j376572Q0681J042404p07931K9487K00081j94282
$$ plain form
607.6 526719208 526386032 526764412 528819008 530061836 530645828 530980301 530814819 530748749 530412865 530425949
617.2 530425949 532488785 535168228 536844139 538100662 540502357 543301964 543825874 544928856 546516609
625.9 546516609 548050499 549910698 550631142 552544289 554056206 554266396 554530563 555931435 557611809
634.6 557611809 557734566 558286400 558934631 559499969 559786530 560507545 561366768 561217194 561126823 560000992
644.2 560000992 559897423 560385818 560969353 563089600 564341698 565325089 565637436 565644760 566445503 566666183
653.9 566666183 565999794 565498009 565808220 566130409 566690483 567310982 568355904 569946823 570707436
662.5 570707436 570558319 570999641 572186089 573022079 571118050 558712540 565206566 571137810 572138634
671.2 572138634 572857323 574310341 576622124 578271446 577752838 577266693 577766914 578657341 578620186
$$ packed form
607.6E26719208l33176L78380K054596J242828N83992L34473j65482o6070l35884J3084
617.2E30425949K062836K679443J675911J256523K401695K799607N23910J102982J587753
625.9E46516609J533890J860199P20444J913147J511917K10190K64167J400872J680374
634.6E57611809J22757N51834O48231N65338K86561P21015Q59223j49574r0371j125831
644.2E60000992j03569M88395N83535K120247J252098R83391L12347P324Q00743K20680
653.9E66666183o66389n01785L10211L22189N60074O20499J044922J590919P60613
662.5E70707436j49117M41322J186448Q35990j904029j2405510O494026N931244J000824
671.2E72138634P18689J453018K311783J649322n18608m86145N00221Q90427l7155
$$ plain form
679.9 578620186 578777390 579345398 580676270 582367210 583170433 583888588 584014397 584508781 584654350
688.6 584654350 584489975 585437202 585620232 584644318 583747978 584034653 583947945 583619232 583172951 581187859
698.2 581187859 580296783 579898300 578859100 577616005 575981827 575094719 574205818 573126793 572103043
706.9 572103043 571534157 571795692 572742958 574258614 574273224 573430061 574489174 576665077 578232002
715.6 578232002 579379807 581379700 584033279 585838013 587894211 591139450 594312019 596830940
723.3 596830940 598660774 600361099 602766762 605209389 607419815 609981308 611462440 612926598
731 612926598 614845238 616409378 618454208 619562988 620442581 621388092 621333389 621607475 623039551
739.7 623039551 624568214 625171471 625998344 626586342 625621834 624091835 622982788 621880798 620790443
$$ packed form
679.9E78620186J57204N68008J330872J690940Q03223P18155J25809M94384J45569
688.6E84654350j64375R47227J83030r75914q96340K86675q6708l28713m46281j985092
698.2E81187859q91076l98483j039200j243095j634178q87108q88901j079025j023750
706.9E72103043n68886K61535R47266J515656J4610q43163J059113K175903J566925
715.6E78232002J147805J999893K653579J804734K056198L245239L172569K518921
723.3E96830940J829834J700325K405663K442627K210426K561493J481132J464158
731F12926598J918640J564140K044830J108780Q79593R45511n4703K74086J432076
739.7F23039551J528663O03257Q26873N87998r64508j529999j109047j101990j090355
$$ plain form
748.4 620790443 619405327 617009239 614894638 613897362 612114296 610089302 609874306 607949562 605431099
757.1 605431099 605264626 603597717 600753632 597942734 595842972 595309677 594482498 593982010 594144783
765.7 594144783 594843941 596329727 598074265 600742798 603701706 606081924 608072357 610559425 614141006
774.4 614141006 617578239 619837265 622713547 627268333 632161217 636583519 639303665 641774292
782.1 641774292 644873886 647965240 649626007 649542770 650514755 651370621 652809525 654848557 656323471
790.8 656323471 657646713 658776169 660925293 662957153 665011749 666106949 667083282 669038162 670983810
799.5 670983810 672611618 672019272 672745209 674884415 676837921 679147797 680942459 682633667 682982407
808.2 682982407 682657242 682477264 683090439 683318024 684003601 685049896 684795303 685783463 686526413 687413635
$$ packed form
748.4F20790443j385116k396088k114601r97276j783066k024994k14996j924744k518463
757.1F05431099j66473j666909k844085k810898k099762n33295q27179n00488J62773
765.7E94144783O99158J485786J744538K668533K958908K380218J990433K487068L581581
774.4F14141006L437233K259026K876282M554786M892884M422302K720146K470627
782.1F41774292L099594L091354J660767q3237R71985Q55866J438904K039032J474914
790.8F56323471J323242J129456K149124K031860K054596J095200R76333J954880J945648
799.5F70983810J627808n92346P25937K139206J953506K309876J794662J691208L48740
808.2F82982407l25165j79978O13175K27585O85577J046295k54593R88160P42950Q87222
$$ plain form
817.8 687413635 687589951 687254562 687612457 686707153 686037445 684635544 683400574 682424164 681534195
826.5 681534195 680780029 678961487 677015915 675050430 674145432 671994858 669490051 668422775 667148895
835.2 667148895 664742126 661180878 659697037 658471603 656847916 655504379 652948380 650951157
842.9 650951157 650051804 649485016 647660828 645735626 644219894 642448502 641084290 639730453 639176254
851.6 639176254 638359528 636847725 635070457 632596016 629855919 627791595 625874176 623080864 621503487
860.3 621503487 621431808 623004684 625047722 625951004 628944550 633776398 639159775 643816147 647613144
868.9 647613144 651568451 655155029 660523300 666826706 671094894 673291779 675702286 678164215
876.7 678164215 680270004 681463776 681186295 680922089 680009308 678547897 676803665 675605774 674307022
$$ packed form
817.8F87413635J76316l35389L57895r05304o69708j401901j234970r76410q89969
826.5F81534195p54166j818542j945572j965485r04998k150574k504807j067276j273880
835.2F67148895k406769l561248j483841j225434j623687j343537k555999j997223
842.9F50951157q99353n66788j824188j925202j515732j771392j364212j353837n54199
851.6F39176254q16726j511803j777268k474441k740097k064324j917419k793312j577377
860.3F21503487p1679J572876K043038R03282K993546M831848N383377M656372L796997
868.9F47613144L955307L586578N368271O303406M268188K196885K410507K461929
876.7F78164215K105789J193772k77481k64206r12781j461411j744232j197891j298752
$$ plain form
885.3 674307022 672036285 669571609 666716919 664130783 661958313 659862137 657523804 655764084
893 655764084 653239975 650323486 648657074 646125641 644353409 642943115 640989075 639429054 637136383
901.7 637136383 635493813 634009705 631729736 628851433 625300217 622314682 619839516 616606712
909.4 616606712 612547264 608708344 604811401 600385399 596029930 592046165 588424416 584479713
917.2 584479713 579957123 575541344 571749153 569066277 566752396 564907684 563455544 562035103
924.9 562035103 561384697 561053123 560952568 560625381 560505981 561134605 562113304 562856216 563340874 564343033
934.5 564343033 565279617 566671906 568166618 569556999 571860886 574572220 576599350 577898521 580276718
943.2 580276718 582631264 583034782 582289467 581667213 581135483 579062538 575998993 572971077 568742561
$$ packed form
885.3F74307022k270737k464676k854690k586136k172470k096176k338333j759720
893F55764084k524109k916489j666412k531433j772232j410294j954040j560021k292671
901.7F37136383j642570j484108k279969k878303l551216k985535k475166l232804
909.4F16606712m059448l838920l896943m426002m355469l983765l621749l944703
917.2E84479713m522590m415779l792191k682876k313881j844712j452140j420441
924.9E62035103o50406l31574j00555l27187j19400O28624R78699P42912M84658J002159
934.5E64343033R36584J392289J494712J390381K303887K711334K027130J299171K378197
943.2E80276718K354546M03518p45315o22254n31730k072945l063545l027916m228516
$$ plain form
951.9 568742561 563866692 559181252 553522263 547370949 542222595 536350517 529359550 522699509
959.6 522699509 516106606 508919868 501065636 493829651 486406288 479107666 471466293 462893066
967.3 462893066 454527931 446221275 439012032 430596695 421393166 412170868 403168678 394494171
975 394494171 385280952 377831306 370047112 362505875 354599228 347762489 342390976 336151123 331335602
983.7 331335602 326422882 322947617 319199772 316722260 314947090 312699280 312641640 310933361 310312519
992.4 310312519 309891090 310271549 310183945 309271488 310088463 309805737 310992355 311020813 311786613 312827377
1002 312827377 312902336 313693066 313317642 313930969 313196030 313452377 313608418 313380013 313448658 312493114
1011.7 312493114 312616158 311415234 311710358 310963268 310692863 311454563 311099377 312757149 313411770
$$ packed form
951.9E68742561m875869m685440n658989o151314n148354n872078o990967o660041
959.6E22699509o592903p186738p854232p235985p423363p298622p641373q573227
967.3D62893066q365135q306656p209243q415337r203529r222298r002190q674507
975C94494171r213219p449646p784194p541237p906647o836739n371513o239853m815521
983.7C31335602m912720l475265l747845k477512j775170k247810n7640j708279o20842
992.4C10312519m21429L80459q7604r12457Q16975k82726J186618K8458P65800J040764
1002C12827377P4959P90730l75424O13327p34939K56347J56041k28405O8645r55544
1011.7C12493114J23044j200924K95124p47090k70405P61700l55186J657772O54621
$$ plain form
1020.3 313411770 315118446 316172504 317559185 318997040 319344692 320928192 321812668 323811684 325280304
1029 325280304 327218285 328685265 330620270 332804489 333432617 335066032 335635986 337580185 338032990
1037.7 338032990 337981911 338697243 338481674 338371506 337255898 338358421 338317909 339084358 339073601 338916245
1047.4 338916245 341257324 341094208 342552223 343361664 345283089 347446671 349111824 351991463 353904533
1056 353904533 357422485 359734650 363703423 367132835 370649033 376015396 380741081 385910988 389452400
1064.7 389452400 394617996 398232918 401252899 403601799 402950592 401070099 395527611 390111961
1072.4 390111961 384158554 379166565 374977036 371320686 369497986 367205429 366851349 365508690
1080.1 365508690 366013985 366861191 368028946 369825211 370625496 373672295 375702744 378549309 380071297
$$ packed form
1020.3C13411770J706676J054058J386681J437855L47652J583500Q84476J999016J468620
1029C25280304J937981J466980J935005K184219O28128J633415N69954J944199M52805
1037.7C38032990n1079P15332k15569j10168j115608J102523m0512P66449j0757j57356
1047.4C38916245K341079j63116J458015Q09441J921425K163582J665153K879639J913070
1056C53904533L517952K312165L968773L429412L516198N366363M725685N169907L541412
1064.7C89452400N165596L614922L019981K348900o51207j880493n542488n415650
1072.4C90111961n953407m991989m189529l656350j822700k292557l54080j342659
1080.1C65508690N05295Q47206J167755J796265Q00285L046799K030449K846565J521988
$$ plain form
1088.8 380071297 382857132 386430130 388848915 392153740 393392410 396716957 399042664 401568871
1096.5 401568871 403918762 404910736 406540108 406829262 408435593 407897110 408075943 408364830 408104973
1105.2 408104973 408998260 408883476 410422745 410639305 412348366 414767342 417535858 420465508 421949806
1113.9 421949806 424479103 425114326 426774445 427930794 429193840 430480614 430346756 431937866 432614517
1122.6 432614517 434013176 434620323 435422668 436800537 438182526 440529213 442187653 445232315 447058372
1131.2 447058372 448986549 450855217 452136383 452992287 452949867 454989624 454347191 451587105 448555069
1139.9 448555069 445409622 442788811 439742546 436908531 432869377 429806709 426493530 423551865
1147.6 423551865 420505447 416903915 414384384 411550064 410035210 407221184 406347275 406283569 405407677
$$ packed form
1088.8C80071297K785835L572998K418785L304825J238670L324547K325707K526207
1096.5D01568871K349891R91974J629372K89154J606331n38483J78833K88887k59857
1105.2D08104973Q93287j14784J539269K16560J709061K418976K768516K929650J484298
1113.9D21949806K529297O35223J660119J156349J263046J286774j33858J591110O76651
1122.6D32614517J398659O07147Q02345J377869J381989K346687J658440L044662J826057
1131.2D47058372J928177J868668J281166Q55904m2420K039757o42433k760086l032036
1139.9D48555069l145447k620811l046265k834015m039154l062668l313179k941665
1147.6D23551865l046418l601532k519531k834320j514854k814026q73909o3706q75892
$$ plain form
1156.3 405407677 405563660 405044746 406548653 407138748 408191147 409347763 410491943 413140945 415923080
1165 415923080 419234085 421512642 425880508 430685730 435822563 441061974 446015091 452135887 457652512
1173.7 457652512 464057198 469410782 475559425 482404327 488655052 495182152 501234016 507879677
1181.4 507879677 512863617 517771950 523289642 528343658 533421516 537700195 541894951 545563507
1189.1 545563507 548966064 552388115 555279922 557152672 558308945 559773598 561066895 562078171
1196.8 562078171 562869606 563507500 564329605 565356064 565944443 566214638 566607018 567027626 568427315
1205.5 568427315 569658089 570638008 572296257 573813858 575380898 576953697 578557739 580261879
1213.2 580261879 582430115 584474220 585959587 588121033 590494347 592242928 593565979 594493179
$$ packed form
1156.3D05407677J55983n18914J503907N90095J052399J156616J144180K649002K782135
1165D15923080L311005K278557M367866M805222N136833N239411M953117O120796N516625
1173.7D57652512O404686N353584O148643O844902O250725O527100O051864O645661
1181.4E07879677M983940M908333N517692N054016N077858M278679M194756L668556
1189.1E45563507L402557L422051K891807J872750J156273J464653J293297J011276
1196.8E62078171P91435O37894Q22105J026459N88379K70195L92380M20608J399689
1205.5E68427315J230774R79919J658249J517601J567040J572799J604042J704140
1213.2E80261879K168236K044105J485367K161446K373314J748581J323051R27200
$$ plain form
1220.9 594493179 595066528 595382385 595414276 595126534 594792023 594429092 593948288 593532028 593103638 592688522
1230.6 592688522 591843185 590738335 589760132 588973007 588467445 587697487 587002106 586527863 586046410
1239.3 586046410 585447502 584703140 584375954 584320564 584328041 584529381 584736290 585099754 585820808 586801414
1248.9 586801414 587753334 588394241 589012451 589658508 590352516 591077080 591831779 592727737 593496132 593906174
1258.5 593906174 594025536 594459496 595150986 595613251 595920639 596185036 596476936 597142677 598362923
1267.2 598362923 599155083 599527855 600374718 601191254 601843300 602668343 603108444 603337631 603742104 603950577
1276.9 603950577 604197121 604062347 603793564 603776817 603362122 602972488 602491112 601817513 601487045 601109390
1286.5 601109390 600653152 600388489 599861565 599629669 599437370 599036789 598944168 598063698 597121124 596350861
$$ packed form
1220.9E94493179N73349L15857L1891k87742l34511l62931m80804m16260m28390m15116
1230.6E92688522q45337j104850r78203p87125n05562p69958o95381m74243m81453
1239.3E86046410n98908p44362l27186n5390P477K01340K06909L63464P21054R80606
1248.9E86801414R51920O40907O18210O46057O94008P24564P54699Q95958P68395M10042
1258.5E93906174J19362M33960O91490M62265L07388K64397K91900O65741J220246
1267.2E98362923P92160L72772Q46863Q16536O52046Q25043M40101K29187M04473K08473
1276.9F03950577K46544j34774k68783j6747m14695l89634m81376o73599l30468l77655
1286.5F01109390m56238k64663n26924k31896j92299m00581r2621q80470r42574p70263
$$ plain form
1296.2 596350861 595339622 594594994 593347626 592277565 591637993 590999985 590471764 589741707 588909492
1304.8 588909492 588091927 586623077 585170898 584897156 584260330 583339882 582552414 581438446 580810204
1313.5 580810204 580482597 580302544 580015793 579569397 578844185 577588081 576783447 576451721 575798149
1322.2 575798149 574442596 573023872 571691704 570049858 568455391 566675949 564266777 562041092
1329.9 562041092 559990082 557883797 556172600 554214554 552576942 550854492 549135742 548263969
1337.6 548263969 547454758 546457939 545811081 546721840 547672844 548234215 548485527 548671417 548822594 548819618
1347.3 548819618 548923187 548459091 548313217 548571587 548696785 548740501 548618317 548192749 547441826 547294540
1356.9 547294540 546925888 546345444 545855904 544926872 544312172 543233566 542146645 543152313 544018822
$$ packed form
1296.2E96350861j011239p44628j247368j070061o39572o38008n28221p30057q32215
1304.8E88909492q17565j468850j452179k73742o36826r20448p87468j113968o28242
1313.5E80810204l27607j80053k86751m46396p25212j256104q04634l31726o53572
1322.2E75798149j355553j418724j332168j641846j594467j779442k409172k225685
1329.9E62041092k051010k106285j711197j958046j637612j722450j718750q71773
1337.6E48263969q09211r96819o46858R10759R51004N61371K51312J85890J51177k976
1347.3E48819618J03569m64096j45874K58370J25198M3716j22184m25568p50923j47286
1356.9E47294540l68652n80444m89540r29032o14700j078606j086921J005668Q66509
$$ plain form
1365.6 544018822 543376503 543357353 543341751 542739868 543046494 542937431 543362579 543549843 542794456 542436295
1375.2 542436295 543649406 545373421 545489502 546059837 546683273 547231255 548008842 548537102 549411774
1383.9 549411774 550076141 551299782 551930618 552407875 554741554 557127571 558741264 560039291 561377449
1392.6 561377449 561896286 560717888 558811951 559883766 560925026 560326576 557848244 557147331 557896385
1401.3 557896385 557065163 556397362 555870323 553638916 552473450 552841415 552628708 551154137 550383759
1409.9 550383759 549631729 548523331 547668228 546842194 546078796 545704308 545568466 544425087 543934631
1418.6 543934631 541555214 542401619 544734497 545414467 545545883 543963699 544992599 546477547 546495667
1427.3 546495667 546939583 546533012 546777077 547764397 549561691 550461349 550887222 552544746 552845078
$$ packed form
1365.6E44018822o42319j9150j5602o01883L06626j09063M25148J87264p55387l58161
1375.2E42436295J213111J724015J16081N70335O23436N47982P77587N28260Q74672
1383.9E49411774O64367J223641O30836M77257K333679K386017J613693J298027J338158
1392.6E61377449N18837j178398j905937J071815J041260n98450k478332p00913P49054
1401.3E57896385q31222o67801n27039k231407j165466L67965k12707j474571p70378
1409.9E50383759p52030j108398q55103q26034p63398l74488j35842j143379m90456
1418.6E43934631k379417Q46405K332878O79970J31416j582184J028900J484948J8120
1427.3E46495667M43916m06571K44065R87320J797294Q99658M25873J657524L00332
$$ plain form
1436 552845078 550700607 551470833 554500504 555694122 556376877 557296371 557331467 558583641 558840523
1444.7 558840523 559505043 560038910 559732132 558853569 559103012 559889526 558661842 558192749 557743607
1453.3 557743607 558080788 557885513 555923843 549884109 545120850 550288696 552144699 554773064 555562744
1462 555562744 556447563 558778648 556652908 558704300 560886383 563923912 566272354 568975868 572594643
1470.7 572594643 573734818 576502495 578730392 585694008 590273895 592997131 596734619 600412064
1478.4 600412064 604046097 606472282 609796295 612139359 615340347 618180389 620818481 623743668
1486.1 623743668 623789978 625561752 627587433 628732643 629220695 633028221 636659203 638213806 641010132
1494.8 641010132 641298904 638321114 641314850 643488922 644189301 646467514 647907715 648339233 650481415
$$ packed form
1436E52845078k144471P70226L029671J193618O82755R19494L5096J252174K56882
1444.7E58840523O64520N33867l06778q78563K49443P86514j227684m69093m49142
1453.3E57743607L37181j95275j961670o039734m763259N167846J856003K628365P89680
1462E55562744Q84819K331085k125740K051392K182083L037529K348442K703514L618775
1470.7E72594643J140175K767677K227897O963616M579887K723236L737488L677445
1478.4F00412064L634033K426185L324013K343064L200988K840042K638092K925187
1486.1F23743668M6310J771774K025681J145210M88052L807526L630982J554603K796326
1494.8F41010132K88772k977790K993736K174072P00379K278213J440201M31518K142182
$$ plain form
1503.5 650481415 652055740 653103638 645739899 637308006 645014343 649848022 653059082 655312119
1511.2 655312119 656357040 656015091 658255692 658566437 657229462 656276321 654416809 659611664 661534195
1519.9 661534195 656419373 653802643 656869507 662503204 664872131 663636627 663323288 664888153
1527.6 664888153 664796295 665940857 667879257 667826385 668781738 666067047 663377075 666609726 668406601
1536.3 668406601 670456696 671570892 665318222 655506363 662117920 663213043 663082733 667091446
1544 667091446 666276016 665775528 668560181 669952087 670644836 668127136 664741058 666387177 667980270
1552.7 667980270 667874451 662902756 662972565 666758957 667709579 659306259 653950653 653688202 659357147
1561.4 659357147 662696228 664026184 663366776 660195999 660294342 661523209 661976929 660612564 654354172
$$ packed form
1503.5F50481415J574325J047898p363739q431893P706337M833679L211060K253037
1511.2F55312119J044921l41949K240601L10745j336975r53141j859512N194855J922531
1519.9F61534195n114822k616730L066864N633697K368927j235504l13339J564865
1527.6F64888153r1858J144562J938400n2872R55353k714691k689972L232651J796875
1536.3F68406601K050095J114196o252670r811859O611557J095123j30310M008713
1544F67091446q15430n00488K784653J391906O92749k517700l386078J646119J593093
1552.7F67980270j05819m971695O9809L786392R50622q403320n355606k62451N668945
1561.4F59357147L339081J329956o59408l170777R8343J228867M53720j364365o258392
$$ plain form
1570 654354172 656645813 658512344 658465729 658680649 659250031 657418442 649175186 652604065 654822617
1578.7 654822617 654884567 655248871 654637451 653733215 652849274 652258682 651524124 650863266 650121765 649109039
1588.4 649109039 648195801 646685867 646166840 645405502 644867554 643708191 642096024 641947861 640991211
1597 640991211 640116119 638606567 637482452 636113548 634685707 633828697 631781273 630977669 629973106
1605.7 629973106 628768692 626835213 625711479 624321518 622018585 621491165 619494362 618095284
1613.4 618095284 616226997 615436363 612968788 604084473 607155647 607642021 606782074 604913406 604562759
1622.1 604562759 602189064 596181946 597934761 598087921 597861671 594335213 592377930 593180199 592620659
1630.8 592620659 592061005 590962410 591907120 592221642 584290733 583441696 585874977 587049179 588124275
$$ packed form
1570F54354172K291641J866531m6615K14920N69382j831589q243256L428879K218552
1578.7F54822617O1950L64304o11420r04236q83941n90592p34558o60858p41501j012726
1588.4F49109039r13238j509934n19027p61338n37948j159363j612167j48163r56650
1597F40991211q75092j509552j124115j368904j427841q57010k047424q03604j004563
1605.7F29973106j204414j933479j123734j389961k302933n27420j996803j399078
1613.4F18095284j868287p90634k467575q884315L071174M86374q59947j868668l50647
1622.1F04562759k373695o007118J752815J53160k26250l526458j957283Q02269n59540
1630.8E92620659n59654j098595R44710L14522p930909q49037K433281J174202J075096
$$ plain form
1639.5 588124275 588505173 587855263 588831558 588689003 590555763 592360840 589234352 587447624 586370430
1648.1 586370430 590812492 593704300 596540756 599218826 589614182 583985672 592810211 599027328
1655.9 599027328 601931915 604118767 605782852 607511559 609505577 611495552 611649361 610824928 614406128
1664.5 614406128 616906509 618650627 620999336 622478867 620211792 621803589 625955696 627854843
1672.3 627854843 631246643 634858818 635034027 634056244 637983589 641389771 643235092 644643097 644734955
1680.9 644734955 648332596 652395477 650397644 646219788 653270569 659810638 662831650 663877945
1688.6 663877945 666313782 668168106 670887985 673431168 675267563 678539581 680746841 674436722
1696.4 674436722 678062668 683857193 688893509 685987244 680291443 687841949 692482376 693382645
$$ packed form
1639.5E88124275L80898o49910R76295j42555J866760J805077l126488j786728j077194
1648.1E86370430M442062K891808K836456K678070r604644n628510Q824539O217117
1655.9E99027328K904587K186852J664085J728707J994018J989975J53809q24433L581200
1664.5F14406128K500381J744118K348709J479531k267075J591797M152107J899147
1672.3F27854843L391800L612175J75209r77783L927345L406182J845321J408005R1858
1680.9F44734955L597641M062881j997833m177856P050781O540069L021012J046295
1688.6F63877945K435837J854324K719879K543183J836395L272018K207260o310119
1696.4F74436722L625946N794525N036316k906265n695801P550506M640427R00269
$$ plain form
1704.1 693382645 692959290 694078674 694083633 696476593 699443893 700129852 700227356 701754074 703015213
1712.8 703015213 703462830 702003403 701544647 705151062 704158478 696775284 702694931 706780167 708163605
1721.4 708163605 708484955 708092346 708200760 710017090 711484375 711974030 712781372 713591766 711804199
1730.1 711804199 711572876 715157242 717263870 711627426 706904907 712950516 716945419 717677841 719210205
1738.8 719210205 717208633 715874786 720532455 722019272 720296860 721377869 723852158 724452972
1746.5 724452972 724765778 725185699 726017303 730225067 729146118 728224106 732793427 735276947 737047729
1755.2 737047729 738129807 736274567 737847290 740434036 742273331 744330902 741925507 742292938
1762.9 742292938 746009216 747603226 748610992 749977798 749874878 746759491 749617157 753061142
$$ packed form
1704.1F93382645m23355J119384M959K392960K967300O85959R7504J526718J261139
1712.8G03015213M47617j459427m58756L606415r92584p383194N919647M085236J383438
1721.4G08163605L21350l92609J08414J816330J467285M89655Q07342Q10394j787567
1730.1G11804199k31323L584366K106628n636444m722519O045609L994903P32422J532364
1738.8G19210205k001572j333847M657669J486817j722412J081009K474289O00814
1746.5G24452972L12806M19921Q31604M207764j078949r22012M569321K483520J770782
1755.2G37047729J082078j855240J572723K586746J839295K057571k405395L67431
1762.9G42292938L716278J594010J007766J366806j02920l115387K857666L443985
$$ plain form
1770.6 753061142 750721588 746797409 747456970 752265472 753730087 753170853 755468521 756031036 756675797
1779.3 756675797 756085815 754774323 756360397 758486710 759624023 758205719 758201752 759888306 760527878
1788 760527878 760770798 761796494 761669388 761455612 758661804 757743912 761336746 761655884 761000824
1796.7 761000824 762911530 764380188 763633652 762476959 764479218 764017105 764272919 765826874 765792694
1805.3 765792694 766085587 765928268 766067886 767050858 767483902 765866241 765968475 767442017 768163986
1814 768163986 769056015 769232330 769350204 768609009 768760986 769492569 769470291 770192871 769575119 770253448
1823.7 770253448 771001053 768053665 768955231 771383667 772447891 770691376 766555481 768532944 771071854
1832.3 771071854 771371613 771858826 772212601 772544022 772313461 771868210 772872162 772989197 773674164
$$ packed form
1770.6G53061142k339554l924179O59561M808502J464615n59234K297668N62515O44761
1779.3G56675797n89982j311492J586074K126313J137313j418304l967J686554O39572
1788G60527878K42920J025696j27106k13776k793808r17892L592834L19138o55060
1796.7G61000824J910706J468658p46536j156693K002259m62113K55814J553955l4180
1805.3G65792694K92893j57319J39618R82972M33044j617661J02234J473542P21969
1814G68163986Q92029J76315J17874p41195J51977P31583k2278P22580o17752O78329
1823.7G70253448P47605k947388R01566K428436J064224j756515m135895J977463K538910
1832.3G71071854K99759M87213L53775L31421k30561m45251J003952J17035O84967
$$ plain form
1841 773674164 773909073 774301071 773219604 767290802 770095673 772770309 772712326 772492371 773500671
1849.7 773500671 774705811 774535980 774706650 774409103 774342651 774330902 774051132 774059067 773645706 773830719
1859.3 773830719 774067154 774370117 774438705 774934235 775101242 775059280 775406570 774482346 774152145 771943970
1869 771943970 770757065 772559433 773891525 774854813 775223618 775803070 775844955 776152802 776496048 776671219
1878.6 776671219 776768341 776049805 775824127 775352325 775600357 775736389 775798721 776337357 776613159 778027878
1888.3 778027878 777376251 775267944 776314087 777695694 777880630 777799988 777219162 776224594 777044067
1896.9 777044067 777393188 777228165 777387695 777637787 777962799 777775345 778098450 777985916 778096161 778309326
1906.6 778309326 777750015 777350311 776814728 776165237 776484528 777742691 777998352 778414841 778541183
$$ packed form
1841G73674164K34909L91998j081467n928802K804871K674636n7983k19955J008300
1849.7G73500671J205140j69831J70670k97547o6452j1749k79770P935m13361J85013
1859.3G73830719K36435L02963O8588M95530J67007m1962L47290r24224l30201k208175
1869G71943970j186905J802368J332092R63288L68805N79452M1885L07847L43246J75171
1878.6G76671219R7122p18536k25678m71802K48032J36032O2332N38636K75802J414719
1888.3G78027878o51627k108307J046143J381607J84936q0642n80826r94568Q19473
1896.9G77044067L49121j65023J59530K50092L25012j87454L23105j12534J10245K13165
1906.6G78309326n59311l99704n35583o49491L19291J258163K55661M16489J26342
$$ plain form
1915.3 778541183 778745651 779732971 777000580 776149902 777542343 777934341 777845612 775963440 775566406
1923.9 775566406 777163315 778111191 777831192 777968140 778355560 778560181 778563538 778180771 778342743 778147812
1933.6 778147812 778210373 777926865 777579041 777956696 778007812 778195038 778120804 778759995 777839355 776064835
1943.2 776064835 777773285 778740005 778235931 777944489 778195496 778045959 777811813 778166733 778221207 778267365
1952.9 778267365 778274765 778174820 778199692 778756027 779087219 778926010 778843307 778486328 778262863 778222885 778385696
1963.5 778385696 778399887 778620529 778797073 777979584 778103943 779087296 779427795 779178543 779000854 778785248
1973.1 778785248 778825912 779023056 779082260 779338150 779279022 779190445 778826599 778786774 779172440 779157028 779484177
1983.7 779484177 779371872 778977585 779035721 779026871 778276672 777878342 778766479 778714218 777472076 777614822
$$ packed form
1915.3G78541183K04468R87320k732391q50678J392441L91998q8729j882172l97034
1923.9G75566406J596909R47876k79999J36948L87420K04621L357l82767J61972j94931
1933.6G78147812O2561k83508l47824L77655N1116J87226p4234O39191r20640j774520
1943.2G76064835J708450R66720n04074k91442K51007j49537k34146L54920N4474M6158
1952.9G78267365P400r9945K4872N56335L31192j61209q2703l56979k23465l9978J62811
1963.5G78385696J4191K20642J76544q17489J24359R83353L40499k49252j77689k15606
1973.1G78785248M0664J97144N9204K55890n9128q8577l63846l9825L85666j5412L27149
1983.7G79484177j12305l94287N8136q850p50199l98330Q88137n2261j242142J42746
$$ plain form
1993.4 777614822 778652039 778984833 778885193 778845825 778824310 778864746 778668518 778732910 778464966 778333206
2003 778333206 778431625 778441544 778853455 778512726 778185806 777942963 777614822 777742691 777663956 777579651 777360077
2013.6 777360077 777263260 777237549 776609802 776026077 776528015 776786423 776286392 776260834 776198425 776005096
2023.3 776005096 775794144 775751724 775765762 775595703 775475006 775051956 774698410 774546432 774709625 774660873
2032.9 774660873 774510345 774401245 774062195 774111633 773912277 773849106 773772812 773487396 773084259 772634811
2042.6 772634811 772771149 772675323 772745285 772560043 772391357 772563019 772496338 772643814 772276077 772138062
2052.2 772138062 772234268 772307053 772169418 771781616 771949234 771960449 772066956 771873322 771735306 771791229
2061.9 771791229 771873627 772379074 771996613 771524048 771712494 772063828 772126846 772115021 772119217 771908112
$$ packed form
1993.4G77614822J037217L32794r9640l9368k1515M0436j96228O4392k67944j31760
2003G78333206R8419R919M11911l40729l26920k42843l28141J27869p8735q4305k19574
2013.6G77360077r6817k5711o27747n83725N01938K58408n00031k5558o2409j93329
2023.3G76005096k10952m2420J4038j70059j20697m23050l53546j51978J63193m8752
2032.9G74660873j50528j09100l39050M9438j99356o3171p6294k85416m03137m49448
2042.6G72634811J36338r5826O9962j85242j68686J71662o6681J47476l67737j38015
2052.2G72138062R6206P2785j37635l87802J67618J1215J06507j93634j38016N5923
2061.9G71791229Q2398N05447l82461m72565J88446L51334O3018j1825M196k11105
$$ plain form
2071.5 771908112 771999512 771996613 772178497 772207794 772465363 772638016 772097931 772191544 772310715 772294769 772151337
2082.1 772151337 772071304 772083588 771865768 771580124 771400909 771920776 772104568 772224960 772160110 771936722
2091.7 771936722 772336502 772643814 772803497 772406769 772214050 772085953 772097855 772302475 772120438 772497253
2101.4 772497253 772695007 772762070 772668152 772836914 772944336 772274628 772196655 772259750 772606201 772618637
2111 772618637 772381363 772600555 772531509 772780457 773310013 773656921 773486328 773308334 773077698 772755432
2120.7 772755432 772729340 772939682 773236694 772919998 773112793 773417740 773364410 773356247 773192673 773419342
2130.3 773419342 773474045 773497467 773304291 772941666 772544632 772313156 772545242 772690277 772943878 772748184
2140 772748184 772641907 772486725 772534790 772784424 772534180 772871475 772584229 772395248 772636261 772724075
$$ packed form
2071.5G71908112R1400k899J81884K9297K57569J72653n40085R3613J19171j5946j43432
2082.1G72151337q0033J2284k17820k85644j79215N19867J83792J20392o4850k23388
2091.7G71936722L99780L07312J59683l96728j92719j28097J1902K04620j82037L76815
2101.4G72497253J97754O7063r3918J68762J07422o69708p7973O3095L46451J2436
2111G72618637k37274K19192o9046K48948N29556L46908j70593j77994k30636l22266
2120.7G72755432k6092K10342K97012l16696J92795L04947n3330q163j63574K26669
2130.3G73419342N4703K3422j93176l62625l97034k31476K32086J45035K53601j95694
2140G72748184j06277j55182M8065K49634k50244L37295k87246j88981K41013Q7814
$$ plain form
2149.6 772724075 773100967 772936478 773115692 773415222 773395004 773032074 772842026 772925568 772755508 772869034
2159.3 772869034 772970200 773415680 773406677 773196106 773543777 773856506 774205017 774431763 774702759 774200439
2168.9 774200439 773764267 774048767 774338989 774529572 774503632 774482117 774289093 774762268 775187378 775453568
2178.5 775453568 775849380 775717316 775670013 775620193 775827637 775633621 775756226 775927963 775578918 776074982
2188.2 776074982 776393509 776719666 776921463 777144012 777217331 777120285 777592621 777475815 777536774 777408218
2197.8 777408218 777251434 777559586 777813034 778100128 777949448 778166885 778612366 779076157 778971786 778891525
2207.5 778891525 779154892 778765793 778952789 779065018 779044342 779089584 779172516 779540939 779500351 779691391
2217.1 779691391 779992905 780217972 780135117 780093384 780057220 779823227 779916229 779893494 780241699 780537033
$$ packed form
2149.6G72724075L76892j64489J79214K99530k0218l62930j90048Q3542j70060J13526
2159.3G72869034J01166M45480r003k10571L47671L12729L48511K26746K70996n02320
2168.9G74200439m36172K84500K90222J90583k5940k1515j93024M73175M25110K66190
2178.5G75453568L95812j32064m7303m9820K07444j94016J22605J71737l49045M96064
2188.2G76074982L18527L26157K01797K22549P3319r7046M72336j16806O0959j28556
2197.8G77408218j56784L08152K53448K87094j50680K17437M45481M63791j04371q0261
2207.5G78891525K63367l89099J86996J12229k0676M5242Q2932L68423m0588J91040
2217.1G79691391L01514K25067q2855m1733l6164k33993R3002k2735L48205K95334
$$ plain form
2226.8 780537033 780725098 781009750 781011276 781113358 781245193 781113129 780483322 780155716 780171890 780485306
2236.4 780485306 780959778 781302338 781559601 781450806 781570816 781674805 781761703 781463623 781274643 781520691
2246 781520691 781102219 780768280 780603790 781012421 781322784 781209793 781558990 781817322 781706161 781175690
2255.7 781175690 781188202 780989761 780538864 780749207 781073532 781244431 781214218 781434097 781251907 781256180
2265.3 781256180 781378326 781400833 781611099 781415024 781360550 781296234 781809769 781592178 781208038 781670151
2275 781670151 781642303 782026825 781842117 781782837 781948853 781847534 782020416 782155075 782522888 782094269
2284.6 782094269 782024536 782054825 781731415 781338730 781016159 781265564 780900269 780859985 780339508 780453415
2294.3 780453415 780744476 780252991 780670242 779747696 779243927 779151077 778989182 779139404 778877335 779220276
$$ packed form
2226.8G80537033J88065K84652J526J02082J31835j32064o29807l27606J6174L13416
2236.4G80485306M74472L42560K57263j08795J20010J03989Q6898k98080j88980K46048
2246G81520691m18472l33939j64490M08631L10363j12991L49197K58332j11161n30471
2255.7G81175690J2512j98441m50897K10343L24325J70899l0213K19879j82190M273
2265.3G81256180J22146K2507K10266j96075n4474o4316N13535k17591l84140M62113
2275G81670151k7848L84522j84708n9280J66016j01319J72882J34659L67813m28619
2284.6G82094269o9733L0289l23410l92685l22571K49405l65295m0284n20477J13907
2294.3G80453415K91061m91485M17251r22546n03769r2850j61895J50222k62069L42941
$$ plain form
2303.9 779220276 778691254 778473434 777850723 776973724 776369705 775516357 775467758 774439011 774119873 773499603
2313.5 773499603 773406219 774112396 773345032 773454971 773155212 772107239 770408020 769459152 769049759
2322.2 769049759 768033752 767640533 766679916 766636658 766350021 766716003 767088470 766138306 765489578 764428253
2331.9 764428253 763794708 763035736 763814316 764110641 764120331 765062256 764275742 762660294 760644073 760468445
2341.5 760468445 760291519 760969849 762199097 761498947 762316132 764571838 767548065 768607178 766962509
2350.2 766962509 764724350 762942963 761842880 761180267 758631058 755937881 756587067 756445236 755132828
2358.9 755132828 753119507 751229172 751740952 753041840 754928665 754200897 754527206 755988541 756477127
2367.6 756477127 758071442 759553070 760888596 761691666 763602600 764586258 765091324 766581650 767482071
$$ packed form
2303.9G79220276n29022k17820o22711q76999o04019q53348m8599j028747l19138o20270
2313.5G73499603r3384P06177p67364J09939k99759j047973j699219r48868m09393
2322.2G69049759j016007l93219r60617m3258k86637L65982L72467r50164o48728j061325
2331.9G64428253o33545p58972P78580K96325R690R41925p86514j615448k016221j75628
2341.5G60468445j76926O78330J229248p00150Q17185K255706K976227J059113j644669
2350.2G66962509k238159j781387j100083o62613k549209k693177O49186j41831j312408
2358.9G55132828k013321j890335N11780J300888J886825p27768L26309J461335M88586
2367.6G56477127J594315J481628J335526Q03070J910934R83658N05066J490326R00421
$$ plain form
2376.2 767482071 768505402 769040985 770260391 771403503 771967850 773021469 773955536 774757080 774895172
2384.9 774895172 775042267 775258102 775413971 775454102 775102921 775154343 775217590 775286026 775143814 774969788
2394.6 774969788 774945526 774712906 774542618 774317627 774298248 774278412 774258118 774152222 774032745 774043274
2404.2 774043274 773715668 773248215 772806854 772663193 772704697 772842712 772714691 772528534 772441711 771911621
2413.8 771911621 771673126 771500015 771426315 771511002 771395874 771113510 770568619 770415878 770438538 770315170
2423.5 770315170 769971466 769637070 769296036 768953247 768717422 768242187 768263779 768335190 768311462 768088989
2433.1 768088989 767326050 766930161 767014313 767316513 766942139 766363525 765984573 765574188 765495911 765336380
2442.8 765336380 765204697 764874496 764558487 764500656 764457321 764057159 763526688 763561630 763560791 763487778 763041916
$$ packed form
2376.2G67482071J023331N35583J219406J143112N64347J053619R34067Q01544J38092
2384.9G74895172J47095K15835J55869M0131l51181N1422O3247O8436j42212j74026
2394.6G74969788k4262k32620j70288k24991j9379j9836k0294j05896j19477J0529
2404.2G74043274l27606m67453m41361j43661M1504J38015j28021j86157q6823n30090
2413.8G71911621k38495j73111p3700Q4687j15128k82364n44891j52741K2660j23368
2423.5G70315170l43704l34396l41034l42789k35825m75235K1592P1411k3728k22473
2433.1G68088989p62939l95889Q4152L02200l74374n78614l78952m10385p8277j59531
2442.8G65336380j31683l30201l16009n7831m3335m00162n30471L4942q39p3013m45862
$$ plain form
2453.4 763041916 762550659 762084427 761424103 761428070 761482162 761340790 761022949 760863266 760647507 760053711
2463 760053711 759702988 759473267 759380646 759096603 759255066 759450302 758988419 758477325 757882690 757846603
2472.7 757846603 757837143 757535324 757097321 756638336 756456680 756181641 756133881 756043854 756056747 756031723 755562820
2483.3 755562820 755222168 755009918 754889450 754961166 755035019 754586029 754041519 753790054 753638840 753524246
2492.9 753524246 753466263 753292694 752733459 752721024 752864685 752771606 752649536 752050476 751599350 751543884
2502.6 751543884 751696167 751377640 750952072 751099854 751083908 750747681 750499725 750570450 750383606 750226364
2512.2 750226364 750406723 750293198 749652176 749074402 749079742 748968658 748897629 748817749 748509140 748162460
2521.9 748162460 748005524 748114853 747914658 747796097 747369690 746741867 746418304 746392593 746456375 745822296
$$ packed form
2453.4G63041916m91257m66232o60324L967N4092j41372l17841j59683k15759n93796
2463G60053711l50723k29721r2621k84043J58463J95236m61883n11094n94635l6087
2472.7G57846603r460l01819m38003m58985j81656k75039m7760r0027J2893k5024m68903
2483.3G55562820l40652k12250j20468P1716P3853m48990n44510k51465j51214j14594
2492.9G53524246n7983j73569n59235j2435J43661r3079j22070n99060m51126n5466
2502.6G51543884J52283l18527m25568J47782j5946l36227k47956P0725j86844j57242
2512.2G50226364J80359j13525o41022n77774N340j11084p1029p9880l08609l46680
2521.9G48162460j56936J09329k00195j18561m26407o27823l23563k5711O3782o34079
$$ plain form
2531.5 745822296 745495300 745464401 745387039 745196228 744855804 744913712 744497528 744195328 744248657 743795929
2541.1 743795929 743259125 743213501 743056488 742473221 742407455 742234192 741834030 741552200 741040268 740564728
2550.8 740564728 740388947 740351257 740008469 740009537 740244293 740188217 739854507 739260864 738833466 738465042
2560.4 738465042 738290329 738152008 737813797 737265091 736774521 736654739 736553192 736352615 735950165 735566406
2570.1 735566406 735269089 735382462 735585480 735145798 734621658 734212112 734055786 733910904 733705063 733491211
2579.7 733491211 732972336 732588043 732579575 732457504 732196350 732350159 732113419 731597443 731112137 730360031
2589.4 730360031 730233841 730533295 730766449 730548325 730142365 729723740 729466019 729511719 729313431 729551697
2599 729551697 729279022 728552475 728288116 728041229 727957993 727710571 727678223 727516403 727160568 726873779
$$ packed form
2531.5G45822296l26996l0899p7362j90811l40424N7908m16184l02200N3329m52728
2541.1G43795929n36804m5624j57013n83267o5766j73263m00162k81830n11932m75540
2550.8G40564728j75781l7690l42788J068K34756n6076l33710n93643m27398l68424
2560.4G38465042j74713j38321l38211n48706m90570j19782j01547k00577m02450l83759
2570.1G35566406k97317J13373K03018m39682n24140m09546j56326j44882k05841k13852
2579.7G33491211n18875l84293q468j22071k61154J53809k36740n15976m85306p52106
2589.4G30360031j26190K99454K33154k18124m05960m18625k57721M5700j98288K38266
2599G29551697k72675p26547k64359k46887q3236k47422l2348j61820l55835k86789
$$ plain form
2608.6 726873779 726577835 726333313 725801773 725588226 725233459 725023270 724950867 724300766 723852539 723933563
2618.3 723933563 724048996 723273773 722635574 722315140 721845398 721740723 721486740 720915604 720015488 719413910
2627.9 719413910 719061584 718959808 718986206 718408127 717715759 717228088 716907959 716415863 716310349 716024246
2637.6 716024246 715262756 714753952 714135056 714011002 713741379 713214951 712453995 711656647 711532745 710988770
2647.2 710988770 710484314 710127182 709762726 709494553 709246216 708913727 708230743 707951126 707435074 706642609
2656.9 706642609 706083450 705882797 705716934 705308990 705276337 704843521 704334030 704004974 703510284 702945480
2666.5 702945480 702584686 702479248 701744003 701287537 701162949 701046524 700850754 700151215 699817123 699558563
2676.1 699558563 699038315 698560410 698323517 697866821 697518997 697314453 696395569 695865097 695588760 695474625
$$ packed form
2608.6G26873779k95944k44522n31540k13547l54767k10189p2403o50101m48227Q1024
2618.3G23933563J15433p75223o38199l20434m69742j04675k53983n71136r00116o01578
2627.9G19413910l52326j01776K6398n78079o92368m87671l20129m92096j05514k86103
2637.6G16024246p61490n08804o18896j24054k69623n26428p60956p97348j23902n43975
2647.2G10988770n04456l57132l64456k68173k48337l32489o82984k79617n16052p92465
2656.9G06642609n59159k00653j65863m07944l2653m32816n09491l29056m94690n64804
2666.5G02945480l60794j05438p35245m56466j24588j16425j95770o99539l34092k58560
2676.1F99558563n20248m77905k36893m56696l47824k04544r18884n30472k76337j14135
$$ plain form
2685.8 695474625 695777054 695672455 695165024 694672012 694308014 693479462 693010635 693227005 692944336 692062607
2695.4 692062607 691487579 691424942 691019974 690576324 690366211 690058212 689340057 688730011 688589401 688138733
2705.1 688138733 687670212 687146988 686559296 686466522 686349945 685410156 684776688 684917679 684529495 684218750
2714.7 684218750 683810196 683093719 682637634 682366867 682097321 681482315 681326447 680978775 680365219 680093002
2724.4 680093002 679969559 680237122 680008926 679741898 679142761 677951660 677502213 677355042 677168427
2733 677168427 676909790 676722260 676830978 676694412 676101532 675523682 675002136 674657135 674622116 674249725
2742.7 674249725 673837128 673692474 673455582 673055725 672952271 672614365 671979370 672276535 672280655 671674881
2752.3 671674881 671062164 670480042 670432587 670306091 670099716 670008850 669747162 668819275 668264618 668658600
$$ packed form
2685.8F95474625L02429j04599n07431m93012l63998q28552m68827K16370k82669q81729
2695.4F92062607n75028o2637m04968m43650k10113l07999p18155o10046j40610m50668
2705.1F88138733m68521n23224n87692r2774j16577r39789o33468J40991l88184l10745
2714.7F84218750m08554p16477m56085k70767k69546o15006j55868l47672o13556k72217
2724.4F80093002j23443K67563k28196k67028n99137j191101m49447j47171j86615
2733F77168427k58637j87530J08718j36566n92880n77850n21546l45001l5019l72391
2742.7F74249725m12597j44654k36892l99857j03454l37906o34995K97165M120o05774
2752.3F71674881o12717n82122m7455j26496k06375r0866k61688r27887n54657L93982
$$ plain form
2762 668658600 668716660 668722687 668321152 667755051 667566986 667267761 667015228 666630554 666224518 665942841
2771.6 665942841 666016541 666145020 666001434 665506897 664678345 664223328 663892746 663458557 662883377 662505112
2781.3 662505112 662424011 662019501 661450806 661118546 661142578 660859756 660447006 660227051 659884415 659456329
2790.9 659456329 658758621 658117447 657750015 657262344 656266785 655687790 655531845 654470596 653481522
2799.6 653481522 653339233 653263168 652788010 652064438 651129761 650434113 649943619 648781662 647913513 647605591
2809.2 647605591 647315063 646963577 645910492 644778900 644087906 643418427 642851410 642102280 640993195
2817.9 640993195 640099335 639325829 638671684 638062248 637294197 636666183 635807762 634824829 633853951 632993050
2827.6 632993050 631944389 630673561 630051460 629288597 628104324 626612434 625439682 624727478 623699989
$$ packed form
2762F68658600N8060O027m01535n66101j88065k99225k52533l84674m06036k81677
2771.6F65942841P3700J28479j43586m94537q28552m55017l30582m34189n75180l78265
2781.3F62505112q1101m04510n68695l32260K4032k82822m12750k19955l42636m28086
2790.9F59456329o97708o41174l67432m87671r95559n78995j55945j061249r89074
2799.6F53481522j42289p6065m75158p23572r34677o95648m90494j161957q68149l07922
2809.2F47605591k90528l51486j053085j131592o90994o69479n67017p49130j109085
2817.9F40993195q93860p73506o54145o09436p68051o28014q58421r82933r70878q60901
2827.6F32993050j048661j270828o22101p62863j184273j491890j172752p12204j027489
$$ plain form
2836.2 623699989 623171654 622032166 620334320 619180603 617839699 616371880 614818230 613489113
2843.9 613489113 611920624 610111465 608318710 606267700 604608459 602986984 601640091 600592842
2851.7 600592842 599195518 597926369 596955414 596050453 594948311 594246063 593987732 593016434 591770134
2860.3 591770134 591023483 590177002 589008675 587708321 586717529 586059113 585098495 583733406 581605911
2869 581605911 579502716 577756081 575631065 573963852 572615891 570923843 568763313 566542320 565039024
2877.7 565039024 563828850 562337646 560583801 558988495 557487564 556007500 554822769 553818588
2885.4 553818588 552873955 552078552 551696510 551335907 550623093 549714012 549062920 548884964 548895645 548748055
2895.1 548748055 548132439 547559166 546945496 546439705 546506500 546584702 546200790 545466995 545106239 544410248
$$ packed form
2836.2F23699989n28335j139488j697846j153717j340904j467819j553650j329117
2843.9F13489113j568489j809159j792755k051010j659241j621475j346893j047249
2851.7F00592842j397324j269149r70955r04961j102142p02248k58331r71298j246300
2860.3E91770134p46651q46481j168327j300354r90792o58416r60618j365089k127495
2869E81605911k103195j746635k125016j667213j347961j692048k160530k220993j503296
2877.7E65039024j210174j491204j753845j595306j500931j480064j184731j004181
2885.4E53818588r44633p95403l82042l60603p12814r09081o51092j77956J0681j47590
2895.1E48748055o15616n73273o13670n05791O6795P8202l83912p33795l60756o95991
$$ plain form
2904.7 544410248 543663712 543391380 542555084 541814461 541080627 539838638 538280449 536957359 536057243
2913.4 536057243 534794769 533176003 531239204 529613380 528329201 526820946 525261154 523773193
2921.1 523773193 522389145 520978050 519931412 518864365 517859344 517244263 516989365 517271919 517349854
2929.8 517349854 517544746 517670135 517816734 518696632 519771461 520833702 521807060 523214722 525014381
2938.5 525014381 526722755 528467751 530295830 532381783 534834175 537106857 538820839 540654182
2946.2 540654182 542705765 544840851 546800652 548919373 551339912 553445091 555501785 556990662
2953.9 556990662 558756790 560810242 562244682 564219437 566536827 568648262 570313454 572160873
2961.6 572160873 574092293 575110245 576112289 577582130 579094467 580597763 582290993 583455162
$$ packed form
2904.7E44410248p46536k72332q36296p40623p33834j241989j558189j323090r00116
2913.4E36057243j262474j618766j936799j625824j284179j508255j559792j487961
2921.1E23773193j384048j411095j046638j067047j005021o15081k54898K82554P7935
2929.8E17349854J94892J25389J46599Q79898J074829J062241R73358J407662J799659
2938.5E25014381J708374J744996J828079K085953K452392K272682J713982J833343
2946.2E40654182K051583K135086J959801K118721K420539K105179K056694J488877
2953.9E56990662J766128K053452J434440J974755K317390K111435J665192J847419
2961.6E72160873J931420J017952J002044J469841J512337J503296J693230J164169
$$ plain form
2969.3 583455162 584472542 586293335 588030624 589329872 590631638 591970482 592973328 593888359
2977 593888359 595035629 596430206 597673416 598740082 600091553 601061821 602002945 602960854 603677711
2985.7 603677711 604524498 605247269 606003227 606723366 607458992 607795372 607903595 608324585 608812141 609258575
2995.3 609258575 609365959 609840202 610278397 610403557 610678177 610530586 610501671 610555649 610562820 610546188
3005 610546188 610050049 609653931 609622726 609723129 609608078 609126663 608618279 607923431 607432518 607464981
3014.6 607464981 606925545 606084595 605335312 604613876 604435577 603953819 603001137 601995964 601376572
3023.3 601376572 600969543 600112076 599287834 598432541 598042374 597895088 597089691 595845222 594767075
3032 594767075 594444656 593930588 593031349 592137451 591236076 590156708 588801003 588167610 587864113 587131653
$$ packed form
2969.3E83455162J017380J820793J737289J299248J301766J338844J002846R15031
2977E93888359J147270J394577J243210J066666J351471R70268R41124R57909P16857
2985.7F03677711Q46787P22771P55958P20139P35626L36380J08223M20990M87556M46434
2995.3F09258575J07384M74243M38195J25160K74620j47591k8915N3978P171j6632
3005F10546188m96139l96118l1205J00403j15051m81415n08384o94848m90913L2463
3014.6F07464981n39436q40950p49283p21436j78299m81758r52682j005173o19392
3023.3F01376572m07029q57467q24242q55293l90167j47286q05397j244469j078147
3032E94767075l22419n14068q99239q93898r01375j079368j355705o33393l03497p32460
$$ plain form
3041.6 587131653 586272926 585348320 584243507 583066635 581925850 581089325 580465736 579280014 578196449
3050.3 578196449 577379799 576507988 575686531 574816055 574334030 573223076 571641235 570734444 569914436
3059 569914436 569126511 568069878 566621704 565880547 565582314 564616432 563762169 562895317 561523781
3067.7 561523781 560510292 559704361 558815613 557811470 556899452 555728531 554548759 553959198 553230324
3076.4 553230324 552337685 551450348 550542984 549404106 548694611 548163757 546741753 545452347 544431114
3085 544431114 543807411 543252754 541966438 540597916 539681969 539044037 538247375 537470016 536227951
3093.7 536227951 535325089 534695168 533063126 531999664 531655045 531127701 529903412 528640785 527961121
3102.4 527961121 527073441 525935402 524861603 524629364 524057350 522712135 521467476 520139847 519514732
$$ packed form
3041.6E87131653q58727r24606j104813j176872j140785q36525o23589j185722j083565
3050.3E78196449q16650q71811q21457q70476m82025j110954j581841r06791q20008
3059E69914436p87925j056633j448174p41157k98233r65882q54263q66852j371536
3067.7E61523781j013489q05931q88748j004143r12018j170921j179772n89561p28874
3076.4E53230324q92639q87337r07364j138878p09495n30854j422004j289406j021233
3085E44431114o23703n54657j286316j368522r15947o37932p96662p77359j242065
3093.7E36227951r02862o29921j632042j063462l44619n27344j224289j262627o79664
3102.4E27961121q87680j138039j073799k32239n72014j345215j244659j327629o25115
$$ plain form
3111.1 519514732 518757362 517422028 516446381 515534630 514378014 513929367 513883057 512559509 511111107
3119.8 511111107 510386086 509471931 508309097 507398834 506762505 505993996 505165825 503937416 502607727
3128.4 502607727 501805840 501306229 500399094 499169731 497987061 496778717 496334496 495818253 494705963
3137.1 494705963 493785057 493008957 492200012 491005402 489974174 489194946 488618088 488000793 486922722
3145.8 486922722 485914993 485147133 484762344 483903885 482655067 481718063 480563507 479398956 478578644
3154.5 478578644 478069382 477357140 476447906 475561676 474701576 474068108 473511505 472758331 471708298
3163.1 471708298 470916367 470381470 469415588 468092155 467408562 466788559 465696907 465201073 464558601
3171.8 464558601 463607597 462563515 461585121 461070442 460377159 459623833 458656311 457931023 457617302
$$ packed form
3111.1E19514732p57370j335334r75647r11751j156616m48647m6310j323548j448402
3119.8E11111107p25021r14155j162834r10263o36329p68509q28171j228409j329689
3128.4E02607727q01887m99611r07135j229363j182670j208344m44221n16243j112290
3137.1D94705963r20906p76100q08945j194610j031228p79228n76858o17295j078071
3145.8D86922722j007729p67860l84789q58459j248818r37004j154556j164551q20312
3154.5D78578644n09262p12242r09234q86230q60100o33468n56603p53174j050033
3163.1D71708298p91931n34897r65882j323433o83593o20003j091652m95834o42472
3171.8D64558601r51004j044082r78394n14679o93283p53326r67522p25288l13721
$$ plain form
3180.5 457617302 457052612 455928574 454937553 454609756 453570480 452744789 452566299 452025948 451234589
3189.2 451234589 450299492 449730530 449105949 448346519 447552528 446949959 446451073 445634918 444484482
3197.9 444484482 443063660 442695389 442542610 441970253 441432648 440583115 439792404 439177055 438974037
3206.5 438974037 438345833 437446480 436722336 435993195 435786057 435730019 435579910 434464645 433196411
3215.2 433196411 432669945 432301979 431868324 430987091 430595665 430314064 429644966 429015617 428529663 428106728
3224.9 428106728 427576141 427165108 426471252 426124687 425493317 424486732 424225655 423549843 422959137
3233.5 422959137 422754707 421953316 420914841 420583458 420713768 420351906 419774017 419398193 418869438
3242.2 418869438 418125610 417814407 417216377 416587944 416388664 415603371 414822388 414439850 414950638 415255661
$$ packed form
3180.5D57617302n64690j124038r91021l27797j039276q25691j78490n40351p91359
3189.2D51234589r35097n68962o24581p59430p93991o02569m98886q16155j150436
3197.9D44484482j420822l68271j52779n72357n37605q49533p90711o15349k03018
3206.5D38974037o28204q99353p24144p29141k07138n6038j50109j115265j268234
3215.2D33196411n26466l67966m33655q81233l91426k81601o69098o29349m85954m22935
3224.9D28106728n30587m11033o93856l46565o31370j006585k61077o75812n90706
3233.5D22959137k04430q01391j038475l31383J30310l61862n77889l75824n28755
3242.2D18869438p43828l11203n98030o28433j99280p85293p80983l82538N10788L05023
$$ plain form
3251.9 415255661 414322548 413524704 412920265 412357178 411638985 410992813 410477409 410021362 409828606 409661255
3261.5 409661255 409594727 408923378 408284607 408011131 407498131 407021141 406475067 406477394 406537743 405807533
3271.2 405807533 405427437 405446129 404620895 404121323 404256935 403637161 403293076 403443413 403394547 402835464
3280.8 402835464 401971893 401605034 401449051 401066360 400418243 400182152 399974823 399485970 399539833 399644508
3290.4 399644508 399307365 398756714 398318100 397690468 397364464 397262917 396546364 396340752 396539612 396139069
3300.1 396139069 395172997 394402351 394253311 394305649 394506340 394338684 393720398 392994385 392373352 392152786
3309.7 392152786 391859055 391353836 391015854 390659485 390017471 389250603 388325119 387893639 388187218 388306007
3319.4 388306007 388319664 388090553 387148285 386257057 386021996 385572968 384757462 384308167 383816795 383282776
$$ packed form
3251.9D15255661r33113p97844o04439n63087p18193o46172n15404m56047j92756j67351
3261.5D09661255o6528o71349o38771k73476n13000m76990n46074K327O0349p30210
3271.2D05807533l80096J8692q25234m99572J35612o19774l44085J50337m8866n59083
3280.8D02835464q63571l66859j55983l82691o48117k36091k07329m88853N3863J04675
3290.4C99644508l37143n50651m38614o27632l26004j01547p16553k05612J98860m00543
3300.1C96139069r66072p70646j49040N2338K00691j67656o18286p26013o21033k20566
3309.7C92152786k93731n05219l37982l56369o42014p66868r25484m31480K93579J18789
3319.4C88306007J3657k29111r42268q91228k35061m49028q15506m49295m91372n34019
$$ plain form
3329 383282776 383255615 383210182 382607841 381808472 381087723 380952988 381162071 380443459 379506264 379336472
3338.7 379336472 379118309 378540344 378442993 378697319 378416786 377521896 376313705 375371819 375221748 375468597
3348.3 375468597 374662018 373436890 373097954 372636948 372176590 372139359 372078857 371461906 370788002 370460815
3357.9 370460815 369594193 369265900 369287415 368644028 368237038 368071938 367877769 367469215 366761932 365899124
3367.6 365899124 365106010 364907761 365191727 364805107 364170532 363886681 363111992 362674446 362265663 361605606
3377.2 361605606 361410294 361306686 361171532 360659828 360368767 359810944 359278564 359543991 359168129 358421173
3386.9 358421173 357710724 357629395 357704887 357499275 357637901 357103348 356623764 356477890 356286774 355992928
3396.5 355992928 355523758 356076393 356534958 355836220 354870949 354687767 354992180 354484749 353877449 353999176
$$ packed form
3329C83282776k7161m5433o02341p99369p20749j34735K09083p18612r37195j69792
3338.7C79336472k18163n77965r7351K54326k80533q94890j208191r41886j50071K46849
3348.3C75468597q06579j225128l38936m61006m60358l7231o0502o16951o73904l27187
3357.9C70460815q66622l28293K1515o43387m06990j65100j94169m08554p07283q62808
3367.6C65899124p93114j98249K83966l86620o34575k83851p74689m37546m08783o60057
3377.2C61605606j95312j03608j35154n11704k91061n57823n32380K65427l75862p46956
3386.9C58421173p10449q1329P5492k05612J38626n34553m79584j45874j91116k93846
3396.5C55992928m69170N52635M58565o98738r65271j83182L04413n07431o07300J21727
$$ plain form
3406.2 353999176 354322662 354453773 354163818 353413925 352919159 353240089 353446732 353238106 353092995 352638969
3415.8 352638969 352487335 352790909 352976799 353067703 352462120 352193565 352495880 352316856 352463379 353027992
3425.5 353027992 353438759 353113480 352686577 353128586 353110847 352416878 352453423 352940598 353025589 352850761
3435.1 352850761 352814713 353096428 353227997 353371925 353442307 353677101 354584770 354509544 354230995 354641457
3444.7 354641457 355433655 355774002 354258881 354273453 355342789 355968323 356326408 356308365 356952095 357295570
3454.4 357295570 357632484 357810173 357705421 358225517 358646584 359229469 359679108 360010757 360101318 360417366
3464 360417366 361009941 361043663 361107864 361092186 361993027 363100624 363622055 364037361 363871956 364652786
3473.7 364652786 365776138 365953941 365983162 366075668 366716347 367703323 368199348 368447075 368443909 368666344
$$ packed form
3406.2C53999176L23486J31111k89955p49893m94766L20930K06643k08626j45111m54026
3415.8C52638969j51634L03574J85890R0904o05583k68555L02315j79024J46523N64613
3425.5C53027992M10767l25279m26903M42009j7739o93969L6545M87175Q4991j74828
3435.1C52850761l6048K81715J31569J43928P0382K34794R07669p5226k78549M10462
3444.7C54641457P92198L40347j515121J4572J069336O25534L58085j8043O43730L43475
3454.4C57295570L36914J77689j04752N20096M21067N82885M49639L31649R0561L16048
3464C60417366N92575L3722O4201j5678R00841J107597N21431M15306j65405P80830
3473.7C64652786J123352J77803K9221R2506O40679R86976M96025K47727l166K22435
$$ plain form
3483.3 368666344 369909210 370310822 370336075 371116142 371110229 371264915 372283669 373223763 373523674 373851967
3493 373851967 374658089 375519142 376029129 375788689 376074448 376836472 377358665 378047943 379028435 379599724
3502.6 379599724 379366913 379539604 380485382 381557312 382155457 383328362 383939934 383475571 384276772
3511.3 384276772 384781609 385451393 386399307 386971397 387549973 387799530 388470955 389294930 390026207 390669403
3520.9 390669403 391646996 391628952 390827866 391937637 393048019 394022217 394881363 395332489 395412521 395842628
3530.6 395842628 396741295 397550697 398700867 399102669 400945930 402105370 401172180 402497177 403506470
3539.2 403506470 404088554 404828224 405758629 406774406 407668190 408213615 407877464 408418694 408228302
3547.9 408228302 409998016 411713638 412848206 414312935 413118172 414838295 416267624 417252579
$$ packed form
3483.3C68666344J242866M01612K5253P80067n913J54686J018754R40094K99911L28293
3493C73851967Q06122Q61053N09987k40440K85759P62024N22193O89278R80492N71289
3502.6C79599724k32811J72691R45778J071930N98145J172905O11572m64363Q01201
3511.3C84276772N04837O69784R47914N72090N78576K49557O71425Q23975P31277O43196
3520.9C90669403R77593j8044q01086J109771J110382R74198Q59146M51126Q0032M30107
3530.6C95842628Q98667Q09402J150170M01802J843261J159440r33190J324997J009293
3539.2D03506470N82084P39670R30405J015777Q93784N45425l36151N41230j90392
3547.9D08228302J769714J715622J134568J464729j194763J720123J429329R84955
$$ plain form
3555.6 417252579 418983650 419449196 421230927 421795425 422027016 422678719 424713287 425906334 426324730
3564.3 426324730 430849915 430368004 428503990 428661385 428828163 433317909 435535927 436525688 437655029
3573 437655029 438680649 439599037 441621819 444044342 444310417 446752205 448165131 448263931 450033264
3581.7 450033264 451932335 453463020 454677162 458910294 459897308 457203369 457761726 457340050 460978241
3590.4 460978241 464398766 467544556 469116135 470498199 473513222 471898689 475057716 478184547
3598.1 478184547 477779236 480798950 481710396 482388344 484361534 485900955 488315086 492315865 494802742
3606.8 494802742 492585716 495491142 494681549 495580826 503885384 503375854 501247978 504998436 504038467
3615.4 504038467 509501953 514558487 513966866 515251198 513811035 514713097 518356628 521173058 523508072
$$ packed form
3555.6D17252579J731071M65546J781731N64498K31591O51703K034568J193047M18396
3564.3D26324730M525185m81911j864014J57395J66778M489746K218018R89761J129341
3573D37655029J025620R18388K022782K422523K66075K441788J412926R8800J769333
3581.7D50033264J899071J530685J214142M233132R87014k693939N58357m21676L638191
3590.4D60978241L420525L145790J571579J382064L015023j614533L159027L126831
3598.1D78184547m05311L019714R11446O77948J973190J539421K414131M000779K486877
3606.8D94802742k217026K905426q09593Q99277Q304558n09530k127876L750458r59969
3615.4E04038467N463486N056534n91621J284332j440163R02062L643531K816430K335014
$$ plain form
3624.1 523508072 526238060 527812042 530055656 537366142 533857422 521219749 527792130 535425262
3631.8 535425262 542484093 542244377 539261475 542372627 546269798 548241577 547890511 549862022 552830544
3640.5 552830544 555656815 556607056 556603241 559608231 563696518 569010620 566173744 561150856 564332962
3649.2 564332962 563106804 562344666 563326836 569973717 574964066 579717178 583534241 572654800
3656.9 572654800 576313477 583208542 584644203 585701180 585928192 587964859 589151077 590942955
3664.6 590942955 592425652 593759766 599362831 599730606 596293869 596075249 589046021 594137688 604660301
3673.3 604660301 613285904 604992714 584471130 593791046 604698906 610219841 606975822 607564278
3681 607564278 611388741 613388329 614604874 614424400 614517632 618618164 624597816 613275909 611290436
$$ packed form
3624.1E23508072K729988J573982K243614P310486l508720j2637673O572381P633132
3631.8E35425262P058831k39716k982902L111152L897171J971779l51066J971511K968522
3640.5E52830544K826271R50241l815L004990M088287N314102k836876n022888L182106
3649.2E64332962j226158p62138R82170O646881M990349M753112L817063j0879441
3656.9E72654800L658677O895065J435661J056977K27012K036667J186218J791878
3664.6E90942955J482697J334114N603065L67775l436737k18620p029228N091667J0522613
3673.3F04660301Q625603q293190k0521584R319916J0907860N520935l244019N88456
3681F07564278L824463J999588J216545j80474R3232M100532N979652j1321907j985473
$$ plain form
3689.7 611290436 621057014 614078979 615767860 622503967 623047104 624619064 625008354 625171280 626743584
3698.4 626743584 627320938 630783234 633506699 624996185 624058304 630788574 631706161 631323242 631634064
3707 631634064 635343475 639649696 630594215 634936485 636071243 622556190 631081657 636122971
3714.8 636122971 636058578 637617645 640919342 641889114 637835312 639806442 646014862 640647507 636402130
3723.4 636402130 642834396 643421707 641368942 638281059 640773926 645287323 645629272 651372299 646289520
3732.1 646289520 639489250 650315628 648289871 637657509 640553131 643471909 644290466 648643875
3739.8 648643875 652019043 647593842 652834930 666951065 651239777 633136940 645961685 652964630
3747.5 652964630 660592880 654717560 643518295 657582397 647325897 641234207 650558624 656441956
$$ packed form
3689.7F11290436R766578o978035J688881O736107N43137J571960L89290J62926J572304
3698.4F26743584N77354L462296K723465q510514r37881O730270R17587l82919L10822
3707F31634064L709411M306221r055481M342270J134758j3515053Q525467N041314
3714.8F36122971o4393J559067L301697R69772m053802J971130O208420n367355m245377
3723.4F36402130O432266N87311k052765l087883K492867M513397L41949N743027n082779
3732.1F46289520o800270J0826378k025757j0632362K895622K918778Q18557M353409
3739.8F48643875L375168m425201N241088J4116135j5711288j8102837J2824745P002945
3747.5F52964630P628250n875320j1199265J4064102j0256500o091690R324417N883332
$$ plain form
3755.3 656441956 659593277 653964462 657605286 662186050 651097641 651122437 657248077 659453735
3763 659453735 660367966 663155441 658576660 655076065 660103149 665554733 664420700 653818741 656923523
3771.7 656923523 660510559 660732727 662554626 662949219 664264145 665196991 668080673 666285553 657384262
3780.3 657384262 661663589 664968643 666735535 669161148 664302979 662935867 665045929 666308060
3788 666308060 667194061 666907501 667456741 667808990 668338699 668220673 669894714 673184586 667118912
3796.7 667118912 662780075 666525726 671922073 678368301 668349991 655998306 661732330 667010345
3804.4 667010345 673700790 678266830 664349823 662182083 669042511 671306686 672121124 673007050
3812.2 673007050 673108521 674618454 680522156 676429520 660713577 668199997 675444412 680599289
$$ packed form
3755.3F56441956L151321n628815L640824M580764j1088409K4796O125640K205658
3763F59453735R14231K787475m578781l500595N027084N451584j134033j0601959L104782
3771.7F56923523L587036K22168J821899L94593J314926R32846K883682j795120q901291
3780.3F57384262M279327L305054J766892K425613m858169j367112K110062J262131
3788F66308060Q86001k86560N49240L52249N29709j18026J674041L289872o065674
3796.7F67118912m338837L745651N396347O446228j0018310j2351685N734024N278015
3804.4F67010345O690445M566040j3917007k167740O860428K264175Q14438Q85926
3812.2F73007050J01471J509933N903702m092636j5715943P486420P244415N154877
$$ plain form
3819.9 680599289 678984833 657652588 663653641 670802612 673437424 676582870 675426331 670080109
3827.6 670080109 671781387 675213776 679115219 679389496 668472519 673154602 681345291 673780746
3835.3 673780746 674876480 683064804 671547470 668951416 676598358 669564590 672077332 680434723
3843 680434723 676012955 672368622 676382294 678132324 678971176 680834198 678910980 681858368 688107758
3851.7 688107758 679631424 679213715 659231949 665282135 678928528 676910934 675842361 679693680
3859.4 679693680 682553558 684372940 676489563 677554550 685601578 676893234 671934814 678394775
3867.1 678394775 685150757 690778885 678680344 668975143 675384140 684908981 687349701 672543030
3874.8 672543030 675908279 681768265 681825104 684642410 689195557 680331345 672442322 681308517 683265991
$$ packed form
3819.9F80599289j614456k1332245O001053P148971K634812L145446j156539n346222
3827.6F70080109J701278L432389L901443K74277j0916977M682083Q190689p564545
3835.3F73780746J095734Q188324j1517334k596054P646942p033768K512742Q357391
3843F80434723m421768l644333M013672J750030Q38852J863022j923218K947388O249390
3851.7F88107758q476334m17709j9981766O050186J3646393k017594j068573L851319
3859.4F79693680K859878J819382p883377J064987Q047028q708344m958420O459961
3867.1F78394775O755982N628128j2098541r705201O408997R524841K440720j4806671
3874.8F72543030L365249N859986N6839K817306M553147q864212p889023Q866195J957474
$$ plain form
3883.5 683265991 685243454 689440384 673076630 676857681 683184204 685329437 690243149 686005936
3891.2 686005936 675469742 679054184 683125992 681649857 683870392 685374146 688022308 689152069
3898.9 689152069 677370377 684245300 686890411 680808182 685564270 680423050 678664551 679933777
3906.7 679933777 681763840 684851303 685304031 685906067 685471268 685183411 684559708 684513855 686687927
3915.3 686687927 688226624 683289490 680498886 686686707 685776138 681965179 685759201 687556229
3923.1 687556229 688027420 684171600 681540833 684777832 686800385 687183533 685246811 686066742 688075485
3931.7 688075485 684018860 682917786 685280991 685965424 686497269 686580734 685922089 686302414 686245575
3940.4 686245575 688095169 689596786 684030380 683722305 686257782 687716141 689449692 686457901
$$ packed form
3883.5F83265991J977463M196930j6363754L781051O326523K145233M913712m237213
3891.2F86005936j0536194L584442M071808j476135K220535J503754K648162J129761
3898.9F89152069j1781692O874923K645111o082229M756088n141220j758499J269226
3906.7F79933777J830063L087463M52728O02036m34799k87857o23703m5853K174072
3915.3F86687927J538697m937134k790604O187821r10569l810959L794022J797028
3923.1F87556229M71191l855820k630767L236999K022553L83148j936722Q19931K008743
3931.7F88075485m056625j101074K363205O84433N31845Q3465o58645L80325n6839
3940.4F86245575J849594J501617n566406l08075K535477J458359J733551k991791
$$ plain form
3948.1 686457901 686588821 686982269 684991150 686830292 686803894 686286545 686478500 686566925 686941681 686883698
3957.8 686883698 687407837 687071609 688225861 688384628 686068497 686702194 687721786 687231522 686815109
3966.5 686815109 687440643 688158340 687461624 686736908 687700958 688383713 687812347 687947540 688013382 687981186
3976.1 687981186 687776413 687422638 687691498 688045273 688108749 687704391 687635803 687758865 688145218 687827606
3985.7 687827606 687090836 687152405 687000275 688002625 688366394 688097687 689154587 689397659 688923187
3994.4 688923187 687505646 686787262 687882690 688963547 689013672 688303452
4000.2 688303452
$$ packed form
3948.1F86457901J30920L93448j991119J839142k6398n17349J91955Q8425L74756n7983
3957.8F86883698N24139l36228J154252J58767k316131O33697J019592m90264m16413
3966.5F86815109O25534P17697o96716p24716R64050O82755n71366J35193O5842l2196
3976.1F87981186k04773l53775K68860L53775O3476m04358o8588J23062L86353l17612
3985.7F87827606p36770O1569j52130J002350L63769k68707J056900K43072m74472
3994.4F88923187j417541p18384J095428J080857N0125p10220
4000.2F88303452
##END=$$ End of the data block
