##TITLE=$$ Begin of the data block
##JCAMP-DX=5.00 $$ ACD/SpecManager v 10.08
##SPECTROMETER/DATA SYSTEM=Varian
##DATE=20 Nov 2012 13:42:00
##DATA TYPE=INFRARED SPECTRUM
##DATA CLASS=XYDATA
##ORIGIN=
##OWNER=
##NPOINTS=3735
##FIRSTX=399.26403809
##LASTX=4000.35498047
##MAXX=4000.35498047
##MINX=399.26403809
##MAXY=78.44593048
##MINY=30.86516953
##XFACTOR=1.0000000000
##YFACTOR=0.000000100000000
##FIRSTY=57.90445328
##DELTAX=0.96440572
##XUNITS=1/CM
##YUNITS=TRANSMITTANCE
##XYDATA=(X++(Y..Y))
399.3E79044533M300117o653175o921730J198730M584732J19782J617317L852768q866043
$$ 579044533 583344650 576691475 569769745 570968475 575553207 575672989 577290306 581143074 572277031
407.9E72277031j1541481k369270R077186J0594292k451630j732673K584915J943397
$$ 572277031 560735550 558366280 567443466 578037758 575586128 573853455 576438370 578381767
415.7E78381767K27738j291428l826141l183937O77833k663078j320534J285820J612358
$$ 578381767 578609505 577318077 573491936 570307999 570985832 568322754 567002220 568288040 569900398
424.3E69900398j072502k436027N12924J437759M702912q74711m582824K279053M7149
$$ 569900398 568827896 566391869 566904793 568342552 573045464 572170753 567587929 569866982 569914131
433E69914131l869438l567352j456909j722451j348572Q1025k998543k157898N069160
$$ 569914131 566044693 562477341 561020432 559297981 557949409 558030434 555031891 552873993 557943153
441.7E57943153L918572k287789K943764K795525L522110N784416K918167L933334
$$ 557943153 561861725 559573936 562517700 565313225 568835335 574619751 577537918 581471252
449.4E81471252l280944l496209J634522l593521o12679O546822N907707l950653r732056
$$ 581471252 578190308 574694099 576328621 572735100 572122421 578669243 584576950 580626297 570894241
458.1E70894241L190804K159424k633972k974091j971092k62451M57954l648148k564506
$$ 570894241 574085045 576244469 573610497 570636406 568665314 568402863 568860817 565212669 562648163
466.8E62648163M898109O388779j846733n419464j190262k676125m393768k426643
$$ 562648163 567546272 573935051 572088318 566668854 565478592 562802467 558408699 555982056
474.5E55982056n39818l47138l465156q27446n36919J764488L349648r75113l875313
$$ 555982056 555442238 555095100 551629944 550802498 550265579 552030067 555379715 554404602 550529289
483.2E50529289l910942M505005L706474l16238m52080K1744J300888q77037P3662
$$ 550529289 546618347 551123352 554829826 554513588 554061508 554083252 555384140 554507103 554580765
491.8E54580765j390534o30226L058434p36351k493325j166839k512245l907013o23780
$$ 554580765 553190231 552560005 555618439 554882088 552388763 551221924 548709679 544802666 544178886
500.5E44178886J151276Q08334J37864j434288K033081N5847p105217l843880j233139
$$ 544178886 545330162 546138496 546276360 544842072 546875153 546931000 539825783 535981903 534748764
509.2E34748764m619904j408576M040412N06440o06614k144813m225044j526223o39534
$$ 534748764 530128860 528720284 532760696 533267136 532660522 530515709 526290665 524764442 524124908
517.9E24124908m443435o205101j087151j115112K001343L003158k601928k327843
$$ 524124908 519681473 513476372 512389221 511274109 513275452 516278610 513676682 511348839
525.6E11348839k403679N27344N70564J454086J392784k660713o23703O00014J702995
$$ 511348839 508945160 509472504 510043068 511497154 512889938 510229225 509605522 510205536 511908531
534.3E11908531J413689K428169K454987P0419K639618K920532K658119K986183J936150
$$ 511908531 513322220 515750389 518205376 518275795 520915413 523835945 526494064 529480247 531416397
543E31416397p50503p82700J504288K83050K582970K177048o14853j58272j278458
$$ 531416397 530665894 529883194 531387482 531670532 534253502 536430550 535815697 535657425 534378967
551.6E34378967j417465r67636n07088j343422k989921l613014p77970K378388o40145
$$ 534378967 532961502 531993866 531486778 530143356 527153435 523540421 522762451 525140839 524500694
560.3E24500694k608146k753640k769699k104721k086487k853431l809471k341309
$$ 524500694 521892548 519138908 516369209 514264488 512178001 509324570 505515099 503173790
568E03173790k874908l211060k940407j480942P6714j606102k062531j088447R11026
$$ 503173790 500298882 497087822 494147415 492666473 492743187 491137085 489074554 487986107 488897133
576.7D88897133J522484K383003K039070J707230K013359L337250M595718K321167
$$ 488897133 490419617 492802620 494841690 496548920 498562279 501899529 506495247 508816414
584.4E08816414L356552L846245J935119J483345L215676L566818J266975O867m15344
$$ 508816414 512172966 516019211 517954330 519437675 522653351 526220169 527487144 527494011 527078667
593.1E27078667J267776L91731q85238M66614K212J92947J21537o89736j410789p92656
$$ 527078667 528346443 528738174 527852936 528319550 528321762 528514709 528636246 527946510 526535721 525743065
602.8E25743065R7084o38352j75590P09686J528321Q88290k96783K10952J547699N37033
$$ 525743065 525840149 525201797 525026207 525735893 527264214 528152504 527855721 528066673 529614372 530151405
612.4E30151405J04142J667137r99718j451836J113778K051849K649307K103119J480560
$$ 530151405 530255547 531922684 530922966 529471130 530584908 532636757 535286064 537389183 538869743
621.1E38869743J319313K732430J937294J488686J801567j23825N29518J264076J089287
$$ 538869743 540189056 542921486 544858780 546347466 548149033 548025208 548554726 549818802 550908089
629.8E50908089J421127J553726J065674O25267N21431J002617J816673L23296K23312
$$ 550908089 552329216 553882942 554948616 555573883 556095314 557097931 558914604 559237900 559461212
638.4E59461212R79767J049156P92580n10254k1172n6762M17328J103935K41623N69992
$$ 559461212 560440979 561490135 562282715 561772461 561751289 561694527 562111855 563215790 563457413 564027405
648.1E64027405P82661J705170J081123q75740j45035M09890j14937N0621O8741p54433
$$ 564027405 564810066 566515236 567596359 566720619 566575584 566985474 566870537 566921158 566989899 566235466
657.7E66235466l1929K084618K309761J263694j79634o62498N97343J063843P91664
$$ 566235466 566203537 568288155 570597916 571861610 571681976 571019478 571616821 572680664 573472328
666.4E73472328l775635j4356956R640427O902885K119865N47562J120796J849671
$$ 573472328 569696693 555339737 564980164 571883049 574002914 574550476 575671272 577520943
674.1E77520943N99136l53699O79245J478081M25797J7814P59773N44053L41301L17039
$$ 577520943 578120079 577766380 578445625 579923706 580349503 580367317 581127090 581671143 582012444 582329483
683.8E82329483M76646Q07534J644401R67713o42968n66711o08482N44624Q59833m94690
$$ 582329483 582806129 583613663 585258064 586225777 585582809 585016098 584407616 584952240 585812073 585317383
693.4E85317383j065293j083755J92146L99819m60739q09746j286011j485367j082191
$$ 585317383 584252090 583168335 583360481 583760300 583299561 582489815 581203804 579718437 578636246
702.1E78636246n36919q87642j237106j253815n93071K86598k39448l50266N30701
$$ 578636246 578099327 577211685 575974579 574720764 574127693 574414291 574174843 573824577 574355278
710.8E74355278N15099j53161J102562J921502J264686J704140J611404J957360K644767
$$ 574355278 574870377 574717216 575819778 577741280 579005966 580710106 582321510 584278870 586923637
719.5E86923637K562714K679176K844086K804756K335015J710929K260170K266694
$$ 586923637 589486351 592165527 595009613 597814369 600149384 601860313 604120483 606387177
727.2F06387177O81915K075043L087272J763191J801644K531547K493363R94377J183853
$$ 606387177 607069092 609144135 612231407 613994598 615796242 618327789 620821152 621815529 622999382
735.8F22999382J091423m29459k46276J111297J624489R58176J071586l20244j801452
$$ 622999382 624090805 623661346 623415070 624526367 626150856 627109032 628180618 627860374 626058922
744.5F26058922j213684m61579m75158j424065j622314k403565k520103j172181j970100
$$ 626058922 624845238 624383659 623908501 622484436 620862122 618458557 615938454 614766273 612796173
753.2F12796173k053184n49508j680755k156944j377030k552986j758347o41670j290397
$$ 612796173 610742989 610193481 608512726 606355782 604978752 602425766 600667419 600025749 598735352
761.9E98735352j214943j624489n12428Q11386M47082R13391J817475K789230K253342
$$ 598735352 597520409 595895920 595383492 596194878 596641960 597555351 599372826 602162056 604415398
770.6F04415398K015838K867470L258362L527260K658348K774811L749504L393135
$$ 604415398 606431236 609298706 612557068 616084328 618742676 621517487 625266991 628660126
778.3F28660126L448257M281998L598251K995148K793884K252579J815948O84281P12585
$$ 628660126 632108383 636390381 639988632 642983780 645777664 648030243 649846191 650530472 651243057
787F51243057J679230K116089J028442J216812K588196J659317R09043J556625K012253
$$ 651243057 652922287 655038376 656066818 657283630 659871826 661531143 662440186 663996811 666009064
795.6F66009064P17849O13556Q69141J485138K733841J244507J425857K017517K010804
$$ 666009064 666726913 667340469 668209610 669694748 672428589 673673096 675098953 677116470 679127274
804.3F79127274J822280J341706J404419L52783N15060L91999K81067k59171O5308
$$ 679127274 680949554 682291260 683695679 684048462 684563522 684955521 685236588 684977417 685042725
813F85042725P39059P7515J098633M16183k9144O0119K33384N54809k32468k66799
$$ 685042725 685781784 685859299 686957932 687374115 687344971 687405090 687638474 688193283 687960815 687694016
822.6F87694016j114045j491699j744461n59387o60095k159729j442261j663361j463775
$$ 687694016 686579971 685088272 683343811 682784424 682124329 679964600 678522339 676858978 675395203
831.3F75395203j772232k261963k771607k373199j705017k814484j750870j276550
$$ 675395203 673622971 671361008 668589401 666216202 664511185 661696701 659945831 658669281
839F58669281j246185j118470k119827j853561j374512j558533k319336k358169j394730
$$ 658669281 657423096 656304626 654184799 652331238 650956726 649398193 647078857 644720688 643325958
847.7F43325958J06964o87103k039719p34672r00917j504440j664925k465477k643814
$$ 643325958 643432922 642745819 640706100 639971428 639070511 637566071 635901146 633435669 630791855
856.4F30791855k166405k339897k515793j091881l08342K63176J419182K396889L838692
$$ 630791855 628625450 626285553 623769760 622677879 622369537 622632713 624051895 626448784 630287476
865.1F30287476M427032M433174M658394M939728M125519L911209N000076M865570
$$ 630287476 634714508 639147682 643806076 648745804 652871323 656782532 661782608 666648178
872.8F66648178L846665L350296L731994K114639J635743P50808p87811J14517j048660
$$ 666648178 670494843 673845139 677577133 679691772 681327515 682078323 681290512 681405029 680356369
881.5F80356369k050171j591797r29336j890717k297287k089996l150101k335739k228012
$$ 680356369 678306198 676714401 675785065 673894348 671597061 669507065 666356964 664021225 661793213
890.2F61793213k029572j945724k786713k386780j926574k245407k400208j440887
$$ 661793213 659763641 657817917 655031204 652644424 650717850 648472443 646072235 644631348
897.9F44631348k072449k110672n68047j245765k572785k335434j724586k704430l214760
$$ 644631348 642558899 640448227 639880180 638634415 636061630 633726196 632001610 629297180 626082420
906.5F26082420l422622m341050l790206l228417l769073l511010l261222l756142
$$ 626082420 622659798 618318748 614528542 611300125 607531052 604020042 600758820 597002678
914.3E97002678m222603m343872m036140m277268l957062l935547l775177k310409
$$ 597002678 592780075 588436203 584400063 580122795 576165733 572230186 568455009 566144600
922E66144600j904945j849862j177826l24668r9907L81965N42603N0697N75295L94096
$$ 566144600 564239655 562389793 561211967 560887299 560787392 561169357 561711960 561762657 562337952 562732048
931.6E62732048k58751L61405J155777J503601J700668J717110J622467J364097J496392
$$ 562732048 562473297 562834702 563990479 565494080 567194748 568911858 570534325 571898422 573394814
940.3E73394814J906738K097130K609329K330627Q51746J02234o37551j609458j733437
$$ 573394814 575301552 577398682 580008011 582338638 583190384 583292618 582655067 581045609 579312172
949E79312172k801399l981018m550629m293594m231682n988617o267853n569305o361847
$$ 579312172 576510773 572529755 567979126 563685532 559453850 553465233 547197380 541628075 535266228
957.7E35266228o254311o470451p275582o832161p352867p743873p802468p479286
$$ 535266228 529011917 522541466 515265884 508433723 501080856 493336983 485534515 478055229
965.4D78055229p721672q302498p887001q178100q220215q944435q134461q259277
$$ 478055229 470333557 462031059 454144058 445965958 437745743 428801308 420666847 412407570
973.1D12407570q885498q254090q633880p787132q933258q328324p326736o542473
$$ 412407570 403522072 395267982 386634102 378846970 369913712 361585388 354258652 347716179
980.8C47716179n683556n963821m371796m272995l077812m146652l367768j926231
$$ 347716179 342032623 336068802 331697006 327424011 324346199 320199547 316831779 314905548
988.5C14905548k131004p50180j923236o25325q24108J55163M32568r0752J373177
$$ 314905548 312774544 312024364 310101128 309475803 308651695 308806858 309239426 309148674 310521851
997.2C10521851K29911R36604k54192P04631N76077m47617O66905O16817J546917o39057
$$ 310521851 310751762 311688366 311434174 312138805 312714882 312267265 312934170 313550987 315097904 314458847
1006.8C14458847k16103n12027l66936k16789j226826Q69331n49965n7315l68824J12304
$$ 314458847 314242744 313730717 313363781 313146992 311920166 312789497 312239532 312182217 311813393 311925697
1016.5C11925697k0160q19798J052666O19907K079258P47833J380253J253128J151162
$$ 311925697 311905537 311085739 312138405 312758312 314837570 315585403 316965656 318218784 319369946
1025.2C19369946K567691N32532K220001J466141J441422R54284J493416K493172Q15735
$$ 319369946 321937637 322470169 324690170 326156311 327597733 328552017 330045433 332538605 333354340
1033.8C33354340K074012O19355J093940O95305J159935R41200q30993k2278j213875
$$ 333354340 335428352 336047707 337141647 337836952 338996887 339938087 339107094 339084816 337870941
1042.5C37870941J185494K84729J92375K57721l50762J726532L04413J194802P06672
$$ 337870941 339056435 339341164 339533539 339791260 339440498 341167030 341471443 342666245 343372917
1051.2C43372917K351151K217445J856880L103943J596909K918930K153473L786850
$$ 343372917 345724068 347941513 349798393 352902336 354499245 357418175 359571648 363358498
1058.9C63358498L533287M404640N358238L691063N687485M551468M781341L360672
$$ 363358498 366891785 371296425 376654663 380345726 386033211 390584679 395366020 398726692
1066.6C98726692K407646J270523q96644j410828m570694m485893n914764n853920
$$ 398726692 401134338 402404861 401508217 400097389 395526695 391040802 385126038 379272118
1074.4C79272118m575310l104859j604423k494507k34566j581382M67529J041565Q73642
$$ 379272118 374696808 371591949 369987526 367493019 367258453 365677071 366144600 367186165 368059807
1083C68059807K607841J560555K991676J039467J594696K283402L363876L275642J578484
$$ 368059807 370667648 372228203 375219879 376259346 377854042 380137444 383501320 386776962 388355446
1091.7C88355446L402519K449913L078461K182922K361717K456475J148071J253166
$$ 388355446 391757965 394207878 397286339 399469261 401830978 404287453 405435524 406688690
1099.4D06688690K34947J297303N9089K40937J21574k46048K54822K81296K274131
$$ 406688690 406923637 408220940 408280029 408520966 408642540 408396492 408651314 408932610 411206741
1108.1D11206741J260491J716423J283455J671257J912880J316833K422829J653518
$$ 411206741 412467232 414183655 415467110 417138367 419051247 420368080 422790909 424444427
1115.8D24444427L003388J272812J360969J462250l93638J350059J042862P27119j28707
$$ 424444427 427447815 428720627 430081596 431543846 431150208 432500267 433543129 434270248 434141541
1124.5D34141541J047172J470642J700554K448578J196403K624894K290153J954041
$$ 434141541 435188713 436659355 438359909 440808487 442004890 444629784 446919937 448873978
1132.2D48873978J210251J306114J054153k32620J142578j39084j354179k474518k524223
$$ 448873978 450084229 451390343 452444496 452211876 453354454 453215370 451861191 449386673 446862450
1140.9D46862450k896767l696556l052025l963852l476868m473304l074303k500305
$$ 446862450 443965683 440269127 437217102 433253250 429776382 425303078 422228775 419728470
1148.6D19728470k979469j915551k909813j593704k349357j123772q26721q42400N67932
$$ 419728470 416749001 414833450 411923637 410329933 407980576 406856804 406030083 405187683 405755615
1157.3D05755615k28004J004562L04833J539154J338462J514702K662163K370949L404312
$$ 405755615 405527611 406532173 406837006 408376160 409714622 411229324 413891487 416262436 419666748
1166D19666748K951469M746132M047585M578171N313873M830017O195335N625687O150093
$$ 419666748 422618217 427364349 431411934 435990105 441303978 446133995 452329330 457955017 464105110
1174.6D64105110N699730O468048O195984N755501O565437O288872O521683N330352
$$ 464105110 469804840 476272888 482468872 488224373 494789810 501078682 507600365 512930717
1182.4E12930717N759659N310555M819565M861335M072991M488220L465996L226356
$$ 512930717 518690376 524000931 528820496 533681831 537754822 542243042 545709038 548935394
1190.1E48935394L432541K897263K199058J533623J548653J298256J073188M33426
$$ 548935394 552367935 555265198 557464256 558997879 560546532 561844788 562917976 563351402
1197.8E63351402L94402O13670O58722Q30422N61332M79965L28331J058274J274071
$$ 563351402 563745804 564359474 565018196 565848618 566409950 566889915 567218246 568276520 569550591
1206.5E69550591J342163J530418J048088J626701J539574J644859K310677K061462
$$ 569550591 570892754 572423172 573471260 575097961 576637535 578282394 580593071 582654533
1214.2E82654533J764794J754493K260094K023430J250992J387176J245270R39102
$$ 582654533 584419327 586173820 588433914 590457344 591708336 593095512 594340782 595279884
1221.9E95279884P96318J89095n22156q38356j82762J06239o89087r29222m48456q84857
$$ 595279884 596076202 596265297 595743141 594904785 594722023 594828262 594139175 593209953 592761497 591876640
1231.5E91876640j280937p16743l68576l25852n80101q96606q14171n36575m88663
$$ 591876640 590595703 589878960 589510384 589184532 588604431 587707825 586893654 586357079 585868416
1240.2E85868416n39627n66254k86064J97487K59209K16140L90854Q26492Q01430N09873
$$ 585868416 585328789 584762535 584476471 584673958 584933167 585149307 585540161 586366653 587168083 587677956
1249.9E87677956N90782O17447P87124R45702J013489J009407M27093L51868N99518
$$ 587677956 588268738 588886185 589673309 590619011 591632500 592641907 593069000 593420868 594020386
1258.5E94020386L30772L61252O22711M66385N2452L51143P82776Q10165R71794P98874
$$ 594020386 594351158 594712410 595335121 595801506 595853958 596205101 596987877 597798042 598769836 599568710
1268.2E99568710O13785J013222Q11272O6299P62863O49452k746P32956M17328k2164
$$ 599568710 600182495 601195717 602006989 602073288 602836151 603485603 603482857 604215813 604633141 604610977
1277.8F04610977k00195k40059k10571l94898j92261n64117n10101m51622n38521j11466
$$ 604610977 604410782 604170723 603960152 603565254 603372993 602808876 602298775 601847153 601308632 601197166
1287.5F01197166n0849m17061m14887k69165m88205n54695j005516q11043q42132j119690
$$ 601197166 601146317 600729256 600314369 600045204 599556999 599002304 597996788 597185745 596343613 595223923
1297.1E95223923n58014q30765q49037p74880n71708m76189p32765p90787q97064o85654
$$ 595223923 594665909 593835144 592986107 592211227 591639519 591163330 590430565 589639778 588742714 588057060
1306.8E88057060j523399j503525o86378o28281n75180r83505o51665k33498k61879
$$ 588057060 586533661 585030136 584343758 583715477 583140297 582156792 581505127 581271629 581009750
1315.4E81009750o05812p10678l65829j171570j104736m84658p26585j026840j175156
$$ 581009750 580403938 579693260 579327431 578155861 577051125 576566467 575839882 574813042 573637886
1324.1E73637886j222725j680031k076797k021332j667709j686211k610435k568436
$$ 573637886 572415161 570735130 568658333 566637001 564969292 563283081 560672646 558104210
1331.8E58104210j846657j813316j487999j640244j353645j115074j277466r15031
$$ 558104210 556257553 554444237 552956238 551315994 549962349 548847275 547569809 546654778
1339.6E46654778j27831J192055O53877J19019n9929K61917M52690j66092K4490K99225
$$ 546654778 546526947 547719002 548372879 548491898 548431969 548693886 549146576 548980484 549004974 549304199
1349.2E49304199J36833k89459m8675J24130j48468n35736m28429J18942p20062n34935
$$ 549304199 549441032 549151573 549102898 549227028 549078560 548542824 548114395 548233337 547513275 546978340
1358.8E46978340k60887j027946p47376j004829j120797M51203Q29849j42174k6779
$$ 546978340 546717453 545689507 544942131 543937302 542816505 543267708 544097557 543955383 543928604
1367.5E43928604m35943q17681M37203J23787M62913m5662p06787K01378J334534J633415
$$ 543928604 543492661 542674980 543112183 543235970 543698883 543653221 542946434 543147812 544482346 546115761
1377.2E46115761M1771L58886O69327P79305N69534Q9340R18122Q61702J334152R65462
$$ 546115761 546157532 546516418 547185745 547965050 548534584 548623924 549542046 550403748 551737900 552703362
1386.8E52703362N98869K219772K310410J375770J013451J477623J114006j171761
$$ 552703362 553302231 555522003 557832413 559208183 560221634 561699257 562813263 561641502
1394.5E61641502k277031J049195O47621r11942k711525o53419J010971n04532m52499
$$ 561641502 559364471 560413666 561061287 560149345 557437820 556784401 557795372 557290840 556838341
1403.2E56838341q96111k302933p23495n7449l03154q33283p94487q19740q40073r98878
$$ 556838341 555942230 553639297 552915802 552858353 552555199 551721916 550927429 550107689 549267616 548268738
1412.8E48268738n80979m49867j079597p70455o21109k37198l006324R60731K732620
$$ 548268738 547687759 547237892 546158295 545387840 544766731 544529533 541523209 542483940 545216560
1421.5E45216560O59409m38767j243858J223145J079025J07918O50749o17294J77154
$$ 545216560 545875969 545437202 544193344 545416489 546495514 546603432 547254181 546636887 546814041
1430.2E46814041J329880J586304P13119Q37288K118874O21643k904854Q87680L373947
$$ 546814041 548143921 549730225 550443344 551280632 553399506 554021149 551116295 552003975 555377922
1438.9E55377922J212997L63732P67784L42407J021042J33209O43540N90324q1978
$$ 555377922 556590919 556954651 557722435 558064842 559085884 559219093 559862633 560452957 560370979
1447.6E60370979j434211O00509J293183j235619q32252o63796M14848m38118k107162
$$ 560370979 558936768 559537277 560830460 559594841 558762589 558098793 558513641 558075523 555968361
1456.2E55968361n347519l720818M598465J636162K846260O38428P27348J613617k698440
$$ 555968361 550620842 546900024 551498489 553134651 555980911 556619339 557346687 558960304 556261864
1464.9E56261864K868499K324219K942581K031823K676048L760643J276359K564354
$$ 556261864 559130363 561454582 564397163 566428986 569105034 572865677 574142036 576706390
1472.6E76706390K169228P151184M127960K686501M158172L717194L694687K505569
$$ 576706390 578875618 586026802 590154762 592841263 596999435 600716629 604411316 606916885
1480.3F06916885K966462K256164M087525K952461J907539K593994J01471K179489
$$ 606916885 609883347 612139511 616227036 619179497 621087036 623681030 623782501 625961990
1488.1F25961990K200165R36699M82025M098320L594208J329880K376938k15760j996650
$$ 625961990 628162155 629098854 629580879 633679199 637273407 638603287 640980225 640764465 638767815
1496.7F38767815L547325J606903j5717K730561J979217L54767K004471J465072J009293
$$ 638767815 642315140 643922043 643906326 646636887 648616104 648970871 650975342 652440414 653449707
1505.4F53449707p260971p059364P388343M083786L218842K056656Q87375j28861K002106
$$ 653449707 646188736 639129372 646517715 650601501 653820343 655876999 656764374 656635513 658637619
1514.1F58637619L21503l9521p88345l602753N835877L064194l531800l871307J598816
$$ 658637619 658959122 658919601 658131256 654528503 660364380 663428574 659896774 656025467 657624283
1522.8F57624283N398712J735992j301879M06494J945038l67814P76673K135620L8223
$$ 657624283 663022995 664758987 663457108 663863602 665808640 665440826 666217499 668353119 668391342
1531.5F68391342R24149k208100k400360K937393J503067J593247N96008m780655q283462
$$ 668391342 669315491 667107391 664707031 667644424 669147491 670740738 671336746 666556091 658272629
1540.1F58272629M473190M75769L37525M724044l26080j565247K559281J770935N75790
$$ 658272629 662745819 663221588 663559113 668283157 667957077 666391830 668951111 670722046 671297836
1548.8F71297836k469711k727890J499405J211624J32904m191437m80423L705521J094284
$$ 671297836 668828125 666100235 667599640 668811264 668944168 664752731 664272308 667977829 669072113
1557.5F69072113j1063461q531723M028473P116165L138885R62830n41306l355407
$$ 669072113 658008652 649476929 653505402 660621567 663760452 664723282 664181976 660826569
1565.2F60826569q2627J694336R21021r90906o780014J317673J985550M53414L7385
$$ 660826569 660743942 662438278 663359299 662368393 655588379 656906052 658891602 659345016 659382401
1573.9F59382401K70004j652222q437576L639602K642518m7074L0976n72052p34864
$$ 659382401 659652405 658000183 649562607 653202209 655844727 655797653 655828629 655256577 654521713
1582.6F54521713j060257p66983o61392n33524m10537r08890r01337j175308m65622
$$ 654521713 653461456 652694473 652033081 651499557 651089020 650180130 649278793 648103485 647637863
1591.2F47637863j170959r21173j173325j767044m58374r51462m03366j132431j249542
$$ 647637863 646466904 645545731 644372406 642605362 642146988 641195526 640792160 639659729 638410187
1599.9F38410187j470719j806411r66874j635971p14988r53827j499596k075386q90312
$$ 638410187 636939468 635133057 634166183 632530212 631815224 630861397 629361801 627286415 626396103
1608.6F26396103j583672k100181j3085k089424j693535j827278p94220k049064r149285
$$ 626396103 624812431 622712250 622699165 620609741 618916206 617088928 616294708 614245644 605096359
1617.3F05096359K370186O29768n63659j775475n25055k043113n235787J571617K5406
$$ 605096359 607466545 608096313 607532654 605757179 605232124 603189011 597953224 599524841 599550247
1626E99550247n96466l789825k048836N85289m51775j32332r84001M30527n3062p325707
$$ 599550247 598953781 595163956 593115120 593700409 593248634 593116302 592132301 592562828 592509766 585184059
1635.6E85184059p49588K573815J143646R42688O07986n37948O24351l51448J847916
$$ 585184059 584434471 587008286 588151932 589094620 589702606 589164658 589789009 589437561 591285477
1644.3E91285477K134399k199325j620522j469498L866272L126984L262749K879791
$$ 591285477 593419876 591220551 589600029 588130531 591996803 595123787 598386536 601266327
1652F01266327q634873o010360Q239555N685883K835006K079773J430359J767006J883660
$$ 601266327 592631454 586621094 594860649 600546532 603381538 605461311 606891670 608658676 610542336
1660.7F10542336J903457L28369n66253L705749K660217J754570J885567J193581j637840
$$ 610542336 612445793 612774162 612207909 615913658 618573875 620328445 622214012 623407593 621769753
1669.4F21769753J701278L797875J717872L620835L736915k24075p36580M210777L255081
$$ 621769753 623471031 627268906 628986778 632607613 636344528 636120453 635383873 639594650 642849731
1678F42849731J948929J663056K47879L748016L890610j324082m422683N227890O751404
$$ 642849731 644798660 646461716 646709595 650457611 654348221 653024139 648601456 653829346 660580750
1686.7F60580750L451614J336594K661590J845093K553406K388763J894531L325272
$$ 660580750 664032364 665368958 668030548 669875641 672429047 674817810 676712341 680037613
1694.4F80037613R83276o856994M768829N941772N572968k512131p186355P657165
$$ 680037613 681020889 674163895 678932724 684874496 690447464 687935333 680748978 688406143
1702.1F88406143M684982J096650j36261J347580l6393K304154K982483N62668j45951
$$ 688406143 693091125 694187775 694051514 695399094 695362701 697666855 700649338 701212006 701066055
1710.8G01066055J575165J713257N54504j901931j88599L837128l91541o496277M331284
$$ 701066055 702641220 704354477 704908981 703007050 702818451 706655579 706264038 699767761 704099045
1719.5G04099045L072662J481247J015167J27106R9182J575470J036453L03421J298523
$$ 704099045 707171707 708652954 709668121 709795227 709894409 711469879 712506332 712809753 714108276
1728.2G14108276Q03757k236557J83563L567047J314393o234818l917236O037368M186478
$$ 714108276 714912033 712675476 712859039 716426086 717740479 711505661 707588425 713625793 717812271
1736.9G17812271J023102J497421j623611j384583M182282J561126j488876Q70438
$$ 717812271 718835373 720332794 718709183 717324600 721506882 723068008 721579132 722449570
1744.6G22449570K552566Q19168L01743K9449O4316M176941o7749m80576M199830K211990
$$ 722449570 725002136 725821304 726123047 726152496 726216812 730393753 730326004 729845428 734045258 736257248
1754.2G36257248J865997J503601j701202J286240K613983J832962J850509k788238
$$ 736257248 738123245 739626846 737925644 739211884 741825867 743658829 745509338 742721100
1761.9G42721100L04260M034195J749115Q39005J215591K9831k924957K590637L389740
$$ 742721100 743025360 747059555 748808670 749647675 750863266 750893097 747968140 750558777 753948517
1770.6G53948517j491852l388519o32706M413529J920394k08969J995621J71585O59409
$$ 753948517 752456665 749068146 748435440 752848969 754769363 754560394 756556015 756727600 757387009
1779.3G57387009k83509j305847J412277K210160J312790j369248j18332J371384M85611
$$ 757387009 757103500 755797653 757209930 759420090 760732880 759363632 759245300 760616684 761102295
1788G61102295M44107J162491m93546q39767k326431l01743L789291N54734p54929
$$ 761102295 761546402 762708893 762215347 761375580 759049149 758747406 762536697 763091431 762336502
1796.7G62336502J766205J377869p62864j292190J734848m93622L75137J514664k21558
$$ 762336502 764102707 765480576 764717712 763425522 765160370 764666748 765041885 766556549 766334991
1805.3G66334991N33143J27792k27203P47299M40826j381531N79071J456910M58984
$$ 766334991 766868134 766995926 766768723 767516022 767956848 766575317 767154388 768611298 769070282
1814G69070282Q69751P4005j00174p65457L04794Q64792J76315R00269o46896O80465
$$ 769070282 769940033 770014038 769913864 769148407 769453201 770317993 770494308 771394577 770747681 771428146
1823.7G71428146N17731l326569J186371K481156R35592j678924m069519J944275K568664
$$ 771428146 771945877 768619308 769805679 772286835 773222427 771543503 767473984 769418259 771986923
1832.3G71986923K65656M90188N56336K95639k58103l16238Q67538j44729N22766M15802
$$ 771986923 772252579 772742767 773299103 773594742 773336639 773020401 773887939 773743210 774265976 774681778
1842G74681778O00052r77631o244049K636871K996064N2337j17340J022034R78928
$$ 774681778 775281830 774304199 768060150 770697021 773693085 773745422 773628082 774650116 775629044
1850.7G75629044o1493J97525k95258J35880m578m26407J08948k34375p2174p5760
$$ 775629044 775567551 775765076 775469818 775605698 775601120 775174713 775283661 775049286 774977112 774901352
1860.3G74901352L00674J29319M46930L30429J90887J53656j038589O2790k047349
$$ 774901352 775202026 775331345 775778275 776108704 776299591 776453247 775414658 775477448 773430099
1869G73430099j496734J873245J418839Q73565L26386N35049L4561J98746L43399K24228
$$ 773430099 771933365 773806610 775225449 776099014 776425400 776960449 776995010 777193756 777537155 777761383
1878.6G77761383o2866n90286J87072k19726J58310j14441l56217K15531L48739J635361
$$ 777761383 777698517 777108231 777295303 777075577 777233887 777119446 776763229 776978760 777327499 778962860
1888.3G78962860l82538j943207J074982J071091N2872K56881q46328j186829R00574
$$ 778962860 778580322 776637115 777712097 778783188 778836060 779092941 778246613 777059784 777960358
1896.9G77960358K36816J07117L60794K2430J85395R765K69013k97013L20816L76129
$$ 777960358 778197174 778304291 778665085 778687515 778872910 778882675 779151688 778854675 779175491 779551620
1906.6G79551620n41305m19235m30527o52161J4344J051864R4376M66232L90320L36533
$$ 779551620 779010315 778591080 778160553 777508392 777522736 778574600 778668976 779135208 779525528 779862061
1916.2G79862061R98306k635346p52792J456909M43649j35803j751175m39300J330185
$$ 779862061 780860367 778225021 777472229 778929138 779372787 779236984 777485809 777046509 778376694
1924.9G78376694R77020k40784k4795K26669K58942L01590j80130O8206n49545j28784
$$ 778376694 779353714 779112930 779088135 779314804 779573746 779875336 779695206 779763412 779213867 779085083
1934.6G79085083R16J15432M20456m67224k15225m0360Q32825p41959j787872J574555
$$ 779085083 779085999 779201431 779621887 779154663 778939438 778899078 779731903 778989944 777202072 778776627
1944.2G78776627R06219l71323n874M79660q9035k75421K51083j41754j50986J984
$$ 778776627 779682846 779311523 779305649 779785309 779696274 779420853 779671936 779530182 779379196 779381180
1953.8G79381180N1498J20850O31180K60315m17405q3999k82135l27759l738M07486
$$ 779381180 779432678 779553528 780184708 780445023 780027618 779943619 779661484 779333725 779329987 779737473
1963.5G79737473J45645n5161l1051p04651k0447Q92639N33371r5520K8610j82113
$$ 779737473 779883118 779827957 779796906 779092255 779071808 779964447 780497818 780402298 780430908 780248795
1973.1G80248795l72010O4698L80477K72980l27225j52511k78092N1499O89087K14462
$$ 780248795 779876785 779941483 780321960 780594940 780267715 780115204 779837112 779888611 780577698 780792160
1982.8G80792160J98898L510j71127l22571l92609n50613n10102M94309Q9722j024476
$$ 780792160 780991058 780994568 780823441 780500870 780108261 779557648 779047546 779541855 779631577 778607101
1992.4G78607101K42157J204529J81504j21842P3242j69830J00326j63192j77002l03498
$$ 778607101 778849258 780053787 780235291 780113449 780186691 780016861 780117187 779953995 779776993 779473495
2002.1G79473495J00174N19944J2512j18637m48456q0566r8725l16925j03836k71530
$$ 779473495 779573669 780093613 780106125 779987488 779539032 779458466 779359741 779042816 778938980 778667450
2011.7G78667450J47400m9210k39258J03608n24521p38983L16391J20163k68631J85089
$$ 778667450 778814850 778765640 778526382 778629990 778105469 777366486 777682877 777803040 777534409 777719498
2021.3G77719498P1029j89514m50134r2774k5634k48871m46320n92422J47247J4572
$$ 777719498 777790527 777601013 777150879 777058105 777032471 776783600 776337280 775744858 775892105 775906677
2031G75906677R8953R8649k15989k26974m69666N8442m3793m8752K42844o2027p04728
$$ 775906677 776005630 776104279 775888290 775661316 775191650 775250092 775206299 775157547 775400391 775338364 774633636
2041.6G74633636l85055J94092l97873L8528k66495k90451M41666K38953J48849n60379
$$ 774633636 774248581 774442673 774044800 774083328 773816833 773526382 773968048 774207001 774355850 773795471
2051.2G73795471l42254j07651O6070L15628K8000q2092m59518J40914q39j31454K84576
$$ 773795471 773453217 773345566 773411636 773727264 773755264 773673172 773213654 773354568 773353729 773222275 773506851
2061.9G73506851J12457J20392m62188m77372N7145N78689K65885l49198k39868L9215
$$ 773506851 773619308 773739700 773277512 772800140 772857285 773435974 773701859 773352661 773112793 773152008
2071.5G73152008L96271P9727L9062L7995K14462K9678l37677N7908j23215k7313M2648
$$ 773152008 773548279 773628006 773667068 773705063 773919525 773949203 773611526 773669434 773546219 773518906 773561554
2082.1G73561554K52991L9825l96576j20392j5030J25962m6082L74603P3700l55911
$$ 773561554 773814545 773854370 773457794 773337402 773322372 773448334 773402252 773776855 773850555 773494644
2091.7G73494644M7302J88904K12937m06342k15607j37939L73001N22766j66397K04392
$$ 773494644 773541946 773730850 773943787 773537445 773321838 773183899 773556900 774079666 773913269 774117661
2101.4G74117661j19172P1259J26877J42975J9302l47748Q6289l32947J68533K60544
$$ 774117661 773998489 774069748 774196625 774339600 774358902 774011154 774097443 773764496 773933029 774193573
2111G74193573j42365J47477K14233L15323J88827L43400j31226k58865l45841l66211
$$ 774193573 774051208 774198685 774412918 774728241 774917068 775260468 775129242 774870377 774524536 774158325
2120.7G74158325J17035O7597n6077n07049L21503O79016K8686j68838k36969K62451
$$ 774158325 774275360 774342957 774286880 773779831 774101334 774780350 774809036 774640198 774403229 774665680
2130.3G74665680O3553k86637k68707J80435l6544m52118j62888N5695P34100M18854
$$ 774665680 774729233 774442596 774173889 774354324 774317780 773865662 773702774 773758469 774492569 774911423
2140G74911423O0043j94626m74167m26635k06986M15650r5597N2643K03552J06049
$$ 774911423 774971466 774776840 774302673 773876038 773669052 774084702 773989105 774041748 774245300 774351349
2149.6G74351349J71051j50604L37295M09241p3700p31354J47248O33239k02942k39563
$$ 774351349 774522400 774371796 774709091 775118332 775044632 774313278 774460526 775093765 774890823 774651260
2159.3G74651260k07748M58221J67084j68915J5107K86407N28030N8976P9345l79028
$$ 774651260 774443512 774901733 775068817 774899902 774915009 775201416 775729446 775788422 775867767 775488739
2168.9G75488739J40686J52512l43857L14102L09830L00369K441L15476M89120L49884
$$ 775488739 775629425 775781937 775438080 775752182 776062012 776362381 776364822 776680298 777169418 777519302
2178.5G77519302K9297k56576Q2321l39279O8206l1967p9345K94418L35159M26789
$$ 777519302 777548599 777292023 777374344 777035065 777103271 777071304 776991959 777286377 777621536 778048325
2188.2G78048325q5068M71039L16925J78756J5793j58004M93927j09101j3046K09579
$$ 778048325 777963257 778434296 778751221 778929977 778945770 778787766 779281693 779172592 779159546 779369125
2197.8G79369125K65808j05361k11335L66669J85089L84140j10397k08206M0817K61459
$$ 779369125 779634933 779529572 779318237 779684906 779869995 780254135 780143738 779935532 779976349 780237808
2207.5G80237808K00119j31302L24784N7678J80206k00805j56632M42886N2338K06146
$$ 780237808 780437927 780306625 780631409 780689087 780869293 780668488 780511856 780954742 781007080 781213226
2217.1G81213226L51410K45896k28653J18560o4163j45721M44031m0131L62167J20468
$$ 781213226 781564636 781810532 781581879 781700439 781636276 781490555 781934586 781894455 782256622 782377090
2226.8G82377090p400J27106j59989P630O179K60010k04086m23584k92358M03671N72281
$$ 782377090 782369690 782496796 782336807 782344437 782350616 782610626 782406540 781982956 781690598 782094269 782666550
2237.4G82666550j2284L38135K77557L50647j27258j43127K0065k87476r4986m02984
$$ 782666550 782654266 782992401 783269958 783620605 783493347 783350220 783370285 783082809 782987823 782584839
2247G82584839j49613O6147N91431K54059l80707K18582Q3847k07825m65621k38114
$$ 782584839 782435226 782501373 783092804 783346863 782966156 783184738 783268585 783060760 782595139 782357025
2256.7G82357025l26462J17417P44171K02255j87683l18375J89209J3581L26996K71301
$$ 782357025 782030563 782147980 782892151 783094406 782906723 782588348 782777557 782791138 783118134 783389435
2266.3G83389435l18604O9733j6174M5166l21732J51749J27563J9455M75540j86309
$$ 783389435 783070831 783140564 783124390 783169556 782847824 782999573 783127136 783146591 783622131 783435822
2275.9G83435822J77459K29492L24021p9956l75138L5935K84958M26712o76193j95847
$$ 783435822 783613281 783842773 784166794 784086838 783711700 783747635 784032593 784459305 783783112 783587265
2285.6G83587265l94516m82559K85187o7902J15356k24533O1646n04685k53143j20697
$$ 783587265 783192749 782710190 782995377 782927475 783042831 782818298 782879944 782375259 782122116 782001419
2295.2G82001419n38330L88794m98123k03095m87365k34452L03726j60675M29230p48138
$$ 782001419 781463089 781851883 781353760 781150665 780663300 780428848 780732574 780571899 781001129 780252991
2304.9G80252991o16074p97653n18417k35444p00454j47171j198349J52359l37143
$$ 780252991 779636917 778839264 778320847 778085403 777384949 777237778 776039429 776191788 775854645
2313.5G75854645o62995M61274l63770n9662n77392p71256k077789j256104l43551
$$ 775854645 775191650 775652924 775289154 775229492 774652100 773880844 771803055 770546951 770203400
2322.2G70203400j301957l23028n66254r4375j148224l18299M95224R7199k31857j745758
$$ 770203400 768901443 768578415 768012161 767917786 766769562 766451263 766946487 767043686 766811829 765066071
2331.9G65066071L98635L10593P32269l62625k114486N5923P6599j49689q69445j26725
$$ 765066071 765464706 765775299 766507568 766144943 764030457 764086380 764162979 764013290 763143845 763017120
2341.5G63017120q51593j018371Q27331O09284J145706K240219L335037R56421j922302
$$ 763017120 762165527 761147156 761974487 762583771 763729477 765969696 769304733 770261154 768338852
2350.2G68338852j760559j315766j839981j496658k043076k843170j141739p43713
$$ 768338852 766578293 765262527 763422546 761925888 759882812 757039642 755897903 755154190
2357.9G55154190j375961j321717P11365K235184L29437O18210r1476J7929R47570
$$ 755154190 753778229 752456512 753167877 755403061 755732498 756350708 756259232 756277161 757224731
2366.6G57224731J061631J225433J207809J236268P66067K070084R30023Q24432J789780
$$ 757224731 758286362 759511795 760719604 761955872 762721939 764792023 765722046 766546478 768336258
2375.3G68336258L70865N82733R92355J327362J096726R04617J303940J049957L15857
$$ 768336258 768707123 769289856 770282211 771609573 772706299 773610916 774914856 775964813 776280670
2383.9G76280670r7046N62744M17481J21612j78070n46722q7433K2583k2736K7466
$$ 776280670 776183624 776746368 777163849 777285461 777107391 776560669 776473236 776495819 776473083 776500549
2393.6G76500549L73688M9667k49557j95923k77176J60752M2724j89972l90777j10245
$$ 776500549 776874237 776923904 776674347 776478424 776201248 776362000 776404724 776214752 775823975 775713730
2403.2G75713730n9509l29285q9569j70899l2196k65197m8829O1799k73133k61001
$$ 775713730 775654221 775324936 775235367 775064468 775032272 774767075 774718246 774780045 774506912 774245911
2412.9G74245911n57633l80325k97623j7547q6670l38974j34049P3624K97775j62811
$$ 774245911 773688278 773307953 773010330 772992783 772906113 772567139 772433090 772506714 772804489 772641678
2422.5G72641678m64478o24695j30538j32676l38287q39m74854j74331j86844o6910
$$ 772641678 772177200 771552505 771421967 771289291 770951004 770950165 770475311 770300980 770114136 770047226
2432.2G70047226m02374q19321J56326j068j73416m03061j48620j52588o60477n4550
$$ 770047226 769644852 768825531 768981857 768980789 768807373 768404312 768255692 768103104 767442627 767388077
2441.8G67388077p172Q2092l63082p18842m40369j72805N6610j46485j07727m64706
$$ 767388077 767380905 767462997 767099915 766381073 765940704 765767899 765824509 765678024 765570297 765105591
2451.5G65105591m50211n28488n51071j41449Q1406K12555k85569k29034l85056j37252
$$ 765105591 764655380 764126892 763575821 763434372 763515778 763728333 763442764 763213730 762828674 762691422
2461.1G62691422q9493o50788j64871k61993j91803j60218J9761l3417p71103l59497
$$ 762691422 762601929 761951141 761786270 761524277 761332474 761172256 761192017 761158600 760387497 760028000
2470.7G60028000p401p7438l89709k98081k91138m72869j91727j47095O0120o3248
$$ 760028000 760020599 759943161 759553452 759255371 758964233 758491364 758299637 758152542 758212662 758149414
2480.4G58149414J04675k01034p85065m29001k58713Q4534M8447j93176k57874m19159
$$ 758149414 758254089 758053055 757267990 756838989 756580276 756664810 756713257 756520081 756262207 755843048
2490G55843048l26843n2490J31988k5329j45493j94626k63748m53415K1210J65176
$$ 755843048 755516205 755463715 755595703 755570374 755424881 755230255 754966507 754513092 754534302 754699478
2499.7G54699478n71899m99954j99204K0599N6687j1978k12098k73513k03400l88718
$$ 754699478 754127579 753627625 753428421 753449020 753505707 753493729 753281631 753008118 752804718 752416000
2509.3G52416000p8201r6359j15433l8605k5177k45208o08216j54648l5553m2114k68173
$$ 752416000 752337799 752241440 752126007 752087402 752062225 751817017 751208801 751054153 751018600 750976486 750708313
2519.9G50708313k55890j33667j82953L9444l71475l586k72751q73565l49961J56937
$$ 750708313 750452423 750318756 750135803 750175247 749803772 749800186 749527435 748653870 748303909 748460846
2529.6G48460846L72009m48074n05676k19574j71280k25601m67225j14059m28314m66080
$$ 748460846 748832855 748384781 747879105 747659531 747488251 747262650 746795425 746681366 746253052 745786972
2539.2G45786972l06930j8311J66855l50571l51410m21295k83737j18332j37787j95160
$$ 745786972 745480042 745461731 745628586 745278015 744926605 744505310 744221573 744103241 743965454 743770294
2548.9G43770294l66592n56870n49011r0256k24151j89286L9978j39846m17939l60107
$$ 743770294 743403702 742846832 742297821 742207565 741983414 741794128 741834106 741694260 741276321 740916214
2558.5G40916214j49460l69797n4855j04752n24139m25796j17951k53296n54657j71356
$$ 740916214 740766754 740396957 740342102 740237350 739713211 739287415 739169464 738916168 738361511 738190155
2568.1G38190155j16119p6294l55149k31399q316n50614j78756k07367k55585k82669
$$ 738190155 738074036 737997742 737642593 737411194 737402878 736852264 736673508 736466141 736210556 735927887
2577.8G35927887m99954l86963m72641p9651N3711L50189M8370n55496k75039k67945
$$ 735927887 735427933 735040970 734568329 734488678 734542389 734892578 734940948 734385452 734110413 733842468
2587.4G33842468l04260m31900k02789k45667l51639k7618j48697k64206m66156l60412
$$ 733842468 733538208 733106308 732903519 732657852 732306213 732278595 732129898 731865692 731399536 731039124
2597.1G31039124p859M39911K56806p07550r79691n88074l1509J32751R1324k84729
$$ 731039124 731031265 731471176 731727982 731020432 730040741 729452667 729421158 729553909 729645233 729360504
2606.7G29360504n61905q6593J49231l55225q99887m44260J06354j15051o28205o38733
$$ 729360504 728798599 728712006 728861237 728506012 727606125 727161865 727268219 727153168 726524963 725886230
2616.4G25886230k23541K8153k16294o45141o4850j38779n53360j77307l61862m76227
$$ 725886230 725662689 725690842 725474548 724829407 724764557 724625778 724072418 723895111 723533249 723057022
2626G23057022o46439p57675n60531k63214Q1634k53754o10504k83889k07596n62668
$$ 723057022 722410583 721652908 721092377 720829163 720910797 720657043 720046539 719762650 719555054 718992386
2635.6G18992386n55267o71387m19693l75824o35605m39987p09915m17176m28390k45209
$$ 718992386 718437119 717765732 717346039 716970215 716334610 715894623 715184708 714767532 714339142 714093933
2645.3G14093933J48163o70471n96314m37164m38080m17938n45273l55606n48325m46853
$$ 714093933 714242096 713571625 712975311 712538147 712100067 711682129 711136856 710781250 710232925 709786072
2654.9G09786072k79541l68424o52313m99115n0888r2010l17154o91910o60095m86832
$$ 709786072 709506531 709138107 708485794 707986679 707935791 707843781 707526627 706834717 706174622 705687790
2664.6G05687790m95224o67191k17514J58615l00827l77883o17066l10974m8218l91464
$$ 705687790 705192566 704525375 704307861 704466476 704165649 703787766 703170700 702859726 702811508 702420044
2674.2G02420044l01514l85132p03430o99081K0370j42517n45349m20227m48685j33438
$$ 702420044 702118530 701733398 701029968 700330887 700351257 700208740 699663391 699243164 698794479 698661041
2683.9F98661041m96139n18189j07040q9417j42822o32553q13599m49371n2490p0114
$$ 698661041 698164902 697646713 697539673 697450256 697307434 696674881 695861282 695411911 695359421 695289307
2693.5F95289307m54941p94296l17765N2567l19443m79889m97284j04522l88108q04901
$$ 695289307 694834366 694040070 693722305 693774872 693455429 692975540 692478256 692373734 691985626 691180725
2703.1F91180725l21121l6926l02048q85620r30405l41034K32697m90876q46176l96499
$$ 691180725 690859604 690822678 690520630 689635010 688704605 688363571 688596268 688105392 687259216 686862717
2712.8F86862717n15976N9280j73416p55310o65665l63006l62244n25818K96097k36969
$$ 686862717 686346741 686406021 686232605 685477295 684811630 684448624 684086380 683560562 683856659 683619690
2722.4F83619690o97174j82724k66190n41763p31506K02331j32522j134262n77775
$$ 683619690 682922516 682739792 682473602 681931839 681200333 681402664 681270142 680135880 679558105
2731.1F79558105r4833J9531j11847l36532l69644j98288l21656m78897l10211n0735
$$ 679558105 679463272 679482803 679370956 679034424 678664780 678466492 678144836 677665939 677355728 677304993
2740.8F77304993k62909p09763m66766k86942N7755J74713j95923o73904o33850R2163
$$ 677304993 677042084 676332321 675865555 675578613 675636368 675811081 675615158 674941254 674307404 674399567
2750.4F74399567j64490l44620n92956p30896p4387J3657k75116l76740j04751m54178
$$ 674399567 674235077 673890457 673297501 672566605 672492218 672505875 672230759 671854019 671749268 671295090
2760F71295090j92108K11868p9117r92o43081l59269O1570n22004o71844k35519n9433
$$ 671295090 671102982 671314850 671235733 671234741 670591660 670232391 670293961 669771957 669100113 668864594 668805161
2770.7F68805161n65339j04522P019j41983j82572q58841n29174m5243k78625n50003
$$ 668805161 668239822 668135300 668142319 668000336 667817764 666958923 666429749 666384506 666105881 665555878
2780.3F65555878k20566k97546n97458m23050n26276k47879j19781l53241l35846q7815
$$ 665555878 665335312 665037766 664440308 664017258 663490982 663243103 663123322 662770081 662434235 662346420
2789.9F62346420n53512r10416m72946o50025o04248n73272l90168m91638j027221
$$ 662346420 661792908 660882492 660409546 659759521 659155273 658582001 658191833 657700195 656672974
2798.6F56672974m16794J13373j74561q37707n95704m92706j026535r45663r56650
$$ 656672974 656256180 656369553 656194992 655357285 654761581 654268875 653242340 652296677 651340027
2807.3F51340027o40030n05981o11802o56128o97784o58493q10165r29871q93860m97818
$$ 651340027 650699997 650194016 649582214 648926086 648228302 647569809 646759644 645829773 644935913 644438095
2816.9F44438095p61871r18885r23080r60236o58187j003342p53861q51936j105423
$$ 644438095 643676224 642757339 641834259 640874023 640215836 639212494 638458633 637606697 636501274
2825.6F36501274p20291p72629j053505j422920r31892n05028p40624j276054j222610
$$ 636501274 635780983 635008354 633954849 632531929 631600037 631095009 630354385 629078331 627855721
2834.3F27855721p64008q50411n85937j285744j746940j158028j188507j575203j615562
$$ 627855721 627091713 626241302 625655365 624369621 622622681 621464653 620276146 618700943 617085381
2843F17085381j304093j528206j480827j645470j819877k125817k352180j055107j083412
$$ 617085381 615781288 614253082 612772255 611126785 609306908 607181091 604828911 603773804 602690392
2851.7F02690392j522217j300278j141357n81284p20978q39424n82733l78189j064491
$$ 602690392 601168175 599867897 598726540 598145256 597424278 596584854 596002121 595623932 594559441
2860.3E94559441j500817r66873q88481r84116j006393q98438j387596j708450j780777
$$ 594559441 593058624 592091751 591203270 590219154 589212761 588314323 586926727 585218277 583437500
2869E83437500k087097j713295j549759j659432j929168j719208j521072j970940j637917
$$ 583437500 581350403 579637108 578087349 576427917 574498749 572779541 571258469 569287529 567649612
2877.7E67649612j584167j878815j753196j909981j695290j151657j125679q80470
$$ 567649612 566065445 564186630 562433434 560523453 558828163 557676506 556550827 555670357
2885.4E55670357q29544j031151m47769k87247p62825j101685l29361M43039m5280
$$ 555670357 554840813 553809662 553361893 553074646 552311821 551210136 550880775 551323814 551278534
2894.1E51278534j49384m74662p70226r18960q28667J15700L94477j22222q69484p70951
$$ 551278534 551129150 550654488 549884262 548965302 548136635 548252335 548646812 548524590 547655106 546884155
2903.7E46884155q80279j063042l89404n31807m97055o38962j284637j187554j118393
$$ 546884155 546003876 544940834 544551430 544019623 543522568 542883606 541598969 540411415 539293022
2912.4E39293022j636200j555252j147537j837120j955643j607780j545639j243286
$$ 539293022 537656822 536101570 534954033 533116913 531161270 529553490 528007851 526764565
2920.1E26764565j220475j503677j484795o01158o71806j045571n15403k39029j64223
$$ 526764565 525544090 524040413 522555618 521954460 521282654 520237083 519721680 519482651 519318428
2928.8E19318428k83470r4414n8212L39241J164055J096763P79076R72519J615982
$$ 519318428 519034958 518940544 518882332 519221573 520385628 521482391 522261467 523233986 524849968
2937.5E24849968J770973J674690J678620J948166K293167K088966J897011J985245
$$ 524849968 526620941 528295631 529974251 531922417 534215584 536304550 538201561 540186806
2945.2E40186806K382774K328644J928024J773491J930199K124138K164535J955109
$$ 540186806 542569580 544898224 546826248 548599739 550529938 552654076 554818611 556773720
2952.9E56773720J556473K202644J996651J400947K072869K284317K273521J791382
$$ 556773720 558330193 560532837 562529488 563930435 566003304 568287621 570561142 572352524
2960.6E72352524J568222J953239J546250J081123J541901J729240J387024J238441
$$ 572352524 573920746 575873985 577420235 578501358 580043259 581772499 583159523 584397964
2968.3E84397964R31397J541557K072563J770668R64890O10809J523362J378402J175118
$$ 584397964 585329361 586870918 588943481 590714149 591679039 592289848 593813210 595191612 596366730
2977E96366730J284675J480980J377373P32689J111030Q14133Q74024J078834Q72879
$$ 596366730 597651405 599132385 600509758 601242447 602353477 603167610 604041634 605120468 605993347
2985.7F05993347J129494N32265M89997P72477O35948L90968L22571M35982M42543
$$ 605993347 607122841 607655106 608145103 608917580 609553528 609944496 610267067 610703049 611145592
2994.4F11145592O20498O85959O91109j8044l0593K02331l55110m7188N6954o0463
$$ 611145592 611766090 612452049 613143158 613125114 613094521 613296852 612941742 612894554 612951508 612891045
3004F12891045j29853k34718j32866m13208l54652J72577j69182n53475r3536o22864
$$ 612891045 612761192 612526474 612393608 611980400 611625748 611798325 611629143 611075668 610982132 610359268
3013.7F10359268q28895l29857m58679n33715n48630l46908n11742p28073o70814n75104
$$ 610359268 609530373 609200516 608741837 608208122 607659492 607312584 606800842 606072769 605401955 604826851
3023.3F04826851q14018j071244o90879q07686m20037l73306j048088j017075q29048
$$ 604826851 604012833 602941589 602250710 601443024 601022987 600649681 599601593 598584518 597755470
3032E97755470n02014n47333o91681j173706q75244n76401j465415r08242l51829o35453
$$ 597755470 597253456 596706123 596014442 594840736 593965492 593389091 591923676 591015434 590663605 590028152
3041.6E90028152j026992j099625o14662q60329j225509j108361p91015j014367j016883
$$ 590028152 589001160 587901535 587286873 586426544 585201035 584092674 583301659 582287292 581270409
3050.3E81270409p17850r40132r86824p85523o92177j264114j284141q57316q51097
$$ 581270409 580552559 579612427 578625603 577840080 577147903 575883789 574599648 573742332 572891235
3059E72891235q61625j161881j066704p15980o93054j128426o90193j74255j068345
$$ 572891235 572029610 570867729 569801025 569085045 568391991 567263565 566573372 566399117 565330772
3067.7E65330772j268920j204949j339874q84361o79894j034050j021538r59091j058311
$$ 565330772 564061852 562856903 561517029 560632668 559952774 558918724 557897186 556938095 555879784
3076.4E55879784o70014p54471p53975r04731j032257p69425j169281j210632j157341
$$ 555879784 555209770 554455299 553701324 552796593 551764336 550994911 549825630 548614998 547457657
3085E47457657n46951n11284j518059j202469q37631p77207o72073j026688j326255
$$ 547457657 546910706 546399422 544881363 543678894 542841263 542064056 541391983 540365295 539039040
3093.7E39039040j041489j105652j255302m29535m25377r86176j186599j085625j017304
$$ 539039040 537997551 536891899 535636597 535207062 534781685 533795509 532608910 531523285 530505981
3102.4E30505981j140251p83577n01098o36788r04274n73959r48258j559677r43870
$$ 530505981 529365730 528582153 528081055 527444267 526539993 525966034 525017776 523458099 522514229
3111.1E22514229j166992j180802n37185r36013j465568p29065k77023j433640j502342
$$ 522514229 521347237 520166435 519629250 518693237 517227669 516498604 516221581 514787941 513285599
3119.8E13285599n93529o75430j095009j200142q52318o29959q85277r07440o19354
$$ 513285599 512692070 512016640 510921631 509721489 508869171 508239212 507353935 506446495 505827141
3128.4E05827141r30901j476249j128197m23584j085549j397323m24462o58378j020889
$$ 505827141 504896240 503419991 502291794 501868210 500782661 499385338 498960876 498302498 497281609
3137.1D97281609q44498r27887j002503r73739q73032r25140r11293p65419n69840
$$ 497281609 496437111 495509224 494506721 493532982 492659950 491734810 490823517 490058098 489488258
3145.8D89488258q48693o71769n49469j019592j045265j315766q56094r73968j329651
$$ 489488258 488639565 487967796 487418327 486398735 485353470 484037704 483181610 482207642 480877991
3154.5D80877991p01866m87252l98369j050224j000976r33533q61702l44582r48257
$$ 480877991 480176125 479688873 479290504 478240280 477239304 476305771 475444069 475099487 474151230
3163.1D74151230r43604r49478o51321q36182j185951m38004q05511r46007q42628
$$ 474151230 473207626 472258148 471606827 470770645 469584694 469146690 468341179 467395172 466552544
3171.8D66552544o54831n74112j027909j207847j081467n65529p26242o40335n15251
$$ 466552544 465897713 465323601 464295692 463087845 462006378 461440849 460714607 460074272 459559021
3180.5D59559021n70374q01887r55505k57035o83784r00116o69365p24335o95610r11751
$$ 459559021 458988647 458186760 457231255 456974220 456290436 455390320 454720955 453996620 453301010 452389259
3190.1D52389259o70013n75676o55365q19931q29697q77418o06652m38919o61850m91523
$$ 452389259 451719246 451143570 450488205 449668274 448838577 447961159 447354507 446915588 446253738 445762215
3199.8D45762215j198960j079521m75235k92587k79427o50177o89430j160812n31807
$$ 445762215 444563255 443483734 443008499 442715912 442436485 441786308 441096878 439936066 439404259
3208.5D39404259l15438o50558o60324j028443l72161r32351j101837l89099k09122
$$ 439404259 439088821 438438263 437777939 436749496 436377335 435444984 434343147 433954048 433744926
3217.2D33744926j9874o01845n81360m88128n42031o06460m34609l37524p77436p22656
$$ 433744926 433725052 433123207 432541847 432053719 431511688 430905228 430470619 430133095 429355659 428633003
3226.8D28633003p21054j91345k76909p96127m49333m91219j009712q90579j36605
$$ 428633003 427911949 427720604 427443695 426647568 426198235 425707016 424697304 423806725 423670120
3235.5D23670120m03061m81338l09944n23606m71954l88260m94423j019211o57577
$$ 423670120 423267059 422785721 422475777 421952171 421480217 421091957 420597534 419578323 418920746
3244.2D18920746p84836m64439L45115m65622m90951m73175m41399j29890k73552n38101
$$ 418920746 418135910 417671471 418016586 417550964 417060013 416586838 416145439 416015549 415741997 415203896
3253.8D15203896r13239k93541l21083p58133l71780n12734q38012m10996k19574k73132
$$ 415203896 414290657 413997116 413676033 412917900 412546120 412033386 411195374 410784378 410564804 410291672
3263.4D10291672j91002p58324m10919L9635m87938m44145j1597j46561q31375r27925
$$ 410291672 410100670 409342346 408931427 408971062 408483124 408038979 408027382 407880821 407049446 406121521
3273.1D06121521p69806K11907O69441n67055o12335j34049m38842n64614m63257q23021
$$ 406121521 405351715 405563622 406233063 405666008 405053673 404919624 404480782 403916168 403452911 402629890
3282.7D02629890m89044J08986l75404j25580m2343q14743o54259O4888k34375k92549
$$ 402629890 402140846 402249832 401874428 401748848 401706505 400891762 400237503 400302391 400068016 399775467
3292.4C99775467j94855p88917j08033J31188j75285o72303j158676k95296j2207k0904
$$ 399775467 399580612 398791695 398683662 398814850 398639565 397967262 396808586 396513290 396501083 396480179
3302C96480179m18244m93965r1591k97508j53427l63770o25572o57386m74663l86009
$$ 396480179 396061935 395567970 395476379 395178871 395025444 394661674 394036102 393378716 392904053 392518044
3311.7C92518044l30811k59628m16565n47600q02803k83241l72773j91574m4059p36618
$$ 392518044 392187233 391927605 391511040 390963440 390160637 389877396 389504623 389313049 389268990 388532372
3321.3C88532372m74205o82488l26996m32739l82576N5694p58934l82652o59065n62515
$$ 388532372 388058167 387375679 387048683 386615944 386233368 386289062 385530128 385147476 384488411 383925896
3330.9C83925896m2878m56390o18667q93784j56822M0703k39411o81457r41849j8997
$$ 383925896 383883018 383426628 382807961 381914177 381757355 381798058 381558647 380877190 379935341 379916344
3340.6C79916344j34850n65224l74603o17370j168595o43921P7782k1553k14272n29747
$$ 379916344 379781494 379216270 378841667 378224297 377055702 376411781 376489563 376468010 376253738 375723991
3350.2C75723991n39779p90139o75048j87111n84030j028214k32277L46565o90345
$$ 375723991 375184212 374394073 373719025 373531914 372947884 371919670 371687393 372033958 371343613
3358.9C71343613r30672l63579j51138n67398o96907r7161l20167n37911q68721o82754
$$ 371343613 370412941 370049362 369898224 369330826 368633919 368536758 368216591 367678680 366809959 366127205
3368.6C66127205l94402n79300k63824m57306l83873l75404k70386l25356n93452k9564
$$ 366127205 365732803 365153503 364889679 364432373 364048500 363673096 363402710 363077354 362483902 362454338
3378.2C62454338k33803k47040j75209m91485j95275J10398l8948n97115p51953l74374
$$ 362454338 362220535 361973495 361798286 361306801 361111526 361221924 361182976 360585861 359833908 359459534
3387.8C59459534m6501n52636n47332O1073n26276n85403M36249M61845o81496q11805
$$ 359459534 359413033 358860397 358313065 358374138 357847862 357262459 357698708 358160553 357479057 356667252
3397.5C56667252r0447k86980l00865J47133j99432n32761r9983p3738J70898M8981
$$ 356667252 356576805 356289825 355988960 356136093 355936661 355403900 355303917 355230179 355401077 355450058
3407.1C55450058o01501l78304p2899m3907m68521l03192L64647K20108m36135m52041
$$ 355450058 354848557 354470253 354397354 354353447 353884926 353581734 353946381 354166489 353730354 353278313
3416.8C53278313K37808L57323M74243l06168o60896j73493o27899K1248M21143K00042
$$ 353278313 353516121 353873444 354347687 354041519 353380623 353207130 352579231 352600479 353021622 353221664
3426.4C53221664K2545j81045L70483M22287Q7395o5842j08299N7335K27890j69640
$$ 353221664 353244209 353063164 353433647 353855934 353943329 353877487 353769188 353826523 354054413 353884773
3436.1C53884773j00326M28161P6866m58526K12784J157646k34451l80822M35181K57416
$$ 353884773 353784447 354212608 354289474 353830948 354043732 355201378 354966927 354586105 355021286 355278702
3445.7C55278702O15425n61180J03493O57081J26991R04313O83784L81584J13182K76833
$$ 355278702 355894127 355332947 355436440 356093521 356220512 357124825 357808609 358190193 358303375 358580208
3455.3C58580208Q9683O4431P25212L51181M78744L34854J75515o8207K79808P30095
$$ 358580208 358669891 358734322 359459534 359810715 360289459 360624313 360799828 360731621 361011429 361741524
3465C61741524K8648N30396O96296N50957M25835J93214M74472N28488P77092L95775
$$ 361741524 361770172 362300568 362996864 363547821 363973656 364166870 364641342 365169830 365946922 366342697
3474.6C66342697n7258K68440J017875Q08487p8964L9444O51093P52563K43149N45387
$$ 366342697 366285439 366553879 367571754 368380241 368301277 368340721 368991814 369744377 369987526 370532913
3484.3C70532913L94287N90630P78503n03578o0310J153068J105156L17116N92957
$$ 370532913 370927200 371517830 372296333 371792755 371732445 372885513 373990669 374307785 374900742
3493C74900742P21092L01094O64024j64070K7351J208535J016464N66597J224823Q46786
$$ 374900742 375621834 375922928 376586952 376422882 376450233 377658768 378675232 379241829 380466652 381313438
3502.6C81313438o50177K39182Q51059Q63037O28128P85103K99988o24924P65991J026383
$$ 381313438 380663261 380902443 381753502 382616539 383244667 384029770 384329758 383704834 384470825 385497208
3512.2C85497208R27467L86009M42391R95865N83152J156273P54280K74277N69153
$$ 385497208 386424675 386810684 387253075 388248940 388832092 389988365 390742645 391016922 391586075
3520.9C91586075J291466K63977j371079O82984J906242J833649L47671O3210R3994
$$ 391586075 392877541 393141518 391770439 392453423 394359665 396193314 396540985 396604195 396698189
3529.6C96698189K47650J002693P40624J306381J34773J042633J052551j42822K094231
$$ 396698189 396945839 397948532 398689156 399995537 400130310 401172943 402225494 402082672 404176903
3538.3D04176903Q52852L77884M25529Q71162J460305K35672N71365M65012R04197
$$ 404176903 405029755 405407639 405833168 406704330 408164635 408400307 408971672 409436684 410340881
3547D10340881N722J128769J466637J436005J873779j576386O85692J783448J893196
$$ 410340881 410346603 411475372 412942009 414378014 416251793 414675407 415361099 417144547 419037743
3555.6D19037743J745071l6125J474304O82182M51737Q73680K542076R50317m36325
$$ 419037743 420782814 420746689 422220993 422903175 423354912 424228592 426770668 427720985 427284660
3564.3D27284660M462357n99403k041092L69796N48554M603920K084617J454697J756325
$$ 427284660 431747017 431147614 429106522 429476318 430024872 434628792 436713409 438168106 439924431
3573D39924431J514625R18694J060486K040596N66635K036171R69505Q92258K419433
$$ 439924431 441439056 442357750 443418236 445458832 446025467 448061638 449031143 449923401 452342834
3581.7D52342834J772690J598893J207771M135284Q55408l242912R98382P36885L941613
$$ 452342834 454115524 455714417 456922188 461057472 461912880 458669968 459668350 460405235 464346848
3590.4D64346848L268661K668076J69258O37970M010162r72862K559204K818298J83487
$$ 464346848 467615509 470283585 470452843 471090813 475100975 474128113 476687317 479505615 479689102
3599D79689102L026009N66711J596489K922058J276589J672783M122657K682801k776032
$$ 479689102 482715111 483281822 484878311 487800369 489076958 490749741 494872398 497555199 494779167
3607.7D94779167K896919n80864J080628Q159637q76236k087783M135971o70929M931373
$$ 494779167 497676086 497095222 498175850 506335487 505459251 503371468 507507439 506836510 511767883
3616.4E11767883N028916r28498n66177p34978K698822L803444K861290K648888K527962
$$ 511767883 516796799 515868301 515302124 514567146 517265968 521069412 523930702 526579590 529107552
3625.1E29107552P81326J090622O480331l102722j0624313P478523O839294O006813
$$ 529107552 529888878 530979500 537459831 534357109 523732796 531211319 538050613 544057426
3632.8E44057426L2654k006683L718338L292770J528588M65774J680641K183953K597122
$$ 544057426 544090080 542083397 545801735 549094505 550623093 551088867 552769508 554953461 557550583
3641.5E57550583J151543N97343L620796M192887M450225l685226l894348M621887
$$ 557550583 558702126 559299469 562920265 567113152 571563377 567878151 563983803 568605690
3649.2E68605690k774162l113823K701454P848549N205879M138184L291053r718742
$$ 568605690 565831528 562717705 565419159 573267708 578473587 582611771 585902824 576184082
3656.9E76184082L163948O038246J751747J889344O82869J755600P55500J625595J463852
$$ 576184082 579348030 585386276 587138023 589027367 589710236 591465836 592221336 593846931 595310783
3665.6E95310783J000138N482483J249313l947868j402436n837516N299644J0362167
$$ 595310783 596310921 601793404 603042717 599094849 597692413 591854897 597154541 607516708
3673.3F07516708Q363839q142014j8621483Q646813R559249M455910l097267J131058
$$ 607516708 615880547 607738533 589117050 597763863 607323112 611779022 608681755 609812813
3681F09812813L772125K139931J935005o1760J15051M560814N457382j2406234j869393
$$ 609812813 613584938 615724869 617659874 617598114 617713165 622273979 627731361 615325127 613455734
3689.7F13455734R719696p035103J939431P257042P16438J726532P45354k80037J223831
$$ 613455734 623175430 616140327 618079758 625336800 626053238 627779770 628525124 628245087 629468918
3698.4F29468918P70111K852898K441444p124558j645584N954819J551323K43683M84924
$$ 629468918 630239029 633091927 635533371 628408813 626763229 632718048 634269371 634513054 634997978
3707F34997978L447724M019813r168663M230957K165795j3583489P607689N711632
$$ 634997978 638445702 642465515 633296852 637527809 639693604 626110115 633717804 639429436
3714.8F39429436K87246N76592K797699J203079l645782K195129O013031o023331l821373
$$ 639429436 639716682 640293274 643090973 644294052 640648270 642843399 648856430 642833099 639011726
3723.4F39011726O817131J1902j866684l179702K642059N742264P34787N655365n543671
$$ 639011726 645828857 645840759 643974075 640794373 643436432 649178696 649913483 655568848 650025177
3732.1F50025177p211990J1621704j678772j2401200J358109L900604J804810L968506
$$ 650025177 642813187 654434891 652756119 640354919 641713028 645613632 647418442 651386948
3739.8F51386948L308410m050140N505905J3365479j8955384j5549888J4259147O922455
$$ 651386948 654695358 650645218 656151123 669516602 650561218 635011330 649270477 656192932
3747.5F56192932O653824o137619j0797958J3435745p962265n502091Q096314N704040
$$ 656192932 662846756 656709137 645911179 659346924 651384659 645882568 653978882 659682922
3755.3F59682922K974320n615235L687745M338760j0841751L43094O405639J164551
$$ 659682922 662657242 657042007 660729752 665068512 654226761 654569855 660975494 662140045
3763F62140045N55115M063187m865571l553924N060043M787522q52509r937591K962875
$$ 662140045 662695160 666758347 661892776 658338852 663398895 668186417 667333908 657396317 660359192
3771.7F60359192L353271N01175J525498J9455J482544O39877L231277j503982r247513
$$ 660359192 663712463 664213638 665739136 665758591 667241135 667881012 671112289 669608307 660360794
3780.3F60360794M326096L312683J275406J331176l849334k05002J422119J195450
$$ 660360794 664686890 667999573 669274979 670606155 666756821 666551819 667973938 669169388
3788F69169388J359253Q8119L30963m67681m883l03879J859894L541412n686340l367996
$$ 669169388 670528641 670616760 670947723 670480042 670475159 670171280 672031174 675572586 669886246 666518250
3797.7F66518250M006271M742966N721817j0128785j1782531N670089N121079O709213
$$ 666518250 670524521 675267487 680989304 670860519 659077988 664748077 669869156 676578369
3805.4F76578369M769058j3415832k439423O950379K328262J38855N12543N35812K207413
$$ 676578369 681347427 667931595 665492172 672442551 674770813 674909668 675422211 675958023 678165436
3814.1F78165436N489349n433197j4746017P842102P375717N158615k403793k2277222
$$ 678165436 683654785 678221588 663475571 671317673 678693390 683852005 681448212 659170990
3821.8F59170990O271896Q038559L173752L153610j025772m893951J548309L363037
$$ 659170990 665442886 673481445 676655197 679808807 678783035 673889084 675437393 678800430
3829.5F78800430M502030l62854j1951371N229187Q591691q179780N47638R472809
$$ 678800430 683302460 682939606 670988235 676217422 684809113 676629333 677176971 686649780
3837.2F86649780j0885772l229371Q132477p874374K458420Q497390n007171l776016
$$ 686649780 675764008 672534637 680667114 672792740 675251160 683748550 678741379 674965363
3844.9F74965363M112472J803360Q32977J965866j850433L355713O433792j0305023
$$ 674965363 679077835 680881195 681714172 683680038 681829605 685185318 691619110 681314087
3852.7F81314087j431198j8407288O559906J3562546j415329p28912L294525K403412
$$ 681314087 679882889 661475601 668035507 681598053 680182724 679453812 682748337 685151749
3860.4F85151749J664657p247238K401810Q546066j0494537n668183O927262O996841
$$ 685151749 686816406 679569168 681970978 690517044 680022507 674354324 681281586 688278427
3868.1F88278427N376969j4547120q740387Q185654Q896790J430893j3466187L817291
$$ 688278427 693655396 679108276 670367889 678553543 687450333 688881226 675415039 679232330
3875.8F79232330N637513L13034L084335M269791r578171p545700R143600K447052
$$ 679232330 684869843 685182877 688267212 692537003 682958832 675413132 684556732 687003784
3883.5F87003784K673721M760590j6377182K284927N266877J509247M299316l994217
$$ 687003784 689677505 694438095 678060913 680345840 685612717 687121964 691421280 687427063
3891.2F87427063r792862M581375M667511j929474J996765J760331K759857K80151
$$ 687427063 677634201 682215576 686883087 684953613 686950378 688710709 691470566 691750717
3898.9F91750717j1626129P241287J294632o047592N337906n436020j265793J950913
$$ 691750717 680124588 687365875 688660507 682612915 687950821 682514801 681249008 683199921
3906.7F83199921K286605K958298k49405M32740m10996o6299J0299l75976J580581
$$ 683199921 685486526 688444824 688195419 688628159 688217163 688150864 688161163 687785187 689365768
3915.3F89365768J594391m239425k584153N476304j013794l411408L960953J814194
$$ 689365768 690960159 686720734 684136581 689612885 688599091 685187683 689148636 690962830
3923.1F90962830M23050m000245l455734K963486K321701J124344j469574J74255J784897
$$ 690962830 691385880 687385635 683929901 686893387 689215088 690339432 688869858 689044113 690829010
3931.7F90829010l694000p23496K068100j01547Q76236J153336m00544n27115k06451
$$ 690829010 687135010 686411514 688479614 688378067 689254303 690407639 690007095 689479980 689273529
3940.4F89273529K438965M02679n847931Q10013K221833J426162J428070k996826R97315
$$ 689273529 691712494 692115173 686267242 687077255 689299088 690725250 692153320 689156494 690153809
3949.1F90153809p26319k241058L087540L60107p86133k36740K09045L37067l49274
$$ 690153809 689427490 687186432 690273972 690634079 689847946 689611206 689820251 690157318 689808044
3957.8F89808044P26395k01721J134491L20282k049103R8953N07584M69360J85395
$$ 689808044 690534439 690332718 691467209 691787491 689738388 689837341 690344925 690814285 690999680
3966.5F90999680k42920N25512N2491m26484M51737k88239p51114M90189L20053k01187
$$ 690999680 690756760 691282272 691334763 690908279 691360016 691071777 690320663 690810852 691130905 690929718
3976.1F90929718l32642L26615K94113k79923j70669r9869K86484k4643J92261k13776
$$ 690929718 690597076 690923691 691217804 690937881 690767212 690667343 690953827 690929184 691121445 690907669
3985.7F90907669l48968K42919M7760N56031j90659J77613Q17031K60697M3945r42612
$$ 690907669 690558701 690801620 690849380 691405411 691214752 691392365 692209396 692470093 692514038 691571426
3995.4F91571426m65545K89764J68762o41403j58386
$$ 691571426 691105881 691395645 691564407 690923004 690764618
4000.2F90764618
$$ 690764618
##END=$$ End of the data block
