##TITLE=$$ Begin of the data block
##JCAMP-DX=5.00 $$ ACD/SpecManager v 10.08
##SPECTROMETER/DATA SYSTEM=Varian
##DATE=20 Nov 2012 13:41:52
##DATA TYPE=INFRARED SPECTRUM
##DATA CLASS=XYDATA
##ORIGIN=
##OWNER=
##NPOINTS=3735
##FIRSTX=399.26403809
##LASTX=4000.35498047
##MAXX=4000.35498047
##MINX=399.26403809
##MAXY=78.66941071
##MINY=30.91969490
##XFACTOR=1.0000000000
##YFACTOR=0.000000100000000
##FIRSTY=59.01411438
##DELTAX=0.96440572
##XUNITS=1/CM
##YUNITS=TRANSMITTANCE
##XYDATA=(X++(Y..Y))
399.3E90141144j890640o72379N97458p318688n154914K580947M769783o810417o777649
$$ 590141144 588250504 587578125 588175583 580856895 575701981 578282928 583052711 576242294 569464645
407.9E69464645p04193l00407J809654M031525K933616P75109K130241o99577R85946
$$ 569464645 568760452 568460045 570269699 574301224 577234840 578009949 580140190 579440613 580426559
416.6E80426559Q094902O91224k2469864o42319M270630l346977M096794R140129J051292
$$ 580426559 588521461 589212685 566742821 566100502 570371132 567024155 571120949 580261078 581312370
425.3E81312370m811401q253098k599868N882873L299370p688408m565887K382507
$$ 581312370 576500969 568247871 565648003 571530876 574830246 567141838 562575951 564958458
433E64958458m324799n54809M101028j826248l064957j260223p38144k001419M9286
$$ 564958458 560633659 560078850 564179878 562353630 559288673 558028450 557290306 555288887 555338173
441.7E55338173L980675O686821M813842j365089K766190M933052j807404P0534J943779
$$ 555338173 559318848 566005669 570819511 569454422 572220612 577153664 575346260 575416794 577360573
450.4E77360573k428665k349816l24783J139832O251945K917061q511734l632126R756012
$$ 577360573 574931908 572582092 572257309 573397141 579649086 582566147 574054413 570422287 580178299
459.1E80178299J208954m195404n18189k069053l484726m38843n6610j334992j595268
$$ 580178299 581387253 577191849 576673660 574604607 571119881 570681038 570624428 569289436 567694168
467.7E67694168M19808j791459l691444k607079k089309J542549J300239J252366l254090
$$ 567694168 568113976 566322517 562631073 560023994 557934685 559477234 560777473 562029839 558775749
476.4E58775749n962143K071839P12852k521667m68789m70657r46274k022209M227448
$$ 558775749 552813606 554885445 555598297 553076630 552607841 552137184 551190910 549168701 553396149
485.1E53396149L985786P42531j162109k127190J399841M48532J704140o28700l247414
$$ 553396149 557381935 558124466 556962357 554835167 556235008 556683540 558387680 557758980 554511566
493.8E54511566o6261l99170r05647k150269n87730l05214j680069n009308n940056
$$ 554511566 554445305 554046135 553140488 550990219 550402489 550097275 548417206 543407898 537467842
502.5E37467842K599411l07007J241265K341537l033981j843148j384582o60782o790
$$ 537467842 540067253 539760246 541001511 543343048 540309067 538465919 537081337 536420555 536413765
511.1E36413765j490479m494819l398285j981697j120796K200355j856842l698311
$$ 536413765 534923286 530428467 527030182 525048485 523927689 526128044 524271202 520572891
518.9E20572891m159050k822456j236611J232148K457618l613853l080635O57997J525002
$$ 520572891 516413841 513591385 512354774 513586922 516044540 512430687 509350052 510008049 511533051
527.5E11533051O45523j45035P81708n3711j288910k079544J895866K521439J396255
$$ 511533051 512178574 512033539 512815247 512761536 511472626 509393082 511288948 513810387 515206642
536.2E15206642K317619R75190K547683L847428K611656P70302K217750K832260J065789
$$ 515206642 517524261 518499451 521047134 524894562 527506218 528276520 530494270 533326530 534392319
544.9E34392319J99394k030067K11639J893959l34663q43964o06194r95941q35647
$$ 534392319 534591713 532561646 532773285 534667244 534332581 533488617 532882423 531886482 531050835
553.6E31050835K213516R42230l722839l801575q46214K33764j978798k370147k119065
$$ 531050835 533264351 534206581 530483742 526682167 525835953 526069717 524090919 521720772 519601707
562.3E19601707k787551l577271k582664j833649k322998k278061l456383k260322
$$ 519601707 516814156 513236885 510654221 508820572 506497574 504219513 500763130 498502808
570D98502808k630730j933823q65059k254829k537498j420365K840576J932717J988220
$$ 498502808 495872078 493938255 493073196 490818367 488280869 486860504 489701080 491633797 493622017
578.6D93622017J634598L72924K606621M035301M203187K449340L925705K783165K008667
$$ 493622017 495256615 495629539 498236160 502271461 506474648 508923988 512849693 515632858 517641525
587.3E17641525L365708J624031P28264P26699K334786J446113K97127l63273k01455
$$ 517641525 521007233 522631264 523359528 524086227 526421013 527867126 528164253 527800980 527599525
596E27599525J253968N28984Q42132j277351j966705j97220L4752J319847m09775j199074
$$ 527599525 528853493 529382477 530224609 528947258 526980553 526783333 526818085 528137932 527728157 526529083
605.6E26529083k55584l95089K41738R38224J010514O71043K53144O76307J437340
$$ 526529083 526273499 525878410 526120148 527058372 528068886 528739929 528993073 529669380 531106720
614.3E31106720M06151P87926M78897J07421K219048K486916K298927K080192J750260
$$ 531106720 531512871 532300797 532779694 532887115 535106163 537593079 539892006 541972198 543722458
623E43722458J027260J685714K028885J239472R45740r1973J510048K537804J636276
$$ 543722458 544749718 546435432 548464317 549703789 550649529 550557556 552067604 554605408 556241684
631.7E56241684P47490R36127J586914O81915J200790O54793O36521Q03146l61405
$$ 556241684 556989174 557925301 559512215 560194130 561394920 562049713 562686234 563489380 563127975
640.4E63127975j94320p91207m88548J2322M39376P97997J032486J418266M49791K16332
$$ 563127975 562933655 562142448 561653900 561666222 562105598 562903595 563936081 565354347 565804138 566020470
650E66020470m86031K31514Q90389k06681M1542J436806K000847j099472n29404K460632
$$ 566020470 565534439 565765953 566656342 566449661 566491203 567928009 569928856 568829384 568299980 570760612
659.7E70760612P57981L91159J761398Q31452k59285M50859O61506k565231j2002144
$$ 570760612 571518593 571909752 573671150 574502602 574243317 574694176 575355682 572790451 560788307
668.3E60788307O892052N879974J026955L94974J172599K510910J351700r26895R06983
$$ 560788307 567680359 573560333 574587288 574982262 576154861 578665771 580017471 579090576 579997559
677E79997559O52046L47290R49707J15852L21312R37386N69191L08342J490478J034241
$$ 579997559 580649605 580996895 581946602 582062454 582383766 583321152 583890343 584198685 585689163 586723404
686.7E86723404K63710L5095K0294M61274n33219j74713Q6784o40335q88138l92951
$$ 586723404 586987114 587022209 587042503 587503777 586970558 586795845 586882629 586242294 585354156 584961205
696.3E84961205K74620m34990j84250j228638k212295j719780k206688q81844k55241
$$ 584961205 585235825 584800835 584616585 583387947 581175652 579455872 577249184 576367340 576112099
705E76112099r09767m70887K67487L27110j76506K71530O19965M45366J040649J863594
$$ 576112099 575202332 574731445 574998932 575326042 575149536 575421066 576041031 576486397 577527046 579390640
714.6E79390640J902733J882210J649856J617051K093620J782837L163414M044800
$$ 579390640 581293373 583175583 584825439 586442490 588536110 590318947 593482361 597527161
722.3E97527161K425193K030716R08127J674919L949204K679672K101288J121826R06830
$$ 597527161 599952354 601983070 602891197 604566116 608515320 611194992 613296280 614418106 615324936
731F15324936K275009K286949J835175P40967Q56094N63393P40356P13654M56085K126465
$$ 615324936 617599945 619886894 621722069 622463036 623319130 623882523 624622879 625336533 625792618 627919083
740.7F27919083J001396k43149l66592k26250l47672j978759j261483n28869j288796
$$ 627919083 628920479 628677330 628310738 628084488 627736816 625758057 624496574 623967705 622678909
749.3F22678909k169227k256623q04596j463089k563781j902848j995697k244110j567077
$$ 622678909 620509682 618253059 617448463 615985374 613421593 611518745 609523048 607278938 605711861
758F05711861q42743j246834j671104j644936k084694j831932k43225N78842N51147
$$ 605711861 604869118 603622284 601951180 600306244 598221550 596389618 596146393 596725235 597276382
766.7E97276382J729546K164764K292557K504921K297783K563896K186966K653389
$$ 597276382 599005928 601170692 603463249 605968170 608265953 610829849 613016815 615670204
774.4F15670204L838158L952865L489075L612061M504470M072953K482605K319412
$$ 615670204 619508362 623461227 626950302 630562363 635066833 639139786 641622391 643941803
782.1F43941803K471466K153168J563720P86515R80224J866150K424698J857529K129822
$$ 643941803 646413269 648566437 650130157 650916672 651896896 653763046 656187744 658045273 660175095
790.8F60175095J700515O19126J409301J765290J773758J322250J707687J790390J229935
$$ 660175095 661875610 662494736 663904037 665669327 667443085 668765335 670473022 672263412 673493347
799.5F73493347J214905N16434J569824J482544J004791K169952J970292R74807R32999
$$ 673493347 674708252 675224686 676794510 678277054 679281845 681451797 683422089 684396896 685329895
808.2F85329895J173096O1722j48468m12980Q6289O15387L74069J304321Q27637P15256
$$ 685329895 686502991 686564713 686416245 686003265 686089554 686704941 687079010 688383331 689210968 689926224
817.8F89926224L82995k11944o31867j110458l82080j57013j227799k195358m61502
$$ 689926224 690309219 690097275 689465408 688354950 687972870 687815857 686588058 684392700 683931198
826.5F83931198j299896k792206j649475j143799n89599j937867k652588k725830k252731
$$ 683931198 682631302 679839096 678189621 677045822 676456223 674518356 671865768 669139938 666887207
835.2F66887207j686554k249985j868896k136460j082611j176376k341537j373063
$$ 666887207 665200653 662950668 661081772 658945312 657862701 656686325 654344788 652971725
842.9F52971725p79113j195450k556152j936112q64410j461487j265488j115722j420746
$$ 652971725 652192612 650997162 648441010 646504898 645640488 644179001 642913513 641797791 640377045
851.6F40377045j593476k016792j566696j349182k536507j863060j575317k302361
$$ 640377045 638783569 636766777 635200081 633850899 631314392 629451332 627876015 625573654
859.3F25573654j243934l42560K98500J290626L080712M077949L311157L877068M372101
$$ 625573654 624329720 623987160 624285660 625576286 628656998 632734947 636046104 639923172 644295273
868F44295273M128876M784851M978866M437180M721451M024581K612229L220367K802506
$$ 644295273 648424149 653209000 658187866 662625046 667346497 671371078 673983307 677203674 680006180
876.7F80006180K360077R46121n31387m03519j068878j601334k396393j534576j839371
$$ 680006180 682366257 683312378 682780991 682377472 681308594 679707260 677310867 675776291 673936920
885.3F73936920k557907k171020k743302k638779k738342j919479j334381k291184
$$ 673936920 671379013 669207993 666464691 663825912 661087570 659168091 657833710 655542526
893F55542526l217392k518387j802368k226562k150269k238159j205215q66738j281318
$$ 655542526 652325134 649806747 648004379 645777817 643627548 641389389 640184174 639317436 638036118
901.7F38036118j678162k608490k716827l448639l243714k952614l536453l294563
$$ 638036118 636357956 633749466 631032639 627584000 624340286 621387672 617851219 614556656
909.4F14556656k793427l013267l678093m184914m943771m487763l647079l768539
$$ 614556656 611763229 608749962 605071869 600886955 595943184 591455421 587808342 584039803
917.2E84039803m272767m278411l433114k883262l169213k543182j078491p56073k76566
$$ 584039803 579767036 575488625 572055511 569172249 566003036 563459854 562381363 561625290 561348724
925.8E61348724J38970J39656j83640o11190K61726Q48617K32888N65910J760864J811486
$$ 561348724 561487694 561627350 561443710 560832520 561094246 561942863 562175751 562741661 564502525 566314011
935.5E66314011J631965J851959J497384Q68148J262474K149926K330055K577705K260018
$$ 566314011 567945976 569797935 571295319 572163467 573425941 575575867 577905922 580483627 582743645
944.2E82743645P02972m14543r53941j644707j744156k716255m558411m734840m193230
$$ 582743645 583446617 583032074 582078133 580433426 578689270 575973015 571414604 566679764 562486534
952.8E62486534m482803n288468o257515n613060n490303o730613p009850p077560
$$ 562486534 558003731 552715263 546457748 540844688 535354385 528623772 521613922 514536362
960.6E14536362p000504o900329o969185q493424q194580p152672p970733q059960
$$ 514536362 507535858 500635529 493666344 485172920 476978340 469825668 461854935 453794975
968.3D53794975q569259q036385q294678q574981r018517r021835q081360q757362
$$ 453794975 445225716 437189331 428894653 420319672 411301155 402279320 394197960 385440598
976C85440598q274956q526573p122841o806717o550179n868759o370201m580727m478759
$$ 385440598 377165642 368639069 361516228 354709511 348159332 342290573 335920372 331339645 326860886
984.7C26860886k806816l546715l225498j785374k289429j073761j627788j14689q70495
$$ 326860886 324054070 320507355 317281857 315496483 313207054 312133293 310505505 310390816 309520321
993.3C09520321l23372M32892K79999J179599m62246M93756l79963J025028J387882
$$ 309520321 309196949 309629841 309909840 311089439 310627193 311120949 310740986 311766014 313153896
1002C13153896R3155J50357m66328R05895q61893N35756J74160p22523J73817n69535
$$ 313153896 313247051 313397408 312931080 313836975 312975082 313510838 313684998 312962475 313136292 312566757
1011.7C12566757M59652j348247N951q1654O0291N17273n22690J348305J001396J733132
$$ 312566757 313026409 311678162 311684113 311602459 311662750 312180023 311657333 313005638 314007034 315740166
1021.3C15740166K51064J211758J763668Q57410J787567P20673J735573Q18710K376556
$$ 315740166 315991230 317202988 318966656 319824066 321611633 322332306 324067879 324886589 327263145
1030C27263145K134896J468544K073898Q75130K128067M48189J305351N95779r0294
$$ 327263145 329398041 330866585 332940483 333815613 335943680 336391869 337697220 338292999 338202705
1038.7C38202705K03019r4223J184043r06028O60095l6469J27755N01365n16929J190261
$$ 338202705 338405724 338311501 339495544 338589516 339249611 339213142 339340897 339842262 339325333 340515594
1048.3C40515594O27556K104683O80962J542663K483025K009010K788658J849099K876968
$$ 340515594 341143150 343247833 343928795 345471458 347954483 349963493 352752151 354601250 357478218
1057C57478218K472725M249268L311843L445931M939728M604454N512695M227638N155411
$$ 357478218 359950943 364200211 367512054 370957985 375897713 380502167 386014862 390242500 395397911
1065.7C95397911L047905K520981J401520j133080j058197m363060n140304o199341
$$ 395397911 398445816 400966797 402368317 401235237 400177040 395813980 390673676 384474335
1073.4C84474335n079079m064331l318672k110062l030090Q1940m63601P70607J218872
$$ 384474335 379395256 375330925 372012253 369902191 366872101 366954041 366490440 367261047 368479919
1082.1C68479919Q98743J317558J086121K920380J269264K998237K784958K832909
$$ 368479919 369378662 370696220 371782341 374702721 375971985 378970222 381755180 384588089
1089.8C84588089K427711J552239L329048J758919L142509K182999K632904K131195
$$ 384588089 387015800 388568039 391897087 393656006 396798515 398981514 401614418 403745613
1097.5D03745613R40018K368202N34897J298790j53198m96178L4523O25572N31960
$$ 403745613 404685631 407053833 407588730 408887520 408734322 408238144 408272667 408898239 409430199
1106.2D09430199n63012J579400O82792K483406K246552J891441K603722J324615K475205
$$ 409430199 408867187 410446587 411129379 413612785 415859337 417750778 420354500 421679115 424154320
1114.9D24154320J194725J861954J240997R29069J259194O99348R74350J15204K140694
$$ 424154320 425349045 427210999 428451996 429381065 430640259 431339607 432313957 432429161 434569855
1123.5D34569855J178665J044121Q62770J22146J628228J654052L141480K171516K155304
$$ 434569855 435748520 436792641 437655411 437777557 439405785 441059837 444201317 446372833 448528137
1132.2D48528137J987992J481399J196480l22304K90833q49076j308059k416649k715302
$$ 448528137 450516129 451997528 453194008 452871704 453162537 452313461 451005402 448588753 445873451
1140.9D45873451k895050l547897k350464l885498l488083l783913l457565l061180
$$ 445873451 442978401 439430504 437080040 433194542 429706459 425922546 422464981 419403801
1148.6D19403801l141136j736946k098313j140709k318191j208534j021996j171951
$$ 419403801 416262665 414525719 412427406 411286697 408968506 407759972 406737976 405566025
1156.3D05566025L34358k34413J106949J77536J354179J624756J851463K732201K124443
$$ 405566025 405900383 405665970 406772919 406950455 408304634 409929390 411780853 414513054 416637497
1165D16637497L573990L142929M362144M068680M539948N445556N091629N830002N305824
$$ 416637497 420211487 423354416 427716560 431785240 436325188 441770744 446862373 452692375 457998199
1173.7D57998199O443444O327972O288796N788383N699196O316528N961647O762276
$$ 457998199 464441643 470769615 477058411 482846794 488545990 494862518 500824165 507586441
1181.4E07586441O050835N135345M729805N678291N308648L661003L756675L317986
$$ 507586441 513637276 518772621 523502426 529180717 534489365 538150368 541907043 545225029
1189.1E45225029L205070L236123L113403K596321K001152J435928J200638J248245
$$ 545225029 548430099 551666222 554779625 557375946 559377098 560813026 562013664 563261909
1196.8E63261909M43001P12662N82047Q1481L56598M35601N01213N35202J345024J192779
$$ 563261909 563704910 564417572 564999619 565081100 565437698 565873299 566374512 566909714 568254738 569447517
1206.5E69447517J165047J669006J636353J700935J223450J702004K340812K162171
$$ 569447517 570612564 572281570 573917923 575618858 576842308 578544312 580885124 583047295
1214.2E83047295J740379J979752K360839J682701J419678J424599J242180Q60061
$$ 583047295 584787674 586767426 589128265 590810966 592230644 593655243 594897423 595757484
1221.9E95757484K54021J61476p0801n16052n30967p21703r47151n68199j01090n74036
$$ 595757484 596011505 596172981 596102180 595586128 595055161 594333458 593386307 592818108 592717018 592142982
1231.5E92142982j065483j026191p40357k35786n70870j063919o35032l14904n09376
$$ 592142982 591077499 590051308 589310951 589075165 588504295 587440376 586805344 586490440 585981064
1240.2E85981064n05448k77481o4392J41907L08266j71166j47896R04236J062775Q80279
$$ 585981064 585475616 585198135 585133743 585275650 585583916 585412750 585264854 586169090 587231865 588112144
1249.9E88112144P40662N27382O11916Q66546Q86383O92787R21708P39135M65927L68844
$$ 588112144 588852806 589380188 589992104 590858650 591745033 592437820 593359528 594098663 594564590 594933434
1259.5E94933434k633K23809M80766O43692O33354K13089M98200Q92562J007844R83390
$$ 594933434 594930801 595154610 595635376 596279068 596912422 597125511 597623711 598516273 599524117 600507507
1269.2F00507507Q83217Q16651K47078N18569P26891L76396N53856K65999N8365l94058
$$ 600507507 601390724 602207375 602454453 602973022 603699913 604076309 604630165 604896164 604954529 604560471
1278.8F04560471k69776P6218l81165l51066m19808l69682m39339l41606k79198n83267
$$ 604560471 604290695 604366913 603985748 603634682 603214874 602845192 602405853 602064247 601785049 601201782
1288.4F01201782l07998k53411k16141J6861m55589j313400q69980n71518r96933o68030
$$ 601201782 600893784 600640373 600424232 600441093 599985504 598672104 597802124 597230606 596233673 595565643
1298.1E95565643q11767j157379j004792n01403n21851q61931p74231q04176j317177
$$ 595565643 594753876 593596497 592591705 592090302 591568451 590706520 589932289 589128113 587810936
1306.8E87810936j471481m46511n73234q66852p52754j100655l99017n341j05667o82106
$$ 587810936 586339455 585892944 585319710 584452858 583700104 582599449 582200432 582195091 582089424 581407318
1316.4E81407318j028366r84383j511459m11644l815r07631j092224j141128j441918
$$ 581407318 580378952 579394569 577883110 577471466 577467651 576560020 575467796 574326668 572884750
1325.1E72884750j831817j587754j627616k540093k440147j689034j556625k046242
$$ 572884750 571052933 569465179 567837563 565297470 562857323 561168289 559611664 557565422
1332.8E57565422k361793j609612j598740j855583j328964o06499o80427k91748J185455
$$ 557565422 555203629 553594017 551995277 550139694 548810730 548204231 547523804 547232056 548417511
1341.5E48417511Q04596M65202J52893L52707J05248j70632N7755o76766p4310K13204
$$ 548417511 549222107 549687309 549840202 550192909 550298157 550127525 550185280 549508514 549434204 549647408
1351.1E49647408j2513M5662N417r3346l85856q1482r29527r62716l56407o41403o92444
$$ 549647408 549634895 549680557 549685974 549592628 549206772 549125290 548195763 547233047 546876640 546235237 545542793
1361.7E45542793j552658j157684R83696J269607r0179l40233o01616l74641P48062
$$ 545542793 543990135 542832451 543816147 545085754 544995575 544655342 544053726 543679085 544427147
1370.4E44427147l91121M17976N16777j151008j71585J354217J417275K42691N68809
$$ 544427147 544036026 544454002 544970779 543819771 543648186 545002403 546419678 546662369 547231178
1379.1E47231178M09317O66123O75621M2915Q83789J204796J302071M09660N15556
$$ 547231178 547640495 548306618 548982239 549025154 549908943 551113739 552415810 552825470 553341026
1387.8E53341026K503815K786331J505242Q82110J376686N58892j273232j997871R85984
$$ 553341026 555844841 558631172 560136414 561018524 562395210 562954102 561680870 559682999 560668983
1396.4E60668983L45955j150131j842079m25987J019745o58913r48029q34083k238312
$$ 560668983 561014938 559864807 558022728 557596741 558616486 557957573 557009544 556175461 553937149
1405.1E53937149o08749K44331l11050r63021p70797j304055j290283m47807m69322
$$ 553937149 553328400 553572731 553261681 552298660 551527863 550223808 548933525 548485718 548016396
1413.8E48016396o51322p83386m23508l19748l5019l195152P64999K496758L21274
$$ 548016396 547365074 546581688 546158180 545838432 545803413 542608261 543373260 545870018 546191292
1422.5E46191292k02789r35135J133384J299630J34696P69730l03612k74467J101684
$$ 546191292 545988503 545053368 546186752 547486382 547621078 548390808 548087196 547812729 548914413
1431.2E48914413J753846M08592N30472J971664M17557k459412R12972L453827J375084
$$ 548914413 550668259 551076851 551607323 553578987 553996544 551537132 552450104 555903931 557279015
1439.8E57279015O21337J192627L18909R78584J29624O60400K22016j079636j440582
$$ 557279015 557900352 559092979 559411888 560390472 560520096 561180496 561402512 560322876 558882294
1448.5E58882294J116066J793708j158370j264306p45353J07917o72073j261825m102822
$$ 558882294 559998360 561792068 560633698 559369392 558624039 558731956 558059883 556798058 552695236
1457.2E52695236n031814M181976J768990K757110P74536Q47245K011680k542725K128945
$$ 552695236 547663422 551845398 553614388 556371498 557146034 557993279 560004959 557462234 559591179
1465.9E59591179K432709L056411K212487K909927L574562P50694K000885K491570
$$ 559591179 562023888 565080299 567292786 570202713 573777275 574527969 576528854 579020424
1473.6E79020424P502212M496460L320580M069061L741303L626785K006454L026925
$$ 579020424 586522636 591019096 594339676 598408737 602150040 605776825 607783279 610810204
1481.3F10810204K279052L439369K825776K313766K857437J45569K131233J710434
$$ 610810204 613089256 616528625 619354401 621668167 624525604 624671173 626802406 628512840
1489F28512840k60544R13048M907761L824081J448860K713128k4414k517701L209381
$$ 628512840 628252296 629165344 634073105 637897186 639346046 642059174 642034760 639517059 642726440
1497.7F42726440J394349N46035L008347K024078K20871J896363J863708J100540q475494
$$ 642726440 644120789 644666824 647675171 649699249 649920120 651816483 653680191 654780731 646305237
1506.4F46305237o684532P268943M217072L450088J957322P39135J15738K172165K72751
$$ 646305237 639620705 646889648 651106720 654556808 656514130 657253265 657369003 659541168 659813919
1515.1F59813919q93936j736908k141571O198807K837448n255966m977265L271866
$$ 659813919 658919983 657183075 655041504 661240311 664077759 658821793 653844528 657116394
1522.8F57116394O279221K200775j645737L15704K065201j54114J342392K098923j26953
$$ 657116394 663395615 665596390 663950653 664266357 666331558 666177444 667519836 669618759 669491806
1531.5F69491806P51648l279800k478562L994980K197342J542664m4709o191864p767257
$$ 669491806 670243454 666963654 664485092 668480072 670677414 672220078 672175369 665983505 658216248
1540.1F58216248N707092Q21075k99225M367676l26767j568222K500992J788864Q37555
$$ 658216248 663923340 664744415 664445190 668812866 668486099 666917877 669418869 671207733 672045288
1548.8F72045288k196884k862625J720657J339264o72150n365905M23355M465713J623001
$$ 672045288 669848404 666985779 668706436 670045700 669373550 664007645 664431000 668896713 670519714
1557.5F70519714j2422485j1024704O895676P059707L098297J139374q23669k711182
$$ 670519714 658097229 647072525 653968201 661027908 664126205 665265579 664441910 661730728
1565.2F61730728M74320J043167N02166j452941o343766K515488J945724n3787n7678
$$ 661730728 662205048 663248215 663750381 662297440 655953674 658469162 660414886 660361099 660303421
1573.9F60303421M76990j465836q379593L434449K649154j45569k86941n77469o43311
$$ 660303421 660780411 659314575 650934982 654369431 657018585 656873016 656586075 656008606 655365295
1582.6F55365295p60040j79596n56869q55637n88837j041107j334533j553498k51541
$$ 655365295 654605255 654425659 653868790 653013153 652424316 651383209 650048676 648495178 648243637
1591.2F48243637p72476r95484j189651j277618l71933r43833n02853j511307j148224
$$ 648243637 647471161 646475677 645286026 644008408 643636475 642692642 642189789 640678482 639530258
1599.9F39530258j252594j937027j370239j698837k80152q90960j441842k090415j298523
$$ 639530258 638277664 636340637 634970398 633271561 632991409 632100449 630658607 628568192 627269669
1608.6F27269669j330529j786041m09279k309799j684914j574554l59078k327003r562264
$$ 627269669 625939140 624153099 623743820 621434021 619749107 618174553 617815475 615488472 605926208
1617.3F05926208K701760O53419n87768j795082o51970k252693n455399J265335J94130
$$ 605926208 608627968 609281387 608693619 606898537 606246567 603993874 598538475 599803810 599997940
1626E99997940j45950l408737j622582N40085o85997n90172j101761Q40988j82075
$$ 599997940 599851990 596443253 594820671 595360756 594674759 594084587 592982826 593823814 593641739
1634.6E93641739q095932n45464K517433J058922J292992J079102m33083J003532k32277
$$ 593641739 585545807 585000343 587517776 588576698 589869690 590948792 590515709 591519241 591286964
1643.3E91286964J200791R09614l411636j34926r9182L978005K764434K715950J668854
$$ 591286964 592487755 593397369 589985733 589850807 589751625 593729630 596494064 599210014 600878868
1652F00878868q683357l959961O743660O513863L245468K228622J630402J673660J907654
$$ 600878868 592195511 588235550 594979210 601493073 604738541 606967163 608597565 610271225 612178879
1660.7F12178879J627350k19803j71623M295501K806130J637878J918335J033478j715393
$$ 612178879 613806229 613586426 613414803 617710304 620516434 622154312 624072647 625106125 623390732
1669.4F23390732J822624L418045J486435L738594L640175m96330j43700M662209L466491
$$ 623390732 625213356 628631401 630117836 633856430 637496605 637000275 636856575 641518784 644985275
1678F44985275J516037J208878N97458L991012M240036k700882n242843P376938O689529
$$ 644985275 646501312 647710190 648307648 652298660 656538696 653837814 648594971 655971909 662661438
1686.7F62661438L232040J049805K498093J818542K716904K888031K084350L098298
$$ 662661438 665893478 666943283 669441376 671259918 673976822 676864853 678949203 682047501
1694.4F82047501J143035p157745M233856N844498M524918n222474m036026Q684159
$$ 682047501 683190536 676032791 680266647 686111145 690636063 685413589 681377563 690061722
1702.1F90061722M967956P92847l55606J461182J49078K492218K868195N10101q774
$$ 690061722 695029678 695822525 695466919 696928101 697077179 699569397 702437592 702947693 702938919
1710.8G02938919J552200J464463P45163j829911j286010L740615n18112o489486N470504
$$ 702938919 704491119 705955582 706700745 704870834 703584824 707325439 706807327 700317841 705788345
1719.5G05788345L408203J234971O52389q5297J1216J538086J033248N04838J543273
$$ 705788345 709196548 710431519 711083908 710998611 711009827 712547913 713581161 714085999 715629272
1728.2G15629272J012192k203979k49329L492661J647262o389007l973999O509552
$$ 715629272 716641464 714437485 714188156 717680817 719328079 712939072 708965073 715474625
1735.9G15474625L954696P11823J452789k277832j035385N042496J831054j942062
$$ 715474625 719429321 720141144 721593933 719316101 718280716 723323212 725154266 723212204
1743.6G23212204P28378K481461M42886M07868M31976L70636L734741r53979j57242
$$ 723212204 723940582 726422043 726864929 727272797 727704773 728075409 731810150 730856171 730698929
1752.3G30698929M366913K510681K178802J172867k140655J569519K700958J491241
$$ 730698929 735065842 737576523 739755325 740928192 738787537 740357056 743058014 744549255
1760G44549255J795807k256546N33066L619080J305999R99451J607361K37350l115921
$$ 744549255 746345062 744088516 744621582 748240662 749546661 750546112 752153473 752390823 749274902
1768.7G49274902K516098L078080k567597l468551N28030M978485K031631n06744K041779
$$ 749274902 751791000 754869080 752301483 748832932 749360962 754339447 756371078 755864334 757906113
1777.4G57906113N09643M90723r71680j382675J901321K617569J282807j670456J3656
$$ 757906113 758415756 758906479 757934799 756552124 758453445 761071014 762353821 760683365 760697021
1786G60697021J713715R78088N54963R38797o15006j447067k775345R5139L801803
$$ 760697021 762410736 763388824 763943787 764882584 764267578 762820511 760045166 760140305 763942108
1794.7G63942108N15671q35495J893539J726914j102753j733932J886825k22015N20019
$$ 763942108 764457779 763622284 765515823 767242737 766139984 764406052 766292877 766070862 766590881
1803.4G66590881J698609J93176L24173k34680l3875Q59986L59268j547852O83823
$$ 766590881 768289490 768482666 768806839 768572159 768538284 769398270 769757538 768209686 768893509
1812.1G68893509J584473M22058P31506j31836L1586n48096K17209Q32214N2796O43310
$$ 768893509 770477982 770900040 771631546 771499710 771531296 770983200 771200409 772032623 772085419 772728729
1821.7G72728729m56543P77970M65622k946091J027145K282639O68793k142716l636017
$$ 772728729 772272186 773050156 773515778 770569687 771596832 773879471 774548264 772405548 768769531
1830.4G68769531K224655K474671L18756N75867N66635O46057r7809m71573R88846
$$ 768769531 770994186 773468857 773787613 774363480 774930115 775576172 775478363 775006790 775995636
1839.1G75995636k52457L25013P7056K34909j325225n907746L413925K763520m35105
$$ 775995636 775743179 776068192 776145248 776380157 775054932 769147186 772561111 775324631 774889526
1847.8G74889526n8670J057511R88464N6992N34973n3330o2790k22091l54920j81198
$$ 774889526 774830856 775888367 776876831 776933823 777468796 777415466 777352676 777130585 776775665 776594467
1857.4G76594467l87726L70636p1792K47574K94570O00052L38822L6163L70407q72497
$$ 776594467 776206741 776577377 776505585 776753159 777047729 777647781 777986603 778022766 778393173 777520676
1867.1G77520676k03476k209320j344681J733322J271362J049271K71683L11508l7079
$$ 777520676 777317200 775107880 773763199 775496521 776767883 777817154 778088837 778400345 778363266
1875.7G78363266K31018M04129M63257J72424p35779Q1253k99301J13755N7296j61743
$$ 778363266 778594284 778998413 779461670 779634094 778898315 778979568 778680267 778794022 778851318 778689575
1885.4G78689575K60925m119J090698p94525j761475J521454J389847J58157J66092
$$ 778689575 778950500 778946381 780037079 779242554 777481079 779002533 780392380 780550537 780716629
1894.1G80716629q00781j238709P89795K87781K05917L47748q2092K99377M7760J80664
$$ 780716629 779915848 778677139 779466934 779754715 779960632 780308380 780226288 780525665 780573425 780754089
1903.7G80754089k33993L83148O20728n22232j048966n94635k9983L34930R33380j04141
$$ 780754089 780520096 780903244 781523972 781001740 779952774 779358139 779328156 779663086 780596466 780492325
1913.3G80492325K51617L58658N27268Q06198k961121m14276J522293M87442R689k072982
$$ 780492325 780743942 781102600 781629868 782436066 779474945 779060669 780582962 781070404 781080093 779007111
1923G79007111n46036J426697J026306j08795n5161J58386J53809J27411k22626K03018
$$ 779007111 778461075 779887772 780914078 780805283 780750122 780908508 781062317 781189728 780967102 781170120
1932.6G81170120l13644J2817Q4992r7885K15530k6321J32904r3232P16095q96530
$$ 781170120 780856476 780869293 780954285 780856400 781071930 781045609 781178513 781085281 781801376 780904846
1942.3G80904846j700744J548385M19617n96161L88870N79300k8457l15629j07727
$$ 780904846 779204102 780752487 781172104 780575943 780964813 781544113 781515656 781200027 781092300
1951G81092300Q1406L4027q2168O5460J75018P25784J84708k32468k51007n39245R689
$$ 781092300 781173706 781207733 781125565 781191025 781366043 782091827 782276535 782044067 781793060 781253815 781263504
1961.6G81263504j5564J44959Q9950K66495M1427r17511J10627Q69751M62265k29264
$$ 781263504 781247940 781392899 781482849 781749344 781790771 780873260 780983887 781853638 782315903 782086639
1971.2G82086639N1957n6839k27051K28271q392R7885l0746J18408j2207J04294J87988
$$ 782086639 782138596 782081757 781854706 782082977 782074585 782172470 782141724 782260132 782247925 782352219 782540207
1981.8G82540207l37143K71149o4698l86428L7841K77939m56161p39594P19757j44729
$$ 782540207 782203064 782474213 782409515 782023087 782060928 782338867 781882706 781143112 781862869 781718140
1991.5G81718140j358948M70734J390838J63345o73065j16348N8899K19192k8839j07269
$$ 781718140 780359192 780829926 782220764 782384109 781711044 781594696 781653595 781872787 781843948 781736679
2001.1G81736679n8823j19094n6763o9351J4114m27170j30691J19018j63955j61133
$$ 781736679 781677856 781558762 781501999 781432648 781446762 781019592 780888901 781007919 780843964 780682831
2010.7G80682831o5918K74124O5079j84937l76663o17599j64719K43988l76587k52762
$$ 780682831 780616913 780891037 780956116 780771179 780394516 779776917 779612198 779856186 779479599 779226837
2020.4G79226837L20740j34659j69983j32751Q1253p4997m21448l11050l23334J32904
$$ 779226837 779547577 779412918 779242935 779110184 779191437 779116440 778694992 778383942 778060608 778193512
2030G78193512j44119j10703K01416q9569n09262l68652K73208m39834m07334J66855
$$ 778193512 778049393 777938690 778140106 778050537 777541275 777172623 777445831 777005997 776598663 776765518
2039.7G76765518p1258n80063l33481K62756m4632Q5984m15192k31247J01089J679
$$ 776765518 776694260 776114197 775780716 776043472 775998840 776084824 775669632 775438385 775539474 775541153
2049.3G75541153L94363k33688P8812R1324q1406j24207k03094L6774k18430L76053
$$ 775541153 775935516 775701828 775780640 775871964 775790558 775666351 775463257 775500031 775281601 775657654
2059G75657654j19019j44958K3498j61819L03573m28619k30484J40533N07432K059
$$ 775657654 775538635 775393677 775417175 775255356 775558929 775130310 774899826 775040359 775547791 775549850
2068.6G75549850o23397L10592K89688K53601q9874j64261R3232J96380J00937l89709
$$ 775549850 774926453 775237045 775526733 775780334 775690460 775526199 775619431 775815811 775916748 775527039
2078.2G75527039L3950K6932j09329j6174J77230j61743m91028J32676L69491K97165
$$ 775527039 775560989 775587921 775478592 775462418 775639648 775477905 774986877 775119553 775489044 775786209
2087.9G75786209n9891J92261r3155j65329K58789r1476K6016k03171L8071m6845R4986
$$ 775786209 775726318 775918579 775825424 775660095 775918884 775827408 775853424 775650253 775688324 775641479 775736465
2098.5G75736465K26136j92261L73077Q8272K42310K54517K76184M3106n67398O1035
$$ 775736465 775962601 775770340 776143417 776231689 776473999 776728516 777004700 777047806 776480408 776541443
2108.1G76541443l30582j57623j41907n1193O23398J20086L3722K30027M47464j42746
$$ 776541443 776210861 776053238 775911331 775860138 776483536 776603622 776637344 776867371 777314835 777172089
2117.8G77172089m31900j84021j43891j28631q1635L35312o8817L42483M83170K0752
$$ 777172089 776740189 776556168 776412277 776283646 776202011 776537323 776468506 776810989 777294159 777314911
2127.4G77314911j47247n34668J24893R0103k47726k86866j78451O3781J01548J14593
$$ 777314911 777167664 776632996 776757889 776847992 776600266 776313400 776134949 776198730 776300278 776414871
2137.1G76414871j5640K66190j23826k8610K98767m5089m53492n00030K61536K00119
$$ 776414871 776399231 776665421 776541595 776512985 776811752 776766663 776313171 775813141 776074677 776274796
2146.7G76274796K13851J74027J47858m0512k51389M72107J50604j53122k98157P2861
$$ 776274796 776488647 776662674 776810532 776770020 776518631 776990738 777141342 776988220 776690063 776762924
2156.4G76762924L52631k5406K8076k25754M1504m2648J20544K23618J29700L77426
$$ 776762924 777115555 777090149 777118225 776892471 776933975 776891327 777011871 777235489 777365189 777742615
2166G77742615L04947L56445m31519p1334M0893k21100L72620K59933K63291j91803
$$ 777742615 778047562 778404007 777972488 777901154 777942047 777720947 778093567 778353500 778616791 778424988
2175.6G78424988L98636N98220K66419M59289j34429k79541k75040L27225J81732P5226
$$ 778424988 778823624 779421844 779688263 780147552 780013123 779733582 779458542 779785767 779967499 780042725
2185.3G80042725J60064l29895K04850L26385K50778o4621K53830K29492j43737M74166
$$ 780042725 780202789 779872894 780077744 780404129 780654907 780590286 780844116 781073608 780929871 781404037
2194.9G81404037K01416R8115j84861k80227J40533N92270M79813n0202K39716j37863
$$ 781404037 781605453 781703568 781518707 781238480 781379013 781971283 782451096 782400894 782640610 782502747
2204.6G82502747j01777K4567J95694K74429J5793L73612l8605R6664P1106J3199J57471
$$ 782502747 782400970 782425537 782621231 782895660 782911453 783285065 783246460 783343124 783414230 783427429 783584900
2215.2G83584900j29776J16043K54517L20129k57950j00097J65710J2054M6921n4321
$$ 783584900 783455124 783571167 783825684 784145813 783887863 783787766 783953476 783965530 784012451 783958130
2224.8G83958130L88718K26821L16086J40229l586j03607j49079L60108m92630l87803
$$ 783958130 784346848 784573669 784889755 785029984 785026398 784922791 784773712 785133820 784641190 784253387
2234.5G84253387o1340J74484O23093K38647M3335q6364L61328J7166o8131N35j31226
$$ 784253387 784192047 784366531 784989624 785228271 785271606 785185242 785546570 785563736 785495605 785496140 785364914
2245.1G85364914J69372l19671l26309j97068M03061L22724k73056o3782K52228K42004
$$ 785364914 785534286 785214615 784888306 784691238 785094299 785417023 785143967 785080185 785332413 785574417
2254.7G85574417l88031K3270j78528j90277J69296K0599K60773J8311L08227k365
$$ 785574417 785186386 785209656 785031128 784840851 785010147 785030746 785291519 785309830 785618057 785615692
2264.4G85615692j3428M7913J81198J46256n63736J90963k02255j16806K823m9362
$$ 785615692 785602264 785650177 785831375 785977631 785413895 785604858 785402603 785285797 785288620 785239258
2274G85239258K77786k31628N28412K17132J24359L8300M2572M10461j11465J58920
$$ 785239258 785517044 785285416 785813828 786030960 786155319 786193619 786236191 786646652 786535187 786694107
2283.7G86694107m14810k28653p3700N7754k46124p56988K67715J8006P1487p25479
$$ 786694107 786279297 786050644 785976944 786034698 785788574 785031586 785299301 785317307 785388794 784663315
2293.3G84663315l55759j00250n58472N73654o32476k32315J1825j50452k12554n44129
$$ 784663315 784307556 784207306 783648834 784222488 783590012 783357697 783369522 783219070 783006516 782462387
2302.9G82462387M49753q33130l77655k33231n94635n57327r50546q2779o50482L18832
$$ 782462387 782912140 782079010 781701355 781468124 780873489 780316162 779365616 779282837 778632355 778951187
2312.6G78951187m93011n96619M22287p81021k22397m89120p12357j305313r10034
$$ 778951187 778458176 777861557 778283844 777502823 777280426 776791306 776078949 774773636 773863602
2321.3G73863602j228485j925965l15475J1902N01175r87015l81241R2010l17764q1711
$$ 773863602 772635117 770709152 770393677 770405579 770906754 769919739 769538498 769630508 769312744 769231033
2330.9G69231033j214218l3493j290130p86210o6757J08032J130600k4566j30768j235733
$$ 769231033 768016815 767983322 766693192 765906982 765840225 765948257 767078857 767054291 766923523 765687790
2340.6G65687790j021576j197815j78909N69153j79520J721878K274628L222503J750183
$$ 765687790 764666214 763468399 763289490 763858643 763679123 765401001 767675629 770898132 772648315
2349.2G72648315j617279k527465j792145k178345j631012j648254j649933j19934
$$ 772648315 771031036 768503571 766711426 764533081 762902069 761253815 759603882 759483948
2356.9G59483948j936264j721192j523208j175766K240524J337433N98450k48795O7520
$$ 759483948 757547684 755826492 754303284 753127518 755368042 756705475 757303925 757055130 757122650
2365.6G57122650P13730J622925J785660N10635J627045J628494K086334R39484L76892
$$ 757122650 757836380 759459305 761244965 761755600 763382645 765011139 767097473 768036957 768413849
2374.3G68413849J167526Q77686J518402J016006J059799J250306J114120J184082
$$ 768413849 769581375 770459061 771977463 772993469 774053268 775303574 776417694 777601776
2382G77601776R07211M95224L8376M93775L24630K78702J08261n37414l11890r460
$$ 777601776 778508987 779004211 779042587 779536362 779860992 780139694 780247955 779710541 779398651 779389191
2391.7G79389191K48489k57721j45264Q4610k94723j93024N6305J95923l14026j26572
$$ 779389191 779637680 779379959 779234695 779319305 779024582 778831558 778887863 779083786 778769760 778643188
2401.3G78643188j9760r7046j8005m47082l85209j29013N7297l55530j8310L59497
$$ 778643188 778623428 778526382 778508377 778061295 777676086 777547073 777604370 777248840 777230530 777590027
2410.9G77590027k64511l29132m81415n32684l27225q393j09558j30844K23084L3264
$$ 777590027 777325516 776996384 776514969 775982285 775655060 775646667 775537109 775406265 775629349 775662613
2420.6G75662613k96860m19159n6000k67791m78287k92816j97601j74408k10495O3934
$$ 775662613 775365753 774946594 774890594 774622803 774144516 773851700 773654099 773479691 773269196 773333130
2430.2G73333130k46582j80283m16336p97577l35617L8147R7733n56946j51520P1335
$$ 773333130 773086548 772906265 772489929 771692352 771356735 771394882 771492615 770935669 770784149 770855484
2439.9G70855484l38211l62167m05655j9760l04261m81949n54199j00784K53525j62964
$$ 770855484 770517273 770155106 769749451 769729691 769425430 768943481 768389282 768288498 768542023 768379059
2449.5G68379059k91443l89175J82876m75616p47223M7073o3019q8424m54560k70767
$$ 768379059 768087616 767698441 767881317 767405701 766658478 766705551 766642532 766554108 766099548 765828781
2459.2G65828781j11542k98004k44598j39923l71628n35965o9809k99301N0201O4011
$$ 765828781 765717239 765419235 765174637 765034714 764663086 764127121 764057312 763758011 763808212 763872223
2468.8G63872223m28772l25852k86483k89917o50864j89819j64490r1476k9602m79126
$$ 763872223 763443451 763117599 762831116 762541199 761890335 761700516 761536026 761444550 761414948 760935822
2478.5G60935822q1788k60696P8354o0120n99899k18430j25427j20087p4310J08643
$$ 760935822 760854034 760593338 760671692 760611572 760011673 759793243 759667816 759547729 759473419 759582062
2488.1G59582062m35562o64826m54407m0817L17841l8605q6899m77981j60904J52511
$$ 759582062 759146500 758481674 758027267 757986450 758304291 758265686 758178787 757700806 757539902 757692413
2497.7G57692413O6300k03552q78678k27356J66397L2502k70463l96041r6512O9732
$$ 757692413 757758713 757555161 756676483 756449127 756615524 756648026 756377563 755981522 755885010 755954742
2507.4G55954742J4267m34417k87628j87684N1041j15204k94647j48087l68118J28861
$$ 755954742 755969009 755534592 755246964 755059280 755110321 754995117 754700470 754552383 754184265 754313126
2517G54313126l36533n22614j4648j98746k70843J73797L51639o31866k47803J2894
$$ 754313126 753976593 753453979 753439331 753240585 752969742 753143539 753495178 752863312 752615509 752628403
2526.7G52628403p17850n96848J37253M90952n93796o42090l18298k24152q1329l60718
$$ 752628403 751910553 751313705 751450958 751941910 751348114 750706024 750387726 750163574 750082245 749721527
2536.3G49721527j77154l55988k67029l45535j22452K42996L0060k06146o88858l68729
$$ 749721527 749544373 749188385 748921356 748575821 748453369 748696365 748726425 748520279 747831421 747462692
2546G47462692l54461l04642k36130o03409m21905k74430j67160k15530R5673O2866
$$ 747462692 747108231 746803589 746567459 745964050 745542145 745267715 745100555 744885025 744980698 745043564
2555.6G45043564k41013o04171n19486J69830k59475r6360q1634p34177p04651p4463
$$ 745043564 744802551 744198380 743678894 743848724 743589249 743492889 743411255 742677078 741972427 741897964
2565.2G41897964J33362p46841l80707Q2245j98822m30069j96915J80817l66821l62549
$$ 741897964 742031326 741284485 740903778 740986023 740787201 740357132 740160217 740341034 739974213 739611664
2574.9G39611664l42560j24893q3542o23245l11966L4408q6898m52652k44599m9438
$$ 739611664 739269104 739144211 739060669 738437424 738125458 738159866 738072968 737620316 737375717 737326279
2584.5G37326279j02387k79999m13589k98157n69076k70691j71738J79520L71322n44204
$$ 737326279 737223892 736943893 736530304 736232147 735663071 735392380 735220642 735400162 735771484 735227280
2594.2G35227280n16358q3694j65253l25470r15j16425l16162j46790n23605m56848
$$ 735227280 734710922 734627228 734461975 734136505 734135590 734019165 733703003 733556213 733032608 732575760
2603.8G32575760k7237K56424j41678n11322l77808q5830j13068o63299l11432m06800
$$ 732575760 732548523 732804947 732663269 732151947 731774139 731688309 731575241 730911942 730600510 730193710
2613.5G30193710l79257J29929k04544m34952n28412l17078l36151l99475o03714l60718
$$ 730193710 729814453 729944382 729739838 729304886 728776474 728459396 728123245 727723770 727120056 726759338
2623.1G26759338K83966l33175o44074o64444p64618n25741k53830p0801n8670k97623
$$ 726759338 727043304 726710129 726066055 725401611 724636993 724111252 723857422 723786621 723727951 723430328
2632.8G23430328n63583l35388n88455m52500m33807p89414l94897m15649m01917l79791
$$ 723430328 722866745 722531357 721942902 721490402 721056595 720267181 719872284 719456635 719054718 718674927
2642.4G18674927j26953m51889p31354k84805q69141o07452q0491k41012l72544l50723
$$ 718674927 718547974 718096085 717364731 717079926 716210785 715603333 715522842 715281830 714909286 714558563
2652G14558563m06875q21839n92346n49545l09296j60751l55301l58048l26080K09732
$$ 714558563 714151688 713329849 712737503 712187958 711878662 711717911 711362610 711004562 710678482 710888214
2661.7G10888214j36032o06995p70568p48139n17807n07889J56403R2392m66156o53076
$$ 710888214 710752182 710145187 709374619 708626480 708108673 707600784 707757187 707849579 707383423 706730347
2671.3G06730347m69666j47095l19366l23715m49524n28259m47007l13644q7357j07422
$$ 706730347 706260681 706113586 705794220 705470505 705020981 704492722 704045715 703732071 703644714 703537292
2681G03537292m96597q94928o00815k97927k59095j28021o2866l53317m84238m40598
$$ 703537292 703040695 702145767 701544952 701247025 700987930 700859909 700797043 700443726 699959488 699518890
2690.6F99518890o51321m10843n5084j83563o93741m83170j61438m27704k48565k86331
$$ 699518890 698867569 698456726 698401642 698218079 697524338 697041168 696879730 696452026 696203461 695917130
2700.3F95917130l53928n35355n46341k61917l25241l23639n01251m12292m38080m79203
$$ 695917130 695563202 695027847 694481506 694219589 693894348 693570709 693069458 692657166 692219086 691739883
2709.9F91739883m27398n38788l90778l40652j81122k52151m88968q10547n46570l32184
$$ 691739883 691312485 690773697 690382919 690042267 689861145 689608994 689120026 688309479 687762909 687430725
2719.5F87430725o22864j6327j12304l50418k12403k29721j79519l91541k29263o29273
$$ 687430725 686807861 686791534 686679230 686328812 686116409 685886688 685707169 685315628 685086365 684457092
2729.2F84457092p51037m79584n42984k85492j48010N4092j06964m14581m01459l41263
$$ 684457092 683706055 683226471 682683487 682397995 682249985 682304077 682197113 681782532 681381073 681039810
2738.8F81039810m11606l29284k55356k41165O1645k04315k51999j50986k96630p36313
$$ 681039810 680628204 680298920 680043564 679802399 679864044 679659729 679407730 679256744 678960114 678223801
2748.5F78223801o56510M48609n2948p65686p62177l91312J61133l80096m31900k24457
$$ 678223801 677567291 678015900 677962952 677197266 676435089 676043777 676204910 675824814 675392914 675168457
2758.1F75168457k27890l27682k78550J7777K594M6844j78833r9182r4681n68924q77380
$$ 675168457 674940567 674612885 674334335 674352112 674354706 674401550 674222717 674123535 674028854 673459930 672582550
2768.7F72582550m23889j068k96021K213r2316m10538m55246l09829o6986m06952m77524
$$ 672582550 672158661 672157593 671861572 671863785 671771469 671360931 670905685 670595856 670528870 670121918 669644394
2779.3F69644394n90820m68827k24304o3705l98178q23670k18582l44849m69360j96381
$$ 669644394 669053574 668584747 668360443 668296738 667898560 667074890 666856308 666511459 666042099 665845718
2789F65845718J1368k51465j064987q08029l07770m27246j273880q69369K32696k51770
$$ 665845718 665857086 665605621 664540634 663732605 663424835 662997589 661723709 660854340 661087036 660835266
2798.6F60835266o51932o93130o88629m74778j32446p43866j307678o01959m47769
$$ 660835266 660183334 659490204 658801575 658326797 658194351 657450485 656142807 655540848 655093079
2807.3F55093079o05317o88476m41513n80521j154098q89206n48401m61502n63660
$$ 655093079 654487762 653799286 653357773 652777252 651623154 650733948 650185547 649724045 649160385
2816F49160385q75931j268539q04062o08215j199646j058808p36999m39835n90210
$$ 649160385 648284454 647015915 646211853 645603638 644403992 643345184 642608185 642168350 641578140
2824.7F41578140p52029j047402j159706p69005j015777p65801p76977j278992j415520
$$ 641578140 640826111 639778709 638619003 637849998 636834221 636068420 635291443 634012451 632596931
2833.3F32596931r56268r04922j552544o23093n05638j307602j451835j673622j328927
$$ 632596931 631640663 630735741 629183197 628560104 628054466 626746864 625295029 623621407 622292480
2842F22292480j578712j893005j634560j287460j090126j797371k220154j764946j408081
$$ 622292480 620713768 618820763 617186203 615898743 614808617 613011246 610791092 609026146 607618065
2850.7F07618065j406555j376000j125335r04236j069069j083527r82246p67365m80957
$$ 607618065 606211510 604835510 603710175 602805939 601736870 600653343 599671097 598903732 598422775
2859.4E98422775q07037j009026j024704p68165j004372j215668p38182j633262k201042
$$ 598422775 597615738 596606712 595582008 594813843 593809471 592593803 591855621 590222359 588021317
2868.1E88021317j927720j845283j643143j590881j631508j968613j669006j502266
$$ 588021317 586093597 584248314 582605171 581014290 579382782 577414169 575745163 574242897
2875.8E74242897j771622j788444j925469j851921j697502j353111j123543j022453
$$ 574242897 572471275 570682831 568757362 566905441 565207939 563854828 562731285 561708832
2883.5E61708832j279106j433449j170578j136551o20766o57654p65571k91748l17383
$$ 561708832 560429726 558996277 557825699 556689148 556068382 555410728 554645157 554353409 554036026
2892.2E54036026l66325j10054j12572o59943k09694j22909r06449n80520k87132m07486
$$ 554036026 553669701 553559647 553447075 552787132 552577438 552454529 551548080 550967560 550680428 550272942
2901.8E50272942m96674l32642m71153o26983m46969p25631r04961j092567j177369
$$ 550272942 549776268 549443626 548972473 548345490 547898521 547172890 546267929 545175362 543997993
2910.5E43997993j099815j076736j426239j565552j221771j645890j722641j453476
$$ 543997993 542898178 541821442 540395203 538829651 537607880 535961990 534239349 532785873
2918.2E32785873j600303j581345j323585j441498j575432p83577p00455r88197n88379
$$ 532785873 531185570 529604225 528280640 526839142 525263710 524480133 523779678 522791481 522203102
2926.9E22203102j24130k82822o66046J7624M79469N53208O45179Q59642J250954J100044
$$ 522203102 522078972 521796150 521130104 521147728 521627197 522180405 522825584 523685226 524936180 526036224
2936.5E26036224J172676J700592K239113K127114J866264J928558K068978K185020
$$ 526036224 527208900 528909492 531148605 533275719 535141983 537070541 539139519 541324539
2944.2E41324539J947556J985779K125930J924439J625137J940155K302017K532807
$$ 541324539 543272095 545257874 547383804 549308243 550933380 552873535 555175552 557708359
2952E57708359K170410J359177K094841J998024J874694K162171J642113K027130J717376
$$ 557708359 559878769 561237946 563332787 565330811 567205505 569367676 571009789 573036919 574754295
2960.6E74754295J810837K060356J671372J772613J506844J361046J369362J370010
$$ 574754295 576565132 578625488 580296860 582069473 583576317 584937363 586306725 587676735
2968.3E87676735R16557J008568J686859J868515J654549J097793J280327J477776
$$ 587676735 588593292 589601860 591288719 593157234 594811783 595909576 597189903 598667679
2976.1E98667679J465301J458969J175232P30515P02667J262894J280136Q49342L56751
$$ 598667679 600132980 601591949 602767181 603497696 604200363 605463257 606743393 607592735 607949486
2984.7F07949486J255989J497879O53381J113549O44950J68343M07791M55971L97034
$$ 607949486 609205475 610703354 611356735 612470284 613115234 613283577 613691368 614147339 614544373
2993.4F14544373O03141P95594K83699N01175J67770j19171L18527N2376k67372q393
$$ 614544373 615147514 615943108 616226807 616727982 616895752 616776581 617095108 617147484 616880112 616871719
3003.1F16871719M32625m06647m84542J28250K4528K88964J49040l65067r81369q37936
$$ 616871719 617304344 616897697 616413155 616541405 616565933 616854897 617003937 616638870 615657501 614819565
3012.7F14819565j13068j45454p32270o85081l50685p90062p04804p40509q45871n57899
$$ 614819565 614706497 614561043 613828773 613143692 612793007 612002945 611298141 610557632 609711761 609153862
3022.4F09153862m17290l20968p90215j055756q27674m04549n66330o02379n27305
$$ 609153862 608736572 608415604 607625389 606569633 605741959 605337410 604771080 604168701 603641396
3031F03641396j229592q55179m31900q49762j367912r74426k79885o79283q40759p84340
$$ 603641396 602411804 601556625 601124725 600274963 598907051 597932625 597652740 596973457 596132698 595348358
3040.7E95348358q49800j014328j008034r75418j094818r67255j090622j166114q98552
$$ 595348358 594498558 593484230 592476196 591500778 590405960 589438705 588348083 587181969 586283417
3049.4E86283417k41051n67017r40933o41899j267548j187210r84039j105385q03718
$$ 586283417 586042366 585475349 584534416 583892517 582624969 581437759 580453720 579348335 578544617
3058E78544617q40836j095962j285286q34236l35351r15031j840553p20673l6926j050758
$$ 578544617 577703781 576607819 575322533 574488297 574152946 573237915 571397362 570676689 570639763 569589005
3067.7E69589005r39255j185036j289177n60684n92804j108322j224709j196174j316491
$$ 569589005 568649750 567464714 566175537 565614853 565022049 563913727 562689018 561492844 560176353
3076.4E60176353q01620o07529o25534j177406j556664q45298r73626r26666p95936
$$ 560176353 559374733 558767204 558141670 556964264 555407600 554562302 553588676 552662010 551866074
3085E51866074q30346q80012r58443n61065r58939j166687p63359n33066j126404j352043
$$ 551866074 551035728 550155716 549197273 548636208 547677269 546510582 545747223 545214157 544087753 542735710
3094.7E42735710o77833j391373j332245l22723n40467j073799j448211j365662p43256
$$ 542735710 542057877 540666504 539334259 539011536 538471069 537397270 535949059 534583397 533840141
3103.4E33840141n59387j041183j027947o76460p41997j010094j204795j230278r56421
$$ 533840141 533280754 532239571 531211624 530535164 529793167 528783073 527578278 526348000 525391579
3112E25391579p67403r06830q37402j259194j230316n44929q40416r83467o77567q24127
$$ 525391579 524624176 523717346 522879944 521620750 520390434 519845505 519005089 518021622 517344055 516519928
3121.7E16519928j283455j109009p69615q95080j116906j320762o05851n10673j293526
$$ 516519928 515236473 514127464 513357849 512462769 511345863 510025101 509419250 508908577 507615051
3130.4E07615051j009216j031418j558456n70145J57967p58095r46465r03091j541672
$$ 507615051 506605835 505574417 504015961 503445816 503603783 502845688 501899223 500996132 499454460
3139D99454460j450004q65670o09550m98276n08232j048737j129989r04045p07817
$$ 499454460 498004456 497138786 496529236 496030960 495522728 494473991 493344002 492439957 491732140
3147.7D91732140o44112r42879j036567j472588j061134o53954q25005k93121p12471
$$ 491732140 491088028 490145149 489108582 487635994 486574860 485920906 485095901 484802780 484090309
3156.4D84090309j284103q98361p44858r99489o76079q79440j157074m20952r10873
$$ 484090309 482806206 481907845 481162987 480163498 479487419 478607979 477450905 477029953 476119080
3165.1D76119080j152916p14112n92918p55234j353989j079139n45807l70369r67026
$$ 476119080 474966164 474252052 473659134 472903900 471549911 470470772 469924965 469554596 468587570
3173.8D68587570j070556n26085p17926r63059r91554o22521q87298q11577n86700
$$ 468587570 467517014 466990929 466273003 465309944 464318390 463695869 462808571 461996994 461410294
3182.4D61410294p02858m50859q68760r36660j009903p42150o17408q30155n94101
$$ 461410294 460707436 460256577 459387817 458451157 457441254 456699104 456081696 455251541 454657440
3191.1D54657440r17473n51719m81415o13747p94143p89757l71590q56438n47332r20678
$$ 454657440 453739967 453188248 452706833 452093086 451298943 450509186 450137596 449281158 448733826 447813148
3200.8D47813148r07363l0938o24733j136169r89037n71212p68586n48629l32756m74549
$$ 447813148 446905785 446874847 446250114 445113945 444124908 443553696 442785110 442236481 441903725 441429176
3210.4D41429176l00789m86259m14238j178780j251144n20744k76642k56043j113319
$$ 441429176 441128387 440642128 440227890 439049110 437797966 437277222 437000580 436744537 435631218
3219.1D35631218p85980p8888n11093q83065m47082P5188j33934o71692j195984p22161
$$ 435631218 434845238 434766350 434255257 433372192 432925110 433000298 432866364 432194672 430998688 430276527
3228.7D30276527k33764m76418q10203o38161l71971n06783l49807p00798q36602q32443
$$ 430276527 430042763 429566345 428756142 428117981 427746010 427239227 426889420 426188622 425352020 424519577
3238.4D24519577o71654J11618k44598p99522n36309n01938q87985n38139n57442o28509
$$ 424519577 423847923 423959541 423714943 422915421 422379112 421877174 420989189 420451050 419893608 419265099
3248D19265099m8180l16010k09274j65710m12140p73201p67670j82075n51339l55987
$$ 419265099 419216919 418900909 418691635 418525925 418113785 417340584 416572914 416390839 415839500 415483513
3257.7D15483513l04146o02760q48961p58667J09825k08054l89671m13856n28107j05553
$$ 415483513 415179367 414576607 413727646 412968979 413078804 412870750 412481079 412067223 411539116 411433563
3267.3D11433563l23219o35262m23965l91312l75557L9215q01658p34291J32255n86014
$$ 411433563 411110344 410475082 410051117 409659805 409284248 409323463 408521805 407787514 407919769 407333755
3276.9D07333755n04150l16353l39432j78565m1008j16730m94042n17845q86841j74369
$$ 407333755 406829605 406513252 406173820 405995255 405954247 405837517 405343475 404825630 403938789 403764420
3286.6D03764420J56364p20024o53877k31972Q6937l91808o63490j64108J87912n9700
$$ 403764420 403920784 403200760 402546883 402314911 402401848 402010040 401346550 401182442 401370354 401310654
3296.2D01310654o15807n73997o75583p70188m44717J35155J04141n40123l43704J15089
$$ 401310654 400694847 400120850 399445267 398675079 398230362 398365517 398469658 397929535 397585831 397700920
3305.9C97700920p3128q53920r87510m46778n32722l88985k20794m61960k8229k91557
$$ 397700920 397627792 396773872 395786362 395339584 394806862 394417877 394197083 393735123 393706894 393415337
3315.5C93415337j004067o56967o11115k52304k24342m49638n3940o81076l99552J30501
$$ 393415337 392411270 391754303 391143188 390890884 390666542 390216904 390162964 389481888 389082336 389212837
3325.2C89212837l77426q59260j113625o35567m89883l07312m66461l86506J27182
$$ 389212837 388835411 387976151 386862526 386226959 385737076 385429764 384963303 384576797 384703979
3333.8C84703979k60314j44082m50248o85692l85361o56433n51529o84509o85730o48232
$$ 384703979 384443665 384299583 383849335 383163643 382778282 382121849 381570320 380885811 380200081 379551849
3343.5C79551849q02688j06774R5864j44844j4572l50991m64020p49969j246910o18057
$$ 379551849 378749161 378642387 378738251 378593407 378578835 378227844 377763824 377013855 375766945 375148888
3353.1C75148888k69356p61299q71544j90239j21765p19261n29709j86501k21596o53457
$$ 375148888 374879532 374118233 373246689 373056450 372934685 372215424 371685715 371499214 371277618 370624161
3362.8C70624161n62744l84751l40652j98326n86052l25279m14124l85780m43535q97866
$$ 370624161 370061417 369676666 369336014 369137688 368551636 368226357 367812233 367426453 366982918 366085052
3372.4C66085052l29246j68877j9111n04608m99688j65825q63952m15535m56886m35029
$$ 366085052 365755806 365586929 365567818 365063210 364563522 364397697 363533745 363118210 362661324 362226295
3382.1C62226295p7323k04926o48499r85946K17743J66702l40080j68305j49803Q4419
$$ 362226295 362148972 361944046 361295547 360309601 360527344 360694046 360353966 360185661 360035858 360120277
3391.7C60120277o03942q59223p5760M72832p8239o82374k15988k18544n72242l96004
$$ 360120277 359516335 358657112 358581352 359054184 358975945 358293571 358077583 357859039 357286797 356890793
3401.3C56890793L2463k20146l79563j6098K76146K98081l57552m88281n8746N4740
$$ 356890793 356923256 356703110 356323547 356307449 356583595 356881676 356524124 356035843 355977097 356031837
3411C56031837j32904l45878j61362j98326m83627p9346J48621m3564J91574l37906
$$ 356031837 355898933 355553055 355391693 355193367 354709740 354630394 354779015 354735451 354927025 354589119
3420.6C54589119p26280n3025M21257M45595J83602J17683j51634j03798O9923J31874
$$ 354589119 353862839 353809814 354231071 354676666 354860268 354977951 354826317 354722519 354792442 354924316
3430.3C54924316J8692l39469L37791K38571j98440L2768j64643k57225j15470J56364
$$ 354924316 354943008 354603539 354941330 355179901 354981461 355014229 354849586 354592361 354476891 354633255
3439.9C54633255M43459Q49266N03349J57890J82724N75981Q53005j169014n91240
$$ 354633255 355076714 355925980 356429329 356587219 356769943 357345924 358198929 357029915 356438675
3448.6C56438675Q92448N99556N06096J9646K32239M49257N48248N87921L50723J37711
$$ 356438675 357331123 357930679 358436775 358456421 358688660 359137917 359686165 360274086 360624809 360762520
3458.2C60762520l27034K18658P33109N50728J69754M30908L92189N7831N17730L91388
$$ 360762520 360435486 360654144 361387253 361937981 362107735 362538643 362930832 362988663 363506393 363897781
3467.9C63897781N43747M04930N23453J019745M92134K15149J43738O90079O03637
$$ 363897781 364441528 364846458 365369911 366389656 366881790 367096939 367240677 367930756 368534393
3476.6C68534393k88086j45912O04439Q56628O34537L66058M75998R53904K04620L76816
$$ 368534393 368246307 368100395 368704834 369561462 370195999 370562057 371038055 371991959 372196579 372573395
3486.2C72573395Q92410O7215J94511N10903R29222N33485M33884O93436L79181P23686
$$ 372573395 373465805 373533020 373727531 374238434 375167656 375701141 376135025 376828461 377207642 377931328
3495.8C77931328N0468J72539O14548N86662R42726Q75435N27191k58484M02184Q55064
$$ 377931328 377981796 378154335 378768883 379355545 380298271 381173706 381700897 381442413 381844597 382699661
3505.5C82699661O99997R09043J058044K90680m36287R49211Q79135Q19931J164971
$$ 382699661 383399658 384308701 385366745 385657425 385221138 386170349 387049484 387869415 389034386
3514.2C89034386N66749L80326L49807P74002M70696M98505J050376J115914K34833
$$ 389034386 389601135 389981461 390331268 391105270 391575966 392074471 393124847 394240761 394475594
3522.9C94475594p80335O53839J443596Q06122K42691J252899J066666M01077O81839
$$ 394475594 393695259 394349098 395792694 396598816 396841507 398094406 399161072 399562149 400243988
3531.5D00243988L24364Q85582P18803J345329R67713k24991J246757J074410Q60062
$$ 400243988 400568352 401453934 402172737 403518066 404485779 404260788 405507545 406581955 407442017
3540.2D07442017L46107M93088J412926J457290M28734o26678P68661L52326J368675
$$ 407442017 407788124 408281212 409694138 411151428 411580162 410953484 411722145 412074471 413443146
3548.9D13443146J434402J787606J880760j472092O55022Q11119J705284K269363K05689
$$ 413443146 414877548 416665154 418545914 417073822 417728844 418539963 420245247 422514610 422720299
3557.6D22720299J654815J106110P97310N83610J699944J232300P90558M348869n89600
$$ 422720299 424375114 425481224 426278534 426862144 428562088 429794388 430584946 434933815 434344215
3566.2D34344215j496620L88680O77452M278183J635666Q16002J028556J018792J169395
$$ 434344215 432847595 433236275 433913727 438191910 439827576 440643578 441672134 442690926 443860321
3574.9D43860321J736565J497726L36990K982331J362915O55708K119370J515236J363678
$$ 443860321 445596886 447094612 447431602 450413933 451776848 452432556 454551926 456067162 457430840
3583.6D57430840J735725M652901k56501l466339K548142J078071L817253L123475
$$ 457430840 459166565 463819466 463562965 460096626 462644768 463722839 467540092 470663567
3591.3D70663567K424964O76880P78695L021354j402206K894668L238488L36227K938080
$$ 470663567 473088531 473765411 474544106 477565460 476163254 479057922 482296410 482632637 485570717
3600D85570717M22401J041374K844315J772728K297363M084435K355461k015839L042755
$$ 485570717 485993118 487034492 489878807 491651535 493948898 498033333 500388794 498372955 501415710
3608.7E01415710j167030Q95767Q675537m37545l110810M148102Q698N038833M382897
$$ 501415710 500248680 501144447 509819984 509382439 506271629 510419731 510428429 515467262 519850159
3617.4E19850159q06504J697121m81377J141205L202935L060722K416115K113495J565971
$$ 519850159 519043655 520740776 520259399 521400604 524603539 527664261 530080376 532193871 533759842
3626E33759842K220268P172012m510536j2369651P772445O759148O536712L82195j993637
$$ 533759842 535980110 543152122 538641586 526271935 534044380 540803528 547340240 547722435 545728798
3634.7E45728798L888702L465042K174492O18401J705513K715759K505989N80254k03057
$$ 545728798 549617500 553082542 555257034 555875435 557580948 560296707 562802696 563382950 563179893
3643.4E63179893K742882M045639M669037l288383l202057M404411k147064l009415
$$ 563179893 565922775 569968414 574637451 571349068 568147011 572551422 570404358 567394943
3651.1E67394943J355820P315826M834633M347687M035034j0079269L516121O692161
$$ 567394943 568750763 576066589 580901222 585248909 589283943 579204674 582720795 589412956
3658.8E89412956J369438J650353N27801J615372J291351J861840J516151O90651M841614
$$ 589412956 590782394 592432747 592960548 594575920 595867271 597729111 599245262 599935913 604777527
3667.5F04777527J165123l156586l27911o390076M925537J0119248P788810o202812
$$ 604777527 605942650 602786064 602458153 596068077 600993614 611112862 618901672 612698860
3675.2F12698860j8507156O995735J0209198M781418l622513R85794M013252K402726
$$ 612698860 594191704 601187439 611396637 616178055 612555542 613541336 617554588 619957314
3682.9F19957314J505088k48718R17320M676285M975586j1923675r19495R852409q010978
$$ 619957314 621462402 621213684 622131004 626807289 631782875 619859200 618939705 628792114 620781136
3691.6F20781136J305313O564712M40941J969490M10957J81122K399216J131134K729073
$$ 620781136 622086449 628651161 629092102 631061592 631472549 631653671 634052887 635184021 637913094
3700.3F37913094K395134p627678j742325O565590J528091k95524M15267K952233L610306
$$ 637913094 640308228 632680550 630938225 637503815 639031906 638736382 639151649 642103882 645714188
3709F45714188q230782M460030K286987j3968506O808434N535545Q85315J611404K877579
$$ 645714188 637483406 641943436 644230423 630261917 637070351 642605896 643491211 645102615 647980194
3717.7F47980194K13165l970794K819366O093445o573944l658066O769409l7155j730194
$$ 647980194 648193359 644222565 647041931 653135376 646561432 642903366 649672775 649635620 647905426
3726.3F47905426k833633K743911M616089k0141N784301m923324o920624J0584564
$$ 647905426 645071793 647815704 652431793 652411652 658195953 653272629 646352005 656936569
3734F56936569j976242j1540756K580719M460678J643524M336624K814255m924393
$$ 656936569 654960327 643419571 646000290 650460968 652104492 656441116 659255371 654330978
3741.8F54330978N170517J3140870j7010880j6589851J3466987P236634O899261o015320
$$ 654330978 659501495 672642365 655631485 639041634 652508621 659745255 666644516 660629196
3749.5F60629196j0702362J2632141q790970m277343Q180084N680389K971039o205902
$$ 660629196 649926834 662558975 653768005 649490662 657670746 663351135 666322174 660116272
3757.2F60116272L973236M958267j0587311j42517O129151K016296O44760L294297
$$ 660116272 664089508 669047775 658460464 658317947 664447098 666463394 667108154 670402451
3764.9F70402451m948655m030227N482406N556412k108841j0605850M458923M240876
$$ 670402451 665453796 661423569 666905975 672462387 670353546 659747696 664206619 668447495
3772.6F68447495K73895J244354K41623J526642K27051K821960j103744q868866M268112
$$ 668447495 668721390 669965744 670207367 671734009 671961060 674783020 673679276 664810410 669078522
3781.3F69078522K939148J181945K197114m293900m28162K106858N94253Q42591K85720
$$ 669078522 672017670 673199615 675396729 671102829 670674667 672781525 673375778 674218369 674504089
3790F74504089J027375o5308m52881l05786J890030L234405n942382l885270L754349
$$ 674504089 675531464 675466156 675013275 674707489 676597519 679831924 673889542 670004272 673758621
3798.7F73758621N223160N758820j2263871j1126251P333069N736847O751099M712524
$$ 673758621 678981781 684740601 672476730 661350479 668683548 674420395 681171494 685884018
3806.4F85884018j4238205l266144P440949L214035P83233N89524K60925J832504N207672
$$ 685884018 671645813 668379669 675820618 679034653 679817886 680407410 680668335 682500839 687708511
3815.1F87708511m557342j4897843P493287P519607N041351j689682k1410827N855560
$$ 687708511 683151169 668253326 675746613 683266220 688307571 686617889 665207062 671062622
3822.8F71062622O982575K608108L321304k164383m988174L067932L614578L685303
$$ 671062622 678045197 680653305 683974609 681810226 676822052 679889984 683504562 687189865
3830.5F87189865r51919j1213761N794068Q558273q458099N88912R366913j1739959
$$ 687189865 686237946 675024185 680818253 689376526 680918427 681507339 690874252 679134293
3838.2F79134293l445740R095840o763458K128143Q214035n142517l737793M436798
$$ 679134293 675688553 684784393 678020935 680149078 688363113 683220596 679482803 683919601
3845.9F83919601K229004N27954J224976k256851K409668O333694p744827m88586j9676819
$$ 683919601 686148605 686676559 687901535 685644684 688054352 694388046 686643219 686154633 666477814
3854.6F66477814M943771J3188171j281738p79495L722610K834092J428146p317657
$$ 666477814 671421585 684609756 683328018 682548523 686271133 689105225 690533371 683215714
3862.3F83215714K186431Q374329r045181n462036O478881O911011N629578j3847809
$$ 683215714 685402145 693776474 684731293 679269257 685748138 692659149 698288727 684440918
3870F84440918r784546P817841R510879K307358j4645309L299560O380234P9269K807007
$$ 684440918 674656372 682474213 691985092 694292450 679647141 682946701 689326935 689406204 692213211
3878.7F92213211M484253q832474o746597Q237152J137314J987533M545746j5682678
$$ 692213211 696697464 687864990 681118393 689355545 690492859 692480392 697026138 681343460
3886.4F81343460K621842N774536K595825M593658n242233j0297699M858017M710312
$$ 681343460 683965302 689739838 692335663 696929321 691687088 681389389 686247406 690957718
3894.1F90957718j691132J864395J265793K858811R30328j1574478P257996J379776
$$ 690957718 689266586 691130981 692396774 695255585 696185913 684611435 691869431 693249207
3901.8F93249207o364518M979019n447692j420365J379547K556229L401337j12458
$$ 693249207 686884689 691863708 686416016 684995651 686375198 688931427 692332764 692220306
3909.6F92220306K76947l66897P11670K59170o58722J759644J803207n123520l157119
$$ 692220306 692497253 692130356 692842026 693101196 692442474 694202118 696005325 690881805 687724686
3918.2F87724686O009063o75735l632126L672562J713943K55280l425217k464447K542038
$$ 687724686 693733749 693058014 689425888 693098450 694812393 695067673 691642456 689178009 691720047
3926.9F91720047K057953J169662k046814K92511K021714m822846j240234K817230
$$ 691720047 693778000 694947662 692900848 693193359 695215073 690392227 689151993 691969223
3934.6F91969223O17981J165009P77130j020279k55127N89599K519226M11072n979614
$$ 691969223 692587204 693752213 694529343 693509064 693253937 693843536 696362762 696773834 690794220
3943.3F90794220j68381K385941J949081J733246l209457m9668K1973j716843K649613
$$ 690794220 690625839 693011780 694960861 696694107 693484650 693434982 693456955 691740112 694389725
3952F94389725P42035m11377K3575k49787k60773o30722O55594K67563J188736O2866
$$ 694389725 695131760 694720383 694743958 694494171 694233398 693602676 694258270 694525833 695714569 695777435
3961.6F95777435k158966M30603R10645L80401L61863K30178K99530q69293q39844
$$ 695777435 693618469 694049072 694959717 695340118 695701981 695932159 696231689 695362396 694522552
3970.3F94522552P23496R0790o38199M18701J07193m09088m1504M67300K84806R4223
$$ 694522552 695246048 695336838 694698639 695117340 695224533 694815445 694773941 695241241 695526047 695620270
3980F95620270k1210m45480M6234L02353N90210k21405k85797L34320k52076M36249
$$ 695620270 695599060 695153580 695199814 695502167 696092377 695870972 695585175 695919495 695667419 696103668
3989.6F96103668m66308l69187Q45642M43192j06659j262436J60599J197357K04315
$$ 696103668 695637360 695268173 696113815 696557007 696450348 695187912 695348511 696545868 696750183
3998.3F96750183j89056K36053
$$ 696750183 696561127 696797180
4000.2F96797180
$$ 696797180
##END=$$ End of the data block
