##TITLE=$$ Begin of the data block
##JCAMP-DX=5.00 $$ ACD/SpecManager v 10.08
##SPECTROMETER/DATA SYSTEM=Varian
##DATE=20 Nov 2012 13:28:44
##DATA TYPE=INFRARED SPECTRUM
##DATA CLASS=XYDATA
##ORIGIN=
##OWNER=
##NPOINTS=3735
##FIRSTX=399.26403809
##LASTX=4000.35498047
##MAXX=4000.35498047
##MINX=399.26403809
##MAXY=75.96083832
##MINY=26.94058418
##XFACTOR=1.0000000000
##YFACTOR=0.000000100000000
##FIRSTY=55.88428497
##DELTAX=0.96440572
##XUNITS=1/CM
##YUNITS=TRANSMITTANCE
##XYDATA=(X++(Y..Y))
399.3 558842850 535007935 516480865 518647728 516260757 511998062 514076157 513452148 508927422
407 508927422 515535507 524035454 524908600 523471565 520367622 522043991 524661140 521099777 518014870
415.7 518014870 523414268 535145149 521859436 483708992 505214691 522554283 524337311 521416740
423.4 521416740 527833061 531459846 525127182 521448097 514959831 511776237 514772720 508249817
431.1 508249817 501383057 500299187 501143646 500064545 498163071 505030136 511777687 514899597 511065063
439.8 511065063 507592659 509996490 509400291 512229538 515732536 515366287 513017731 513867531 519568481
448.4 519568481 523598938 524817200 523196907 525626831 529373055 525230675 522298508 520661659
456.2 520661659 520373917 523269806 523960838 523379860 521630058 526265106 531940041 528688774 525438728
464.8 525438728 524630470 522908211 519055367 515795479 515227242 509987488 504431458 501426239 497721481
473.5 497721481 497238579 498295746 502478333 501046600 496888771 500016518 504020653 502097931 496583710
482.2 496583710 494674835 493386116 493078346 494237022 496168365 495174179 490879822 496251831 503055611
490.9 503055611 503957405 502636414 500143204 497006874 493011665 491155815 489937592 490802727 489662018
499.6 489662018 487210960 487202377 485961037 486340866 486745605 487963257 486359634 485978966 486676674
508.2 486676674 481136856 477937660 476991653 474558563 469885139 467126846 465940132 463566093 464046974
516.9 464046974 463577156 463251076 460261955 460580978 463327827 461600609 458349533 454332924 455033035
525.6 455033035 454765205 453348236 453740349 453150024 452336922 450747643 453975563 458147926 460008698
534.3 460008698 459255714 458944016 461877174 464740715 470708504 473164139 471176491 471466789 473058014
543 473058014 474889336 475083618 476481819 478974533 479898071 478901596 478171921 479184418 477976494
551.6 477976494 475628090 474208984 474847145 474412346 471777534 471212196 471156807 469277382 466746445
560.3 466746445 466690521 467448769 465598030 462400551 459447517 455858040 452143555 448173141 441997261
569 441997261 439066505 438691254 438167839 437208519 436905708 438179474 438405151 439338875 439644623 441349525
578.6 441349525 443674507 445610352 448217888 449421310 451849823 454579430 457089195 460190125
586.4 460190125 465089073 469260521 470907059 472838745 474664154 475135117 474243660 475035934 474649239
595 474649239 472729225 472216301 471549454 472296753 472320862 472874184 474749413 474951744 474626274 475199661
604.7 475199661 476965714 476212845 474387856 474847374 476161728 475355148 473859673 474685173 474520264
613.4 474520264 474909782 475767479 476684418 480143280 482980728 484431839 486566353 489093628 490058098
622 490058098 491014748 491652374 491577301 492108727 492285805 493798180 496121140 498085747 500629997 502905502
631.7 502905502 503270531 504099083 506128044 506123428 506096420 506158752 505911903 505475197 504396820 505218506
641.3 505218506 505875893 506085129 507914848 510557518 511813660 512096367 512766609 512964668 514030609
650 514030609 514566193 513906670 513328819 512420959 513129234 514536133 515100670 515895386 516674881 517500000
659.7 517500000 519179535 519904366 520181122 521330910 521650314 521767769 521838150 519196968 507930717
668.3 507930717 511917419 517974129 521433144 523422737 524850807 526814537 529522896 530668106
676.1 530668106 530427284 529975739 529624176 528771896 528082504 527240562 526779976 528361206 529524727
684.7 529524727 530298843 531883774 533377533 534778214 536300850 537497101 537709312 536964149 535578537
693.4 535578537 533586845 531153526 530000763 529301834 527576790 527191467 527026443 526495056 526647263
702.1 526647263 527024384 527359962 526309738 525222435 524561386 522877579 521212234 520137596 519643326
710.8 519643326 519202423 519316521 521263733 524029846 527271996 530116997 531954384 535255013 538893661
719.5 538893661 540905838 541820297 543165245 545519676 547097092 547896194 549354057 551941566 554500618
728.1 554500618 556962280 560710373 564344177 567022781 569529152 571590118 573212509 573955765 573416481
736.8 573416481 573198814 573055191 572698479 572418404 572175713 573261337 575026321 576281090 577176170
745.5 577176170 577310257 576041985 574754181 573689919 571320305 568679543 566478882 564376526 561420059
754.2 561420059 558392525 556338120 554829254 554667473 554307365 553107872 552646904 552146797 550701485
762.8 550701485 548577499 547373390 546317139 544627686 544123573 544389801 545590515 547908974 551481056
771.5 551481056 555885773 559659233 564193840 568851929 572655411 576571579 580019379 582435417
779.2 582435417 584276772 585236664 586498985 589298248 592393150 595203514 598600769 602228889 605589142
787.9 605589142 609572830 612460823 614298401 615807724 615874252 615467606 615141830 615602722 615334625
796.6 615334625 615443153 617397232 620022583 623544350 626306496 629178734 632662201 635830383 637310715
805.3 637310715 636523972 635744705 634618568 632688141 630489502 630026855 630315056 630393257 631579170
814 631579170 633350372 635665054 637357483 639165344 640426483 640341492 639396896 636441650 633268776
822.6 633268776 631646690 630582619 627133942 623417511 622309608 622468796 622923508 623226776 623734970
831.3 623734970 623138924 621791306 620087357 617476616 614361572 609950333 605567665 602088051 599431419
840 599431419 597748528 597008057 596897354 596568642 596555786 596325531 595518799 594802055 593753662 591530457
849.6 591530457 587700157 584063301 581014671 577547684 574636765 572168770 570529861 569470634
857.4 569470634 568059692 567591896 567538071 568308983 570534821 572400932 573153381 575037231 578885193
866 578885193 581401787 583383789 588407593 594600410 599711113 605248337 611496544 617321739 623010902
874.7 623010902 628038673 630399475 631076508 631005325 630570526 629571419 627764893 625115662 621796303
883.4 621796303 619989090 618723717 618460121 618293800 616271820 614068985 611744156 609146690 605654640
892.1 605654640 601778984 597585144 593182869 589340515 585899658 583297882 581691780 580389557
899.8 580389557 578378181 577112465 576217651 574648170 573143921 570411987 566130562 561736908 558285179
908.5 558285179 553848877 547940369 542405624 538184814 534773102 530795822 527436447 524808617
916.2 524808617 521807938 518315659 514402771 510553780 507269669 504332886 501819725 499898872
923.9 499898872 498578224 497954178 497454453 497925262 498693466 499598389 501043053 502064934 503343697
932.6 503343697 505026588 506784172 507840347 508319473 508420258 508247185 509024086 510278549 511962700
941.3 511962700 514353180 517181091 519925308 522233887 523825874 523749275 522053833 518941307 514378738
949.9 514378738 508871346 502792740 496415634 489813881 483705177 478071938 472814255 467046280
957.7 467046280 460868645 454332199 447696190 441757050 434789696 427779388 419440193 410314789
965.4 410314789 402076759 393586693 385719986 377307968 369125252 361095238 354006386 346549492
973.1 346549492 338523636 331753693 324526253 317868595 310539474 304577675 298499088 292313728
980.8 292313728 287869854 283323078 280445118 276700363 274497643 273233128 272051849 271357117 270330887
989.5 270330887 270276756 269405842 270344219 269948521 269475365 270385838 270422688 270934010 271205425 272529354
999.1 272529354 272322083 272944622 273433304 273963833 276060715 276271915 277182102 277041149 277372799 276978531
1008.8 276978531 276243992 276652012 276058197 276389980 275411797 275829124 276233711 276216049 277008781 277640533
1018.4 277640533 279200649 280106831 282190285 283139610 284290371 285071297 285447445 286791096 287307262
1027.1 287307262 289643421 290714474 292063999 293435230 295497379 298035946 298841171 300633430
1034.8 300633430 300540867 301393223 301404972 301388798 302666035 302343445 302150803 300913391 301597691 301551132
1044.5 301551132 301696949 302178345 302191200 303767357 304177151 305735130 306148911 307228947 308172112
1053.1 308172112 309187641 312219963 314538345 317650795 319997654 324093018 326877518 329904747
1060.9 329904747 334906883 339099274 343717461 346303291 350409241 354103737 356486092 356943321
1068.6 356943321 355406990 353120956 347995148 344298973 339574776 335646553 332138748 328939896
1076.3 328939896 328335686 326659584 326975441 326577072 326717873 326451874 326819801 328826103 329709892
1085 329709892 332136497 333298607 336011696 338129120 340786781 344505348 346986008 350617180 352694473
1093.6 352694473 356338425 358140869 358600311 359760971 360170021 361420441 361919060 362782707 361846504
1102.3 361846504 362423401 363503609 363533478 364625320 365009117 366725769 367191887 368212509 369652138
1111 369652138 371132393 373241692 374172134 375740967 377281990 379750710 381003380 382296791 384096451
1119.7 384096451 385818520 387777100 387772598 388574867 388899994 390026474 391021996 391311493 392594948
1128.4 392594948 393207779 395258904 397156067 399506569 401814995 404629822 407413788 407692337 407562790
1137 407562790 406590157 406018906 403815536 400739746 397890587 394204102 391015816 387300072 385380440
1145.7 385380440 382482491 379294052 377346458 375536728 373995743 371233788 369803047 367899551
1153.4 367899551 366737289 365772209 365135803 365185013 364076767 364787598 364987259 366065292 366931725
1162.1 366931725 368279076 371116219 373559494 377141876 379873047 383508797 386844139 390738525
1169.8 390738525 395580330 400747414 406576881 410996017 416582108 422076797 427977333 434207878
1177.5 434207878 440484047 446581459 451370125 457268257 462623863 467571297 472109756 476402931
1185.3 476402931 481281738 485555305 489526787 493263016 497289200 500954552 504038734 506433487
1193 506433487 508487015 510352974 511089096 511723785 512207642 512829361 513400688 513486443 513919868 514238243
1202.6 514238243 514922791 515999565 517589874 519310379 520938530 523073425 524516754 525754128
1210.3 525754128 527539215 529036331 530656967 532361870 533722115 535530968 537547340 539306068
1218 539306068 541198578 543628540 545969162 547263641 548211098 548889694 548756332 547894440 547030525
1226.7 547030525 546552505 545610161 543948822 542523804 541750603 541791687 541764183 541408157 541679153 541567116
1236.4 541567116 540881157 540443764 539730377 538737450 537720222 536616783 535620041 535208015 535377655
1245 535377655 535670776 536389084 537735519 539100685 540347519 541370697 542227287 543129082 543860435
1253.7 543860435 544494438 545235138 545492859 545346527 545216255 545254669 545455246 545931091 546954613 547506790
1263.4 547506790 547872047 548885612 549915543 551011848 551934662 552551689 553360558 554347153 554758682
1272 554758682 554980812 555427399 556145439 557074203 557163658 557501831 557918015 557866592 557726021 557228165
1281.7 557228165 556859169 556111755 555482864 554826546 554278259 554171257 553750153 553573303 553453751 553502045
1291.3 553502045 553447571 553034210 552361717 551581116 550955582 549775467 548381882 546681671 544919586
1300 544919586 543442612 542435837 542133293 541358833 540239449 539447556 538584595 537651787 536981964
1308.7 536981964 536313019 535353127 534094849 532748489 531745682 530813637 530042000 529159508 528206749
1317.4 528206749 527909927 527657890 527453308 527461052 527153397 526351509 525032425 523342628 521114235
1326 521114235 518528442 515963516 513211670 510635834 508519058 506882095 505185814 503171120 502228203
1334.7 502228203 501665154 500708275 499537430 498614578 498114433 497887459 497953186 497634163 497142334 496506081
1344.4 496506081 496650810 497241898 497771873 498331757 498435020 498708267 498917732 499327774 499267769 499180107
1354 499180107 499021301 498132401 497611389 496638680 496166115 495807533 495178032 494993286 494395752 494428139
1363.7 494428139 494724617 495077438 494873619 494870682 494806404 494484329 494719658 494234047 494289818 494402695
1373.3 494402695 495031204 495728874 496145096 497081604 497502747 498447952 498944092 499517708 499855843 500076828
1382.9 500076828 500915794 501493530 502743149 503699493 505498581 507294159 508966599 510602493 511436310
1391.6 511436310 512382965 513277168 514201126 513341522 513154144 513170662 512500114 511140747 510293083 510467987
1401.3 510467987 509646225 509145851 508681526 507637329 507480965 507304306 506856232 505822258 504978905
1409.9 504978905 503660545 502486420 501447945 500369072 499681931 498620033 497974167 497510796 498045082
1418.6 498045082 496523972 496393013 498254051 498757133 499309807 498786278 499275780 499841461 499339447
1427.3 499339447 499518929 499437294 499923286 500106392 501185570 501807098 502531433 504576874 505616455
1436 505616455 505275726 505558243 508070641 509217911 509533348 509900093 509656029 510449371 510606270 510983467
1445.6 510983467 510849571 511370239 511540489 511985130 513295670 512567711 512597618 512219391 512425652 511832504
1455.3 511832504 509846420 507554092 504248047 506501350 505648079 507152824 507726898 508217354 510182686
1464 510182686 510014229 512555237 514254799 517429810 519734001 522710609 525904961 527161217 531426392
1472.6 531426392 533675919 539483261 542616386 546301079 550293236 553692741 557855263 560882339
1480.3 560882339 565412178 567896271 571265068 573798409 575629082 578547783 579740334 582512741
1488.1 582512741 583772430 586016693 587153091 589978027 593214684 594717827 597470779 598822441
1495.8 598822441 600405159 602449455 603507118 603908577 605760155 607845459 608380814 609747543 610224533
1504.5 610224533 611800804 610322075 606987190 612407608 614181213 617040672 618480377 619778442
1512.2 619778442 619425621 620788155 621701736 621012306 622808990 620563354 623043442 624973068 625098686
1520.8 625098686 625238686 625440598 629005699 630402527 630964622 631113472 632747116 633287277 633111916
1529.5 633111916 634141045 633543854 633853531 633177681 633150063 634975967 636151161 637847519 639165955
1538.2 639165955 638820419 634100342 638757286 639173431 638034401 639870796 639418449 638587074 639248314
1546.9 639248314 640293274 641028442 640882416 640151901 641694260 643773880 644258194 642518692 642143555
1555.6 642143555 645090790 646930923 637795067 637146835 638279839 640352173 640714493 640888367 640593185
1564.2 640593185 639250526 639981651 640923080 641653824 640876389 637111244 638382416 639391098 638533096
1572.9 638533096 637494087 637397881 635844154 630716972 631864738 632778587 632835693 632636948 632579308
1581.6 632579308 632683105 632118835 631411667 630516968 629669571 628544769 627001343 626012573 624341660
1590.3 624341660 622750740 621483917 620765839 619822769 618514709 617934837 617114296 616553497 615372047
1599 615372047 614155464 612611771 611269112 610284233 607886581 606163025 604472160 602934265 600640717
1607.6 600640717 599182434 598172722 596014595 594706230 592605896 591201782 589263229 588734245
1615.4 588734245 587831726 579707832 580137329 579392929 578074303 576073723 575401611 573971291 569637451
1624 569637451 569654465 569254456 569555244 566730995 564115601 563913918 563325081 562578926 560921593 560869484
1633.7 560869484 560535622 557004623 556428642 557599258 557221870 557388153 558042526 557577629 558682976
1642.4 558682976 558649101 559489059 560400238 558434181 557738953 557297745 560005798 561374779 563857613
1651 563857613 566166382 560742950 558697662 563906822 568069649 569666061 571012154 571779022 573032455
1659.7 573032455 574460564 576012306 577148285 576445618 579031372 580782013 582563362 585137024
1667.4 585137024 587525215 588097115 588823738 591999054 593239326 595575981 598383026 599568977 599930115
1676.1 599930115 602761765 605998726 608003731 610325546 612137489 615136681 618890266 620114326
1683.8 620114326 619826469 624028053 628604889 631676178 633613739 635941658 637754402 639956856
1691.5 639956856 642317047 644012985 646339035 648975983 649320908 652600327 655797958 659254837
1699.3 659254837 660318298 658120422 662435837 665612793 667311859 667856674 669417572 669710541 670094681
1707.9 670094681 671581650 672575989 673601074 675331192 676913605 678358002 679166489 678955994 681181335
1716.6 681181335 682271423 678188858 680485229 682660828 683557739 683904037 684200287 684326019 685197220
1725.3 685197220 686153259 686959839 688162003 689440918 689458008 688829422 691033783 693266296 691241074
1734 691241074 688609161 690870209 692963943 693507843 695207748 694865952 693401642 696100159 697384262
1742.7 697384262 696813583 697099838 699581680 701491241 701990128 702341843 702437057 705485306 705894470
1751.3 705894470 704969101 707486572 709206390 710598526 712045212 711734772 712610397 714566498 715563660
1760 715563660 717020340 715953217 715675278 718062515 719123917 720045319 721256485 722439270 721259613
1768.7 721259613 722433243 725117798 725007935 723888092 722633514 725086136 726604004 725910263 726659851
1777.4 726659851 726694565 727565384 728094101 728104935 728848190 729674301 730506363 730224686 730649109 731731796
1787 731731796 732217484 732066040 732587204 732493896 732594681 732202072 731237488 733272018 734154892 733965225
1796.7 733965225 734522171 735669022 736073380 735190201 736796188 737029877 737233124 737926178 737465591
1805.3 737465591 737580795 737739639 737565002 737444992 738231812 738030624 738368225 739384308 739648895
1814 739648895 740637589 741155090 741872101 741949463 741680527 741833572 741539154 741614151 741178436 741815643
1823.7 741815643 742411041 740547256 740552826 741974030 742977905 743205872 742290497 742847366 744399643
1832.3 744399643 744581299 744674149 744568253 744399414 744479980 743810349 744198761 744237366 744472351 744567184
1842 744567184 745165024 745715790 742752075 744557724 746396255 746711960 746487274 746411285 746477737 745838165
1851.6 745838165 745790787 745490570 745630569 745487976 745393753 746235046 746727295 747156754 747007141 747443695
1861.3 747443695 747281799 747042542 747259598 746929398 746895370 746115494 746393890 746017075 745268326 746353378
1870.9 746353378 747230682 747829361 747759323 747971115 748114166 748246841 748137054 748087692 748324814 747822800
1880.6 747822800 747659302 747534790 748167419 748701935 748893661 749442825 749269028 749912338 750484695 749432068
1890.2 749432068 749256439 749800720 749729309 749948349 749814377 748807602 749426270 749912262 750173645 750492401
1899.8 750492401 750652771 751169357 751244736 751365128 751423264 751406937 751010056 750646744 750261612 749913406
1909.5 749913406 749750671 749497223 750301056 750291519 750424347 750901108 751277847 752709045 751698380 750845642
1919.1 750845642 751485062 751576157 751669159 751099319 750526276 750385361 750415878 750329971 750398407 750511627
1928.8 750511627 751110535 751850052 752106094 752584076 752624283 752459717 751731339 751231689 751054077 750631409
1938.4 750631409 750567398 750292282 750723801 750337296 749530563 750631256 751853943 752459564 752433777 752568665
1948.1 752568665 752612915 752823486 752388153 751626663 751405716 751217651 751397552 751059875 751202621 751664124
1957.7 751664124 751736298 752179718 752821426 753317184 753076324 753162918 753240204 753274689 753430252 752875977
1967.3 752875977 752472916 752254486 751978302 751614227 751986084 752562943 752748260 753053360 753287582 753577042
1977 753577042 753607712 753812256 753682632 753250046 752948761 752806396 752877350 752443771 752372360 752491150
1986.6 752491150 752962036 753167267 752665100 753058777 753394165 753218384 752990112 753195572 753392563 753141098
1996.3 753141098 752844620 752476807 752249451 752093658 752394485 752563934 752642670 752644119 752611084 753036270
2005.9 753036270 753118286 753188553 752680206 752091522 751783600 751472778 751661682 751550674 751533432 751555710
2015.6 751555710 751289673 750749664 750856781 751399155 751170807 750917816 750606232 750072250 749230881 749039764
2025.2 749039764 749103317 749113083 749492187 749072571 749039078 749095154 749372940 749723129 749279938 749244003 749027939
2035.8 749027939 748797607 748327179 747886658 747633209 747197723 746983414 746939087 747242737 746955109 747037048
2045.5 747037048 747316818 747147064 747160492 747069473 747271271 747049561 746793289 746423950 746177826 746108704
2055.1 746108704 745603027 745706329 745930786 746334915 746492081 746934586 747519608 747172318 747193222 747294312
2064.7 747294312 747366028 747085266 746765518 746510773 746008911 745770264 745684128 746255875 746366348 746240616
2074.4 746240616 746434631 746795425 747447586 747360306 747268600 747264786 747055511 746647034 746434479 746541214
2084 746541214 746367722 746160812 745781860 745934219 746514053 747090912 747365417 747183914 747362747 747870102
2093.7 747870102 748219986 747884674 747702103 747549057 747119446 746772385 746499329 746683426 746834335 747178192
2103.3 747178192 747373352 747597046 747882538 747883606 748206863 748102875 747942657 747817688 747746811 747662964
2113 747662964 747431564 747643967 747754974 747733917 747483139 747540283 747804260 748152237 748571396 748498840
2122.6 748498840 748674088 748446274 747981873 747773285 747863770 748070679 747657166 747468719 747673721 747967834
2132.3 747967834 748039093 747952805 747888870 748047943 748345642 748266602 748142014 747961960 748059158 747923355
2141.9 747923355 747659073 747672653 747736053 748043518 748035660 748065414 748122482 748418121 748372498 748184357 748472137
2152.5 748472137 748183060 748201065 748132095 748505402 748696976 747809067 747876358 748368683 748847733 748678970
2162.1 748678970 748579025 749145584 749618683 749892654 749603043 749734192 749561920 749454193 749724503 749503250
2171.8 749503250 749636765 750029221 750474091 750817795 751231308 751277466 751118088 751287460 751704330 751984100
2181.4 751984100 751568756 751625443 751852875 751980286 752084961 752242813 752416687 752254410 752676086 752876358
2191.1 752876358 753126297 753435745 753725891 754151993 754033890 754059219 753717194 753771820 753824539 753369675
2200.7 753369675 753300629 753681412 754401550 754340210 754481506 754707565 754911270 755142441 755261612 755837860
2210.4 755837860 755392227 755241623 755640182 755700836 755663757 755627213 755857239 755891342 756423340 756759872
2220 756759872 757040329 757044296 756625061 756915894 756987762 757243195 757352371 757088394 756957474 756887589 756946106
2230.6 756946106 757028351 757101593 757067108 757618561 758029709 758062363 757838364 757697372 757816162 757529373
2240.3 757529373 757789078 758007507 758194122 757889099 757258987 757662811 758155975 758395920 758021698 757895126
2249.9 757895126 757971039 758187637 758513336 758339615 758615036 758537903 758474197 758543930 758610916 758416214
2259.5 758416214 757866135 758066101 758028030 758130646 758479080 758744431 758651428 758367920 758134308 757809448
2269.2 757809448 758480606 758731384 758722763 758862305 759169312 759608383 759207840 759104233 758889999 759138184
2278.8 759138184 759418182 759138718 759086685 759003067 759104691 759105072 759348907 759031830 758791733 758610916
2288.5 758610916 758568802 759200821 758751526 758643570 758418808 758157272 757860718 757464676 757575989 756772079
2298.1 756772079 756637192 756155319 755979767 755978241 755796967 756551971 755951385 755736847 755430069 755191574
2307.8 755191574 754516296 753043747 752720032 751627121 751493225 750815582 750398788 750985336 750176620
2316.4 750176620 749628525 748942719 748780823 747992783 747309265 747328491 746998138 745968781 744676132
2325.1 744676132 745105057 743918533 743103943 742858658 741578369 741239853 741718597 742356873 741517487
2333.8 741517487 742099762 741927795 740979309 740521393 739406586 738966293 737865906 738503571 738923645
2342.5 738923645 739020691 738922195 738682632 740750732 742696228 744813004 745898209 745449448 743677979
2351.2 743677979 741574173 739464951 736553802 735127487 733857040 732420425 730944977 730211411
2358.9 730211411 730161743 730093307 730991058 730141296 730095901 730689011 731923447 733471298 734395905 735702972
2368.5 735702972 736736755 738572006 739016876 738591995 739273682 741593781 743824005 744648056 746193314
2377.2 746193314 747842407 749219742 750431366 751344452 751806412 752043457 752178040 751985168 752425995
2385.9 752425995 752941666 753256302 753331757 753269958 753361740 753376160 753643951 753664856 753608627 753303146 752969894
2396.5 752969894 752512665 751955261 752148132 751993713 751656647 751272736 751348114 751856308 751979294 752087555
2406.1 752087555 751722107 751589355 751630402 751541595 751206512 750549316 750164185 749820786 749465942 748827667
2415.8 748827667 748588333 748438110 748429413 748827133 748799362 749077454 749217987 749254608 749144287 748426056
2425.4 748426056 747465897 746744614 746613159 746195679 745662308 745126495 745026855 745443497 745539551 745460815
2435.1 745460815 745539246 745961533 745818253 745367279 744936218 744185638 743166351 742336655 742042313 741732483
2444.7 741732483 741909790 741895905 741838684 741983109 741757736 741868973 741864014 741876221 741410599 740801926
2454.3 740801926 740606155 740289612 740000610 739342651 738892441 738582535 738388596 737945251 737580185 738141785
2464 738141785 738366547 738220215 737791367 737531433 737362137 737178040 736818848 735758286 735440674 735242157
2473.6 735242157 734813538 734613495 734693985 735096130 734803772 734464722 734605713 734554749 734168091 734006882
2483.3 734006882 733787384 733633499 733492813 732701950 732009506 731619873 731934280 731974869 731638718 731749344
2492.9 731749344 731693954 731986465 732036896 731964951 731590500 731073532 731037369 730433121 729964523 729588394
2502.6 729588394 729334106 729438095 729481430 729721756 729976044 729938965 729623947 729590683 729531403 729311600
2512.2 729311600 728829651 728389511 728087082 727526779 727395172 727185364 727256775 727406769 727242203 727357330
2521.9 727357330 727462311 727600632 727265778 727131042 726895676 726164932 725574265 724991837 724711990 724092026
2531.5 724092026 723828201 723951721 724060822 724421387 724186172 724032669 724133453 724060135 723747864 723171692
2541.1 723171692 722460098 721766739 721041641 720233154 719986496 720190277 720557938 720337372 719769897 719691544
2550.8 719691544 719710999 719849625 719825668 719580460 719047699 718527679 718013077 717157516 716600876 716366119
2560.4 716366119 716275177 716290436 716420593 716343689 716453323 716493378 716278076 716468277 716071701 715597153
2570.1 715597153 714846497 713856964 713605347 713334122 712983322 712411575 712173386 711990128 711864777 712069168
2579.7 712069168 712035828 712271576 712212982 712067719 711562729 710764236 710539246 710446625 710459290 709934311
2589.4 709934311 709250565 708918228 708677444 708523254 708737183 709010315 708636093 708517685 708558884 708450165
2599 708450165 707944489 707267075 707047119 706566010 706179810 706055450 706197205 706259613 705879211 705902481
2608.6 705902481 706271057 706107101 705038910 703982849 703799973 704105835 703600311 702862625 702587357
2617.3 702587357 702113342 701896973 701411667 700949173 700989914 701067276 701017227 700575790 700120468 699517822
2627 699517822 699023743 698532486 697936020 697076035 696169662 695918121 695340805 695003128 694680481 694305649
2636.6 694305649 694626541 694345779 693760529 693191910 692914810 692825928 691875687 690785522 690131378 689396286
2646.3 689396286 688853226 688600388 688065948 688001556 688009872 687401123 686943283 686873245 686870270 686128998 685297165
2656.9 685297165 684992371 684631500 683880463 682918777 682216492 681961517 681885223 681356812 681130295 681144180
2666.5 681144180 681214294 681313171 680502777 679871216 679503555 679047012 678340607 677449493 677120743 676658020
2676.1 676658020 676306610 675983887 675611877 675694962 675678482 675261230 674817429 674545670 674192810 674208374
2685.8 674208374 674146729 673587494 672593384 671492538 671082993 670634842 670279694 670307007 670158615 669588242
2695.4 669588242 669181976 669246979 668948212 668553619 667918320 667228546 666681976 666241760 666060867 665271149
2705.1 665271149 664750366 664584808 664161530 664053497 663869629 663222504 662547455 662253418 661854248 661586761
2714.7 661586761 661426468 660864487 660404053 659869690 659207764 658884583 658672714 658199768 657739944 657466812
2724.4 657466812 657437134 657443695 657068329 656562805 655897217 655074081 654574356 654608154 654205780 653330917
2734 653330917 653124619 653113480 652936020 652652512 652496414 652543411 652357635 651872711 651435013 651523819
2743.7 651523819 651316452 650639572 650022888 649577789 649351501 649080505 648993912 648734589 648357239 648299789
2753.3 648299789 648375015 648179779 647825623 647747345 647280579 646868744 646660614 646149673 645707703 645295410
2762.9 645295410 645238266 645243912 645037308 644858093 644578857 644394073 644386215 644336472 644002075 643457870 643023911
2773.5 643023911 642834854 642459259 641662979 640802231 640491638 640642090 640416107 640066681 639948120 639725571
2783.2 639725571 639232178 638782120 638380013 638065071 637786636 636991043 636413078 636089211 635525742 634622879
2792.8 634622879 633809776 633671455 633155136 632567673 632124405 631487236 631014519 630674133 630222778 629172630
2802.5 629172630 628601837 628086967 626950722 626188202 625434113 624621582 624073181 623725662 622872314
2811.2 622872314 621768188 621027565 620452499 619865417 618871117 618130608 617416344 616358948 615252914
2819.8 615252914 614139938 613257828 612304993 611257362 609964447 609109535 608732796 607937469 606975899
2828.5 606975899 606076241 605372314 604383469 603280716 602075424 600710144 599740562 598595200 597553825
2837.2 597553825 596802597 595751381 594247818 592529068 590999756 589629440 588108482 586329956
2844.9 586329956 584577866 582775497 581121559 579454041 577686729 576265335 574876862 573579941
2852.6 573579941 572113533 570619469 569640541 568825951 568059311 567537766 567149696 566273079 565024834
2861.3 565024834 563903198 562777863 561361122 560000343 558663940 556919785 555191803 553327332
2869 553327332 551411362 549796791 548521461 547018585 544763069 542660828 540579948 538205605 535853767
2877.7 535853767 533926964 532389450 530817871 529571075 528254089 526734276 525361214 524288864
2885.4 524288864 523337975 522576675 522288132 521742897 521256828 520735779 520240517 520120239 519929428 519899178
2895.1 519899178 519489975 519181480 519162865 519033432 518796196 518089333 517560005 516999741 516363449 515685158
2904.7 515685158 515029564 514590874 513865623 513162842 512263870 511270561 510445099 509738808 508844109 507399254
2914.3 507399254 505973625 504440536 502438011 499948082 497914238 496415901 494930687 493933029
2922.1 493933029 492748337 491601410 490785370 489792824 489130707 489005737 488705711 488559875 489170189
2930.7 489170189 489421654 489385109 489746056 490857887 492342567 493714867 495221176 496299515 498073578
2939.4 498073578 500379333 502380829 504605598 506377907 508321075 510697670 513171730 515633507
2947.1 515633507 517422256 519070549 521491966 524073830 526252823 528626595 530502205 531922264
2954.8 531922264 533941193 536277046 538356400 540246391 542112541 544020424 546260757 548022537
2962.6 548022537 549637260 551648788 553485222 555127220 556632957 558474808 560103722 561798019
2970.3 561798019 563705330 565374641 567020683 567847557 568891678 570546494 571907043 573460770
2978 573460770 575225220 576336441 576897125 578018837 579121475 579864273 580778770 581898155 582866096
2986.7 582866096 583568916 584483147 585223846 585945816 586672058 586986084 587120247 587392349 587913818 588335228
2996.3 588335228 588677635 588898392 589188461 589566727 589768944 589597397 589029350 588765526 588779793 588882370
3006 588882370 588768501 588339424 588023529 587906189 588053017 587943497 587167397 586599617 586792870 586401558
3015.6 586401558 585348740 584253960 583345146 583126945 582265930 581070976 580294380 579631958 579224014
3024.3 579224014 578458557 577553177 576793747 576195679 575331879 574487801 574069595 573112640 572186852 571380386
3033.9 571380386 570199890 568959999 567853508 566953621 566283569 565706711 564686394 563488922 562664413
3042.6 562664413 562205162 561214333 559742279 558554878 557113533 555848579 555049591 554003258 552784653
3051.3 552784653 552060852 551367264 550205803 549270973 548319664 547471428 546624794 545205612 543569946
3060 543569946 542380867 541729965 540951157 540138283 538996582 538097343 537705574 536389389 534696655
3068.6 534696655 533374062 532393799 531536751 530782509 529846916 528387337 527234993 526371613 525608902
3077.3 525608902 524566841 523111458 521951981 520807381 519975967 519854698 519136467 517439346 515976677
3086 515976677 514834785 513819199 513130226 512301979 510833588 509361877 508597450 507600327 506636238
3094.7 506636238 506019173 504953690 504063034 503467216 502531815 500939980 499285355 498209763 497518806
3103.4 497518806 496736107 495590820 494337959 493093834 492325554 491663284 490679207 489681015 488602791
3112 488602791 487709732 487119102 486490669 484948463 483579483 483100891 481838684 480159340 479063911
3120.7 479063911 478524399 477630882 476385956 475885277 475296936 474012375 472816200 472100105 471328163
3129.4 471328163 470401497 469315948 468293037 467436218 466109276 464890327 463887825 463287125 463072548
3138.1 463072548 462107162 460857658 459956017 459022255 458154716 457715607 456910210 455654755 454760742
3146.8 454760742 453983269 452914124 451520424 450666504 450382462 449838600 448642082 447295113 446945801
3155.4 446945801 446546822 445384407 444374542 443329430 442268295 441720810 441104240 440124474 439027901
3164.1 439027901 437964630 437537460 437153282 436379585 435171814 433812256 433264160 432979698 432509460
3172.8 432509460 431383743 430467110 430119629 429130440 428379555 427363625 426344070 426137314 425455971
3181.5 425455971 424580994 424026489 423512878 422923737 422256470 421322594 420573349 420311432 419805679 418796654
3191.1 418796654 417574081 416843452 416412201 415735092 414861679 414280319 413915291 413147736 412579193
3199.8 412579193 411976357 411249771 410777435 410251579 409591522 408857574 408154869 407088470 406473007
3208.5 406473007 406386261 406066055 405818520 405129623 404548836 404172897 403267632 402437553 401743622 401316681
3218.1 401316681 401096954 400475388 399649200 398859940 398160934 397771072 397595634 397403183 396831932 396288338
3227.8 396288338 396265068 396091728 395227470 393968506 393291817 392991753 392599754 392211075 391764412 391301689
3237.4 391301689 390544090 390436440 390513496 389919930 389275475 388493156 388458939 388637199 387983322 387272301
3247 387272301 386682701 385726089 384973984 384849739 384369774 384201050 383816338 383195839 383464890 383010559
3256.7 383010559 382091255 381703224 381719818 381391830 380706406 380530396 380551147 380448914 379831352 379584007
3266.3 379584007 379423180 378548355 378093567 378220596 378205605 377535553 376957741 376418114 376008759 376004143
3276 376004143 375444221 374857979 374700699 374779015 374366570 373665581 373503036 373542099 373574791 373098335
3285.6 373098335 372308350 371980362 372131462 371965904 371646729 371400108 370787125 370491562 370401688 370335464
3295.3 370335464 369906120 369279709 368774605 367941589 367802658 367695999 367220116 367380867 367855682 367890015
3304.9 367890015 367161980 366458511 366221237 366127548 365374222 364634476 364723701 364505844 364039764 363811684
3314.6 363811684 363480721 362994270 362712288 362330170 361702766 361209755 360957794 360917015 360393982 359855576
3324.2 359855576 359441338 359005051 358804588 358327217 358099289 357854118 357415009 357030983 356707916 356570358
3333.8 356570358 356112442 355860214 355530739 354944191 354700661 354304352 353704720 353390846 353495445 353053322
3343.5 353053322 352107391 351725388 351789017 351643295 350999603 350424309 350152168 349836845 349464951 349135513
3353.1 349135513 348835106 348285027 347500839 347168541 346918449 346413651 346208534 345583458 344858894 344886513
3362.8 344886513 344943237 344462700 343799477 343635406 343242187 342819939 342652473 342106018 341883621 341513939
3372.4 341513939 340923271 341017876 340847054 340085487 339643135 339196663 338736877 338652344 338212318 337826500
3382.1 337826500 337739983 337455444 337443237 337495155 337234077 337073135 336798782 336414032 336594963 336344948
3391.7 336344948 335413132 334923744 334869385 335255127 335241623 334564705 334276657 334405899 334204140 333781166
3401.3 333781166 334020424 334251022 333887939 333368950 332988625 332695694 332689590 333112564 333111343 332872925
3411 332872925 332872467 333199310 333578148 333301773 332879181 332616158 332241020 332022934 332142525 331964455
3420.6 331964455 331584167 331600723 331742973 332000923 332385597 332686043 332732162 332970963 333278084 333149414
3430.3 333149414 332906990 332789917 333057632 333321991 333521500 333562126 333116837 332904320 333154411 333453293
3439.9 333453293 333714943 333880539 333657722 333997040 334627228 334923630 335022545 334591866 335296021 335596313
3449.6 335596313 335305023 336178703 336749802 337137871 337170639 337275925 338158569 338567810 338534584 338538170
3459.2 338538170 338972816 339374466 339682541 339890900 340137367 340432091 340331841 340949516 341851158 342347488
3468.8 342347488 342389297 342343140 342905159 343184662 343588486 344238434 344564972 345143814 345956459 346743546
3478.5 346743546 347504234 347980843 348145409 347731590 347278709 348356361 349476471 349777794 350400467
3487.2 350400467 350734520 350724182 351039619 351883125 352769127 353134384 353305969 353929405 354659767 354959068
3496.8 354959068 355590363 356216087 356709671 357125664 357590599 358339195 358600769 358701782 358971214 359369278
3506.5 359369278 360028954 361779060 363052444 362786636 363605385 364060974 364101715 364423294 364827957
3515.1 364827957 365480766 365801659 366707077 367623482 368127213 368644867 369871025 371331367 371080627
3523.8 371080627 370755959 371375694 372506142 372744370 372535553 373140144 374562340 375960541 376372375
3532.5 376372375 377044449 377697487 379131927 379666557 378684502 379772110 380965538 381542473 381583328
3541.2 381583328 382510872 384102211 384812317 385602493 386337357 387283936 386437759 387253113 388857613
3549.9 388857613 389977722 392137909 391429520 391870651 393105202 394399643 395994072 396020889 397665138
3558.5 397665138 398854599 399140434 399568634 401575584 402880745 403254967 407452965 407428093 407080803
3567.2 407080803 408132744 406875343 409886131 411364250 412836876 415085106 416525688 417348938
3574.9 417348938 418799706 420818329 420863876 422824936 424264641 424869385 426692162 428513870 430245285
3583.6 430245285 430821037 434666710 436421013 434620056 436561050 436016922 439158173 442626381 445112534
3592.3 445112534 445814095 446738777 450192680 448674698 450956993 454286842 454896088 457953644 458479385
3601 458479385 459531212 461973457 463553543 465575027 468552399 470847359 470156212 474119453 473564262
3609.6 473564262 472226982 479577103 481314278 479310608 483220482 482933083 486770630 491237259
3617.4 491237259 490672607 492468834 492025375 492618217 496169395 499203987 501650848 503728523 505324669
3626 505324669 507815819 514376602 513312988 502980614 508496513 514019775 518927345 519291725 517875137
3634.7 517875137 520723953 523954964 526330452 526723557 528146782 530483513 532903214 533502197 533661385
3643.4 533661385 537025871 540960159 546201401 544779472 540464172 545500946 546659622 544443626
3651.1 544443626 544087296 549821854 554017143 558042526 562821922 554023590 555548439 561050568
3658.8 561050568 562710419 564042511 564661484 566842194 567893410 569552956 571469345 572173309 575946732
3667.5 575946732 578026237 578313141 578721275 572676849 575621452 583821716 592231293 588308144 570833664
3676.2 570833664 577383995 586007309 590039062 586868401 587594223 591264267 593257179 594746780
3683.9 594746780 595281868 595983047 599831505 605484543 597192993 595776749 605133400 598234253 597690964
3692.6 597690964 603536034 604088898 605088692 605151482 605388031 606944580 607482529 610416031 613393364
3701.3 613393364 607146873 605278473 610880432 612995148 613815880 613935165 616004524 619547424 612580948
3709.9 612580948 617956009 622127113 608669853 613942337 618726921 619462814 620290222 622423134
3717.7 622423134 623557472 620743599 622546539 628126755 623026543 618089256 624380264 626028900
3725.4 626028900 625044670 621866150 622351875 626467323 627183228 632659988 628663521 621845589 633386955
3734 633386955 634756126 623832741 625499420 628879929 629351006 632799377 636721649 631994133 635037498
3742.7 635037498 647441788 634465027 618920021 630436516 636844788 643377762 638510933 628666039
3750.4 628666039 641150970 634405861 628101921 634741707 640008698 644004745 638461914 640517731
3758.2 640517731 646166916 638334236 636656685 641229630 643162003 643604584 646573868 643697357
3765.9 643697357 639876480 643637238 648962097 649126968 639719849 642208710 645638046 645820312 647247162
3774.5 647247162 647607880 648604279 648899765 652226410 652474594 643521042 646207581 649478149 651026993
3783.2 651026993 652642441 648793564 648268204 650119019 651429214 652184982 651403656 651936188 652761307
3791.9 652761307 653204269 652654800 654374084 658141861 653797379 649744720 651549911 655392303 661379852
3800.6 661379852 654364166 644973679 649869614 653438568 658488159 664605103 654929047 650330048
3808.3 650330048 655658264 657894516 658188248 658164139 657995148 660076828 666240082 663126144 647780838
3817 647780838 653523788 659821091 665236435 666939850 648495712 652300568 659075012 660940323
3824.7 660940323 662846985 663146973 659145050 658726959 660732880 664625702 666475906 657891312 660959702
3833.4 660959702 668200455 661913681 661591721 669781799 660458679 656079483 665175781 660393982
3841.1 660393982 660030670 667079468 664233932 660100937 662998047 664993591 665920029 667816925 665853653
3849.8 665853653 667861099 675487213 672052231 673183746 652739563 654226303 666496277 665791779
3857.5 665791779 663635635 666104279 668948593 671447296 664917755 664849396 673153458 667546921 660429230
3866.2 660429230 664975662 671208038 677844543 669027939 658906708 663287811 670523911 675146332
3873.9 675146332 664860153 665296097 669482498 669568100 672049408 676624680 670662918 663469238 670208588
3882.6 670208588 671463928 672497253 677175293 665030594 666745453 670414734 670846634 674773331
3890.3 674773331 673439560 665790482 668007202 672139435 670815125 671532440 672283173 675046844 678374939
3898.9 678374939 668806839 673258896 674652481 669170990 675164032 672135773 669873352 670044098
3906.7 670044098 670615540 672925339 672775650 673113022 673189240 673535919 673741531 673448257 675001755
3915.3 675001755 676434402 672426376 669928589 674886703 674495621 670521851 673225708 675234146
3923.1 675234146 676226730 674068222 671197891 672940216 674696350 676069489 675133972 674387207 675680389
3931.7 675680389 672876205 671955490 674175034 674562759 674868927 675492859 675569839 675455475 674987335
3940.4 674987335 676639481 677659149 672834702 672557831 675228271 676444626 677130508 675122223 676176605
3949.1 676176605 676607132 674372177 676189346 676654739 676059799 676517181 676853485 676813889 675423126
3957.8 675423126 675322495 676160736 677279510 677333908 675862427 675721664 675851974 676078796 676662140
3966.5 676662140 677435913 677737045 676248856 675322113 676449661 677122803 676919250 677239304 677187881
3975.1 677187881 676789398 676908493 677438126 677486267 677097321 677237625 677561874 677722397 677529984 677185822
3984.8 677185822 677024155 677629547 678105698 677900620 678207169 677942505 677814331 678359756 678809204 679055328
3994.4 679055328 677809143 677020950 677727737 678282776 678322983 678028641
4000.2 678028641
##END=$$ End of the data block
