##TITLE=$$ Begin of the data block
##JCAMP-DX=5.00 $$ ACD/SpecManager v 10.08
##SPECTROMETER/DATA SYSTEM=Varian
##DATE=20 Nov 2012 13:28:38
##DATA TYPE=INFRARED SPECTRUM
##DATA CLASS=XYDATA
##ORIGIN=
##OWNER=
##NPOINTS=3735
##FIRSTX=399.26403809
##LASTX=4000.35498047
##MAXX=4000.35498047
##MINX=399.26403809
##MAXY=76.02706146
##MINY=26.92838287
##XFACTOR=1.0000000000
##YFACTOR=0.000000100000000
##FIRSTY=54.21901703
##DELTAX=0.96440572
##XUNITS=1/CM
##YUNITS=TRANSMITTANCE
##XYDATA=(X++(Y..Y))
$$ plain form
399.3 542190170 526344719 514182587 516433830 514163437 504073029 507732620 516784973 515214310
407 515214310 511626015 510446625 514894905 520037041 520390205 518794060 517643089 513061256 511448784
415.7 511448784 513847351 503767662 484587402 492743073 510611725 517276230 518056526 517233162
423.4 517233162 516562386 521435928 521836166 517879410 512558441 508070221 508260384 504443207 504671135
432.1 504671135 506199074 506352081 508175163 504829254 503086739 503690262 502701225 502242584 504091568
440.7 504091568 502612000 501996384 508391533 510727882 511241112 512954674 517290726 521102829 521201706
449.4 521201706 522314186 525888939 527988777 528353539 530248260 527821274 520049362 515530281 523253250
458.1 523253250 523091927 515180626 514553452 516759453 518110733 520500717 523348045 525421944 519030266
$$ packed form
399.3E42190170j5845451j2162132K251243k270393j0090408L659591R052353j570663
407E15214310l588295j179390M448280N142136L53164j596145j150971m581833j612472
415.7E11448784K398567j0079689j9180260Q155671J7868652O664505P80296q23364
423.4E17233162o70776M873542M00238l956756n320969m488220J90163l817177K27928
432.1E04671135J527939J53007J823082l345909j742515O03523r89037m58641J848984
440.7E04091568j479568o15616O395149K336349N13230J713562M336052L812103R8877
449.4E21201706J112480L574753K099838L64762J894721k426986p771912m519081P722969
458.1E23253250j61323p911301o27174K206001J351280K389984K847328K073899o391678
$$ plain form
466.8 519030266 511883888 509177399 508305359 506398849 499574509 493712692 495112534 496489449 494428291
475.5 494428291 497442970 503293839 504359207 503045883 501703949 500098343 495958939 494336586
483.2 494336586 490456810 488659554 495747261 500459328 499303093 494574509 490432625 493847771
490.9 493847771 502395897 503143463 498992577 495835533 495588455 496221962 493333435 492553711 489114532
499.6 489114532 484882927 482178268 479834023 483867187 484984474 485427361 485051308 485781784 485329399
508.2 485329399 481603127 478759346 474000816 474057732 471838417 465319977 463097076 463564415 465233231
516.9 465233231 464422112 463806000 459987717 459504204 461327934 461224365 460164146 455869331 455408173
525.6 455408173 455308571 455761909 453629608 449608650 451186142 451890488 453843918 456054916 458040466
$$ packed form
466.8E19030266p146378k706489q72040j906510o824340n861817J399842J376915k061158
475.5D94428291L014679N850869J065368j313324j341934j605606m139404j622353
483.2D94336586l879776j797256P087707M712067j156235m728584m141884L415146
490.9D93847771Q548126P47566m150886l157044k47078O33507k888527p79724l439179
499.6D89114532m231605k704659k344245M033164J117287M42887l76053P30476m52385
508.2D85329399l726272k843781m758530N6916k219315o518440k222901M67339J668816
516.9D65233231q11119o16112l818283m83513J823730j03569j060219m294815m61158
525.6D55408173r9602M53338k132301m020958J577492P04346J953430K210998J985550
$$ plain form
534.3 458040466 459225731 460260353 463321991 465318031 467663536 469417191 471607437 472365723 472862587
543 472862587 473954430 473586693 475679436 478147469 480548210 480893517 480014648 479643745 478193130
551.6 478193130 477898636 476546440 475284958 473831902 472000847 469822578 468061218 468648453 467927895
560.3 467927895 467560997 466273651 463318291 459938240 457452011 455321007 450492783 447085266 443805504
569 443805504 441283226 438852959 437441940 437298470 435663948 436558990 438146896 438924522 439735947
577.7 439735947 443448219 446637039 447264290 448018303 448312302 451353378 454968147 458482056 461476212
586.4 461476212 463834991 466570625 469541969 473188324 475244904 476897049 476094170 474743271 474221153
595 474221153 471846237 470675735 470939064 472321129 472779427 471907845 471904182 473470268 475321693 475373459
$$ packed form
534.3D58040466J185265J034622L061638J996040K345505J753655K190246P58286M96864
543D72862587J091843l67737K092743K468033K400741L45307q78869l70903j450615
551.6D78193130k94494j352196j261482j453056j831055k178269j761360N87235p20558
560.3D67927895l66898j287346k955360l380051k486229k131004m828224l407517l279762
569D43805504k522278k430267j411019j43470j634522Q95042J587906P77626Q11425
577.7D39735947L712272L188820O27251P54013K93999L041076L614769L513909K994156
586.4D61476212K358779K735634K971344L646355K056580J652145q02879j350899n22118
595D74221153k374916j170502K63329J382065M58298q71582l663J566086J851425N1766
$$ plain form
604.7 475373459 476493568 476697388 476209373 476061821 475080376 474265671 473434105 475407372 476424103
613.4 476424103 475470772 476235275 477592087 479740334 481851234 484280739 487193565 489145164 490254669
622 490254669 490828438 490834999 491285324 492017403 493120155 494549561 495006104 496999741 500394135 502869873
631.7 502869873 504191093 505395317 507284622 507664871 507453728 507505760 506735687 505122070 503878441
640.4 503878441 504466057 505173454 506340981 508516846 510905876 512393494 513397446 514243240 513672791
649 513672791 513681870 514398918 514227180 513108597 512428284 512700806 513379974 515320396 516406403 517245369
658.7 517245369 519510689 521479568 521429863 520292892 521086960 522290878 522159653 521722984 518553658
667.4 518553658 507037811 511487656 516529160 519553986 522192650 524090462 525411072 526996460
$$ packed form
604.7D75373459J120109K03820m88015j47552r81445q14705q31566J973267J016731
613.4D76424103r53331P64503J356812K148247K110900K429505K912826J951599J109505
622D90254669N73769O561M50325P32079J102752J429406M56543J993637L394394K475738
631.7E02869873J321220J204224J889305L80249k11143N2032p70073j613617j243629
640.4E03878441N87616P07397J167527K175865K389030J487618J003952Q45794n70449
649E13672791R079P17048j71738j118583o80313K72522O79168J940422J086007Q38966
658.7E17245369K265320J968879m9705j136971P94068J203918j31225m36669l169326
667.4E18553658j1515847M449845N041504L024826K638664J897812J320610J585388
$$ plain form
675.1 526996460 529164810 530748444 530412560 530286484 530345650 530018196 528904228 527629204 528012924
683.8 528012924 528568459 529437714 531257706 533587265 535786438 537610703 538325920 537889099 537987709
692.4 537987709 536775475 533916588 531881180 530924835 529825211 527961273 526734695 526303825 526723289
701.1 526723289 527017670 526813774 526629028 526134529 525722656 524753799 523832664 522646751 521116104
709.8 521116104 520045052 519345474 520300865 522123604 524305573 527156868 530416985 533535347 536132927
718.5 536132927 538534889 540294189 541993752 543742714 544877014 545751495 546857300 548958893 551981735
727.2 551981735 556103058 559727020 561788139 564931030 568177757 570172844 572398872 574448166
734.9 574448166 575001144 574665527 574865913 574223137 573426933 573406448 573684502 574434166 574765816 575396881
$$ packed form
675.1E26996460K168350J583634l35884j26076N9166l27454j113968j275024L83720
683.8E28012924N55535Q69255J819992K329559K199173J824265P15217m36821R8610
692.4E37987709j212234k858887k035408r56345j099624j863938j226578m30870M19464
701.1E26723289K94381k03896j84746m94499m11873r68857r21135j185913j530647
709.8E21116104j071052o99578R55391J822739K181969K851295L260117L118362K597580
718.5E36132927K401962J759300J699563J748962J134300Q74481J105805K101593L022842
727.2E51981735M121323L623962K061119L142891L246727J995087K226028K049294
734.9E74448166N52978l35617K00386o42776p96204k0485K78054P49664L31650O31065
$$ plain form
744.5 575396881 576352005 577594223 578177757 576679459 574817734 572353363 569189682 566876221 564491272
753.2 564491272 561650887 559235268 556595001 555783730 556121025 554515648 553161850 552897720 552907333
761.9 552907333 551668015 549157982 547824821 546801567 545439110 544137192 544742508 547506981 549711914
770.6 549711914 552324982 555730934 559877052 565019836 569649353 573345070 576771698 580571785
778.3 580571785 583175659 585369377 586919327 587332535 589461441 592927322 596113167 599283676 603264999
787 603264999 607275887 610814133 613606567 615440483 616028557 615860634 615979347 614940376 614354668
795.6 614354668 614734001 616216850 618934250 620881615 623150139 625879784 629508705 632990189 635015717
804.3 635015717 636603889 637431641 636853638 635132256 633636436 631999474 631121674 630568161 630279045
$$ packed form
744.5E75396881R55124J242218N83534j498298j861725k464371l163681k313461k384949
753.2E64491272k840385k415619k640267q11271L37295j605377j353798k64130R613
761.9E52907333j239318k510033j333161j023254j362457j301918O05316K764473K204933
770.6E49711914K613068L405952M146118N142784M629517L695717L426628L800087
778.3E80571785K603874K193718J549950M13208K128906L465881L185845L170509L981323
787F03264999M010888L538246K792434J833916N88074j67923J18713j038971n85708
795.6F14354668L79333J482849K717400J947365K268524K729645L628921L481484K025528
804.3F35015717J588172Q27752n78003j721382j495820j636962q77800n53513k89116
$$ plain form
813 630279045 631441460 633082695 635342560 637129440 638734322 640007629 639953041 639192619 637335510
821.7 637335510 634451675 631920090 630050354 626929703 624040718 622973633 623668098 624586143 624687119
830.4 624687119 624975395 623878555 622209625 619858475 616481247 613352547 609949036 606334190 602717934
839 602717934 600110741 597952576 596569748 595750427 594926376 595406456 595644073 595502014 595149231 593834152
848.7 593834152 591354065 587964249 585381508 582722511 578668098 574579659 571688385 569470253
856.4 569470253 568354683 568436089 568245430 568103485 568525009 568953133 570046234 572777596 575990257
865.1 575990257 578759079 581912613 585075340 589496269 595020332 600034027 605791740 611914139
872.8 611914139 617966080 623702049 627975273 630023003 631241455 631541862 631050415 630299072 627579308
$$ packed form
813F30279045J162415J641235K259865J786880J604882J273307n4588p60422j857109
821.7F37335510k883835k531585j869736l120651k888985j067085O94465R18045J00976
830.4F24687119K88276j096840j668930k351150l377228l128700l403511l614846l616256
839F02717934k607193k158165j382828q19321q24051M80080K37617j42059l52783j315079
848.7E93834152k480087l389816k582741k658997m054413m088439k891274k218132
856.4E69470253j115570Q1406j90659j41945M21524M28124J093101K731362L212661
865.1E75990257K768822L153534L162727M420929N524063N013695N757713O122399
872.8F11914139O051941N735969M273224K047730J218452L00407m91447p51343k719764
$$ plain form
881.5 627579308 624067154 621259766 619715881 618485947 617477608 616491852 615238037 614459915 612310562
890.2 612310562 609054070 605334740 601402664 597360229 592518425 588264122 585451355 583063126
897.9 583063126 581123199 579742241 578011818 577017746 576255379 574757576 573196793 570680504 567154083
906.5 567154083 562857208 558550491 553884811 548198280 542937241 538376770 534250793 530762100
914.3 530762100 527208862 523667412 521035156 518135262 514439926 510613976 507238579 504554100
922 504554100 502079468 499746666 498091049 497017174 496711121 497736588 498455925 499575882 500994453
930.7 500994453 501768074 503103027 504574051 506592064 507997437 507734489 507777824 508425980 508816452
939.3 508816452 510141640 512296104 514004364 516656075 519969292 523095322 524255981 522577820
$$ packed form
881.5F27579308l512154k807388j543885j229934j008339r85756j253815p78122k149353
890.2F12310562l256492l719330l932076m042435m841804m254303k812767k388229
897.9E83063126j939927j380958j730423r94072p62367j497803j560783k516289l526421
906.5E67154083m296875m306717m665680n686531n261039m560471m125977l488693
914.3E30762100l553238l541450k632256k899894l695336l825950l375397k684479
922E04554100k474632k332802j655617j073875l06053J025467P19337J119957J418571
930.7E00994453P73621J334953J471024K018013J405373k62948M3335O48156L90472
939.3E08816452J325188K154464J708260K651711L313217L126030J160659j678161
$$ plain form
947.1 522577820 520955734 519236450 515316391 509257240 502988930 496848412 489925766 483174286
954.8 483174286 476626396 471386414 466367798 460416527 454002953 447064857 440504227 433161583
962.5 433161583 425682449 417827492 409963493 402070274 393917465 386026154 376976013 369234009
970.2 369234009 361752510 354585800 346928368 338755112 332142143 325139771 318574905 310859337
977.9 310859337 304107304 297848263 292276230 288107109 283284473 280085411 276299343 274566631
985.6 274566631 273611336 272272263 271010914 269670506 270339756 269749451 269733410 269283829 269874325
994.3 269874325 270550766 270070324 271085949 271094322 271770515 271855526 273304977 274529324 275249195 276802158
1004 276802158 276456089 277619534 277723637 277814503 277902336 277776260 277602997 276345520 276316757 275024891
$$ packed form
947.1E22577820j622086j719284l920059o059151o268310o140518o922646o751480
954.8D83174286o547890n239982n018616n951271o413574o938096o560630p342644
962.5D33161583p479134p854957p863999p893219q152809p891311r050141p742004
970.2C69234009p481499p166710p657432q173256o612969p002372o564866p715568
977.9C10859337o752033o259041n572033m169121m822636l199062l786068j732712
985.6B74566631r55295j339073j261349j340408O69250n90305j6041m49581N90496
994.3B69874325O76441m80442J015625Q373O76193Q5011J449451J224347P19871J552963
1004B76802158l46069J163445J04103R0866Q7833j26076j73263j257477k8763j291866
$$ plain form
1013.6 275024891 275416565 275570984 275633011 276943550 278102589 280082474 280663395 282172966 282519417
1022.3 282519417 283379765 284514885 285270596 287337513 288149815 289949875 290876503 292616405 294177513
1031 294177513 295783291 298268509 299227276 300645580 300555859 301751938 302822838 303142490 302547455
1039.6 302547455 300934525 301262321 300917778 301554642 301283875 301810226 302623024 303364925 304589100
1048.3 304589100 303528538 304401207 305190639 307794304 309406185 310128250 312842693 314364872 317778606
1057 317778606 320399246 323440590 326263924 329986954 334600563 338450317 343960152 347723351 351236191
1065.7 351236191 353369713 355990524 357501411 355890923 353775406 349175034 344735909 339230537
1073.4 339230537 335647430 332787971 329319305 327869263 326230431 326279411 325345383 325948639 326380806
$$ packed form
1013.6B75024891L91674J54419O2027J310539J159039J979885N80921J509571L46451
1022.3B82519417Q60348J135120P55711K066917Q12302J800060R26628J739902J561108
1031B94177513J605778K485218R58767J418304q9721J196079J070900L19652n95035
1039.6C02547455j612930L27796l44543O36864k70767N26351Q12798P41901J224175
1048.3C04589100j060562Q72669P89432K603665J611881P22065K714443J522179L413734
1057C17778606K620640L041344K823334L723030M613609L849754N509835L763199L512840
1065.7C51236191K133522K620811J510887j610488k115517m600372m439125n505372
1073.4C39230537l583107k859459l468666j450042j638832M8980r34028O03256M32167
$$ plain form
1082.1 326380806 327170639 329366646 330472107 332439728 332785606 335487251 338170891 340743637 343853607
1090.7 343853607 346744652 350444984 352081184 355246658 356900215 358385353 359659615 360195885
1098.5 360195885 361697350 361466103 362182388 361361694 362313728 363818741 363636322 364327469 364780922
1107.1 364780922 366560249 367013931 368640327 370424728 371891212 373712425 374826355 376513252
1114.9 376513252 376741562 378400955 380277710 382739983 384942589 386753197 389039917 388698654 389168053
1123.5 389168053 389412689 390354729 390672264 390728760 392668800 393286552 395023346 397154121 400187912
1132.2 400187912 402781525 404773636 406179810 406157188 406285896 405128784 405157280 403215561 399958000
1140.9 399958000 397302399 393909569 391455879 387939758 385535889 382456779 379913712 378039246
$$ packed form
1082.1C26380806P89833K196007J105461J967621L45878K701645K683640K572746L109970
1090.7C43853607K891045L700332J636200L165474J653557J485138J274262N36270
1098.5C60195885J501465k31247P16285q20694R52034J505013j82419O91147M53453
1107.1C64780922J779327M53682J626396J784401J466484J821213J113930J686897
1114.9C76513252K28310J659393J876755K462273K202606J810608K286720l41263M69399
1123.5C89168053K44636R42040L17535N6496J940040O17752J736794K130775L033791
1132.2D00187912K593613J992111J406174k2622J28708j157112K8496j941719l257561
1140.9C99958000k655601l392830k453690l516121k403869l079110k543067j874466
$$ plain form
1148.6 378039246 375500679 374174423 372066422 371104050 369321060 368643799 367878723 365935898 364942398
1157.3 364942398 363631630 364805489 365601387 366501999 367302246 369044800 371733322 373921509 377612267
1166 377612267 379823341 383388367 387303886 391098862 395387611 399601402 404961815 410059624 416260223
1174.6 416260223 421540985 427575378 434036942 439876289 446401634 451672211 457246895 462640190
1182.4 462640190 467660675 472477798 476962967 481032677 485155716 489879227 493359337 496826363
1190.1 496826363 500190315 503237343 506237373 508367920 510103951 511037025 511956062 512770157 512825508
1198.8 512825508 512902527 513161888 513603897 514431648 515492859 516267662 518132896 520345726 521663895
1207.4 521663895 523021965 524278564 525772629 527381134 528838348 530464706 531939774 533497238
$$ packed form
1148.6C78039246k538567j326256k108001r62372j782990o77261p65076j942825r93500
1157.3C64942398j310768J173859P95898R00612Q00247J742554K688522K188187L690758
1166C77612267K211074L565026L915519L794976M288749M213791N360413N097809O200599
1174.6D16260223N280762O034393O461564N839347O525345N270577N574684N393295
1182.4D62640190N020485M817123M485169M069710M123039M723511L480110L467026
1190.1D96826363L363952L047028L000030K130547J736031R33074R19037Q14095N5351
1198.8E12825508P7019K59361M42009Q27751J061211P74803J865234K212830J318169
1207.4E21663895J358070J256599J494065J608505J457214J626358J475068J557464
$$ plain form
1215.1 533497238 535598183 537796516 539785652 541830292 543908043 545596466 546939163 548150406
1222.9 548150406 548869781 548897591 548136444 547017021 545870552 544715919 543637276 543084641 542661743
1231.5 542661743 541968842 541586952 541460953 541543655 541375198 540569038 539822807 539194946 538532372 537564621
1241.2 537564621 536176224 535389633 535354805 535398102 535722046 536548729 537491150 538448524 539888687 541329842
1250.8 541329842 542554703 543695602 544426689 544786720 544862633 545037346 545598602 545623665 545480652 545692406
1260.5 545692406 545992165 546855659 547652664 548450623 549346695 550046272 551103821 552006645 552944412
1269.2 552944412 553714600 554237747 554783630 555217209 555738258 556246872 557028847 557373238 557540817 557660217
1278.8 557660217 557487450 557449570 557211037 556894035 556044159 555301323 555041885 554831352 554472656 553782082
$$ packed form
1215.1E33497238K100945K198333J989136K044640K077751J688423J342697J211243
1222.9E48150406P19375K7810p61147j119423j146469j154633j078643n52635m22898
1231.5E42661743o92901l81890j25999Q2702j68457q06160p46231o27861o62574r67751
1241.2E37564621j388397p86591l4828M3297L23944Q26683R42421R57374J440163J441155
1250.8E41329842J224861J140899P31087L60031P5913J74713N61256K5063j43013K11754
1260.5E45692406K99759Q63494P97005P97959Q96072O99577J057549R02824R37767
1269.2E52944412P70188N23147N45883M33579N21049N08614P81975L44391J67579J19400
1278.8E57660217j72767l7880k38533l17002q49876p42836k59438k10533l58696o90574
$$ plain form
1288.4 553782082 553507881 553420258 553463211 553547592 553447342 552861938 551673698 550572510 549605522 548483772
1298.1 548483772 546654167 545134888 544136200 542961845 542150841 541321831 540507011 539521790 538491402
1306.8 538491402 538427086 537981529 536695137 535656052 534400902 533031044 531886711 530791473 529995575
1315.4 529995575 529226990 528556290 527936478 527291298 527119217 527180443 527200966 526671906 525225792 523313675
1325.1 523313675 521064301 518563843 516068382 513549576 511108131 508756294 507061043 505514870
1332.8 505514870 503345222 502242317 501807022 501058083 499897194 498868637 498325043 497843857 497672081
1341.5 497672081 497635345 497721176 497150269 497100296 497719765 498129921 498560944 498754730 499103737 499103127 499477081
1352.1 499477081 499576187 499076958 498751373 498096352 497436409 496662712 496546402 496052322 495287285 495299683
$$ packed form
1288.4E53782082k74201q7623M2953Q4381j00250n85404j188240j101188r66988j121750
1298.1E48483772j829605j519279r98688j174355q11004q29010q14820r85221j030388
1306.8E38491402o4316m45557j286392j039085j255150j369858j144333j095238p95898
1315.4E29995575p68585o70700o19812o45180j72081O1226K0523n29060j446114j912117
1325.1E23313675k249374k500458k495461k518806k441445k351837j695251j546173
1332.8E05514870k169648j102905m35295p48939j160889j028557n43594m81186j71776
1341.5D97672081l6736Q5831n70907m9973O19469M10156M31023J93786L49007o10L73954
1352.1D99477081R9106m99229l25585o55021o59943p73697j16310m94080p65037J2398
$$ plain form
1361.7 495299683 494745636 494536476 495085068 495805893 495629044 495508156 495170555 494514236 494546509 493885994
1371.4 493885994 494145355 494729919 495543060 495982323 496173172 497303200 498114166 499044113 499062042 499330330
1381 499330330 499928322 500275917 500870476 501403542 502877731 503929443 505473900 507245674 508905487
1389.7 508905487 510497818 511722870 513230667 514039917 513897362 512792091 512987404 513004417 512473145
1398.4 512473145 511019249 509970360 510195999 509365730 508820343 508666077 508063049 507462273 507165375
1407.1 507165375 507114410 506243439 505376205 504139938 503100357 501899261 500735893 499960060 498900070
1415.7 498900070 498467712 497434425 497377243 496121750 496304474 498320389 498882561 499455070 498817177
1424.4 498817177 499296684 499785652 499308739 499736671 499479294 499636002 499899712 500919533 501344948
$$ packed form
1361.7D95299683n54047k09160N48592P20825j76849j20888l37601o56319L2273o60515
1371.4D93885994K59361N84564Q13141M39263J90849J130028Q10966R29947J7929K68288
1381D99330330N97992L47595N94559N33066J474189J051712J544457J771774J659813
1389.7E08905487J592331J225052J507797Q09250j42555j105271J95313J7013n31272
1398.4E12473145j453896j048889K25639q30269n45387j54266o03028o00776k96898
1407.1E07165375n0965q70971q67234j236267j039581j201096j163368p75833j059990
1415.7D98900070m32358j033287n7182j255493J82724K015915N62172N72509o37893
1424.4D98817177M79507M88968m76913M27932k57377J56708K63710J019821M25415
$$ plain form
1433.1 501344948 502302284 504562988 505498772 505752220 506129875 508338509 509308624 509676399 510390053
1441.8 510390053 510333824 510503616 510085106 510961914 511193275 511617508 511830750 512206688 513576775 513162155
1451.4 513162155 513221474 512332573 512596512 512696037 511844826 511541100 506622620 507165451 506066017 507723846
1461.1 507723846 508050156 508069038 509631615 508849640 512136955 514193649 517319489 519632645 522528725
1469.7 522528725 525897408 527464294 531958427 533898811 539731941 543364296 547233009 550624161
1477.5 550624161 553594780 557890358 560983086 565207748 568025551 571683693 574426537 576588974
1485.2 576588974 579332542 579920197 582409325 583714256 586166954 587587700 590469856 593645287
1492.9 593645287 595023994 597734795 599219437 600600739 602623367 604331169 604654694 606038322
$$ packed form
1433.1E01344948R57336K260704R35784K53448L77655K208634R70115L67775P13654
1441.8E10390053n6229J69792m18510Q76808K31361M24233K13242L75938J370087m14620
1451.4E13162155N9319q88901K63939R9525q51211l03726m918480N42831j099434J657829
1461.1E07723846L26310J8882J562577p81975L287315K056694L125840K313156K896080
1469.7E22528725L368683J566886M494133J940384N833130L632355L868713L391152
1477.5E50624161K970619M295578L092728M224662K817803L658142K742844K162437
1485.2E76588974K743568N87655K489128J304931K452698J420746K882156L175431
1492.9E93645287J378707K710801J484642J381302K022628J707802L23525J383628
$$ plain form
1500.6 606038322 607827034 608304596 610330582 611381607 612928696 610709648 607026215 612427864
1508.3 612427864 614098396 617060471 618422852 619857025 619722710 620817604 621935730 621887283 623548203
1517 623548203 620925751 623822517 625999641 625490952 625201111 625110016 628949356 630886345 631796722
1525.7 631796722 631904068 632945251 632985687 633237343 634580193 634210052 635122757 634500771 633438759
1534.3 633438759 635239792 636616821 638699989 640449066 640534058 633244362 637879829 640421753 639438210
1543 639438210 640728760 640269547 638864746 639067688 640016632 641098557 641183777 640639038 642420807
1551.7 642420807 644601593 645160980 643290558 642801895 646045837 649731064 645427017 641190643 637428207
1560.4 637428207 640011139 641113510 641547318 641698227 640643158 640615387 640842285 641422577 641685867
$$ packed form
1500.6F06038322J788712M77562K025986J051025J547089k219048l683433N401649
1508.3F12427864J670532K962075J362381J434173j34315J094894J118126m8447J660920
1517F23548203k622452K896766K177124n08689k89841r1095L839340J936989R10377
1525.7F31796722J07346J041183M0436K51656J342850l70141R12705o21986j062012
1534.3F33438759J801033J377029K083168J749077Q4992p289696M635467K541924r83543
1543F39438210J290550m59213j404801K02942R48944J081925Q5220n44739J781769
1551.7F42420807K180786N59387j870422m88663L243942L685227m304047m236374l762436
1560.4F37428207K582932J102371M33808J50909j055069k7771K26898N80292K63290
$$ plain form
1569.1 641685867 638006477 638682861 639887123 639056168 638209381 638450356 637113914 631998825 633094559
1577.7 633094559 633495979 633009567 632921944 632921715 633157425 632564621 631678696 631223221 630580711 629192047
1587.4 629192047 627359047 626037903 624427261 623192253 621863213 620994987 619941711 618539047
1595.1 618539047 618378334 617692757 616889687 615644798 614486618 613068085 611412277 609914246 607445030
1603.8 607445030 606101227 604779282 603359985 601202507 599807129 598558426 596295815 595293808
1611.5 595293808 593202782 591505508 589500885 589025612 588526878 580044670 579961548 579471664 578600044
1620.2 578600044 576551399 575773888 574574966 570070839 570288658 569930954 570066261 567406197 564816933
1628.9 564816933 564630241 563656311 562706947 561446686 561555061 561125832 556157036 555298843 557386780
$$ packed form
1569.1F41685867l679390O76384J204262q30955q46787K40975j336442n115089J095734
1577.7F33094559M01420m86412q7623k29K35710n92804q85925m55475o42510j388664
1587.4F29192047j833000j321144j610642j235008j329040q68226j053276j402664
1595.1F18539047j60713o85577q03070j244889j158180j418533j655808j498031k469216
1603.8F07445030j343803j321945j419297k157478j395378j248703k262611j002007
1611.5E95293808k091026j697274k004623m75273m98734q482208q3122m89884q71620
1620.2E78600044k048645p77511j198922m504127K17819l57704J35307k660064k589264
1628.9E64816933j86692r73930r49364j260261J08375m29229m968796q58193K087937
$$ plain form
1637.5 557386780 557730560 558198509 559254303 558655014 559291496 559166451 560146027 561536598 559261322
1646.2 559261322 558916016 559436531 561104355 562174377 564614258 566994171 562695580 559724655 564909821
1654.9 564909821 568926315 570406113 571951256 573109322 573995781 574971619 576392212 577271767 577034645
1663.6 577034645 579789848 581855545 583620300 585877151 588360367 588834381 590042458 593297539
1671.3 593297539 594166412 596341286 599270248 600708809 601043167 603968201 606887779 608779335 610542259
1680 610542259 611978264 615870285 619672623 621046753 621796150 624409332 628817368 632077866 634048424
1688.6 634048424 636325455 638590508 641042328 643343277 644993591 647488251 650137558 649109192
1696.4 649109192 652066803 655420227 659370422 659314041 657523346 663115311 666820221 668808060 668587570
$$ packed form
1637.5E57386780L43780M67949J055794n99289O36482j25045R79576J390571k275276
1646.2E59261322l45306N20515J667824J070022K439881K379913m298591k970925N185166
1654.9E64909821M016494J479798J545143J158066Q86459R75838J420593Q79555k37122
1663.6E77034645K755203K065697J764755K256851K483216M74014J208077L255081
1671.3E93297539Q68873K174874K928962J438561L34358K925034K919578J891556J762924
1680F10542259J436005L892021L802338J374130P49397K613182M408036L260498J970558
1688.6F34048424K277031K265053K451820K300949J650314K494660K649307j028366
1696.4F49109192K957611L353424L950195n6381j790695N591965L704910J987839k20490
$$ plain form
1705 668587570 669675064 670097198 670715866 672529068 673495789 674349747 675952835 677411041 678843689
1713.7 678843689 679849243 679548645 681483459 683181000 679552078 681046982 683068924 684259415
1721.4 684259415 684613953 684622269 684640274 685565796 686691895 687470779 688768921 690259094 690540161 689964294
1731.1 689964294 691799850 694075165 692299576 688952255 691314011 693471832 693864899 695210037
1738.8 695210037 694660568 693205261 696152420 698346405 698759613 698736496 700364532 701710205 702540436
1747.5 702540436 703348541 703030548 705652084 706271896 705488434 707534256 709020157 710832062 712691956
1756.2 712691956 712418213 713242950 715257797 716388474 718166275 717285767 716216660 718489304 719939880
1764.8 719939880 720615997 721537094 722750626 721466446 722844620 725713120 725862732 725005035 723691940
$$ packed form
1705F68587570J087494M22134O18668J813202R66721Q53958J603088J458206J432648
1713.7F78843689J005554l00598J934814J697541l628922J494904K021942J190491
1721.4F84259415L54538Q316J8005R25522J126099P78884J298142J490173K81067n75867
1731.1F89964294J835556K275315j775589l347321K361756K157821L93067J345138
1738.8F95210037n49469j455307K947159K193985M13208k3117J628036J345673Q30231
1747.5G02540436Q08105l17993K621536O19812p83462K045822J485901J811905J859894
1756.2G12691956k73743Q24737K014847J130677J777801q80508j069107K272644J450576
1764.8G19939880O76117R21097J213532j284180J378174K868500J49612q57697j313095
$$ plain form
1773.5 723691940 726240768 727418289 726258621 727004089 726937485 727767715 728366165 728215561 728978043
1782.2 728978043 730179291 731311569 731360703 731656265 732180557 732576294 732661285 733399963 733255844 733236160
1791.8 733236160 732843704 731421585 733085251 733479080 733709259 735155945 736696854 737289963 736120453
1800.5 736120453 737582169 737557068 737386780 738261642 738169861 738120804 737809067 737862930 738024673 738547287
1810.2 738547287 738157654 738755188 740046997 740383224 741342468 741724091 742359085 742342682 742196045 742385788
1819.8 742385788 741994095 742230072 741409988 741877518 742769012 740906601 740818939 742074814 743385010
1828.5 743385010 743849945 742705994 743374481 744861908 744892426 744847260 744904861 744761734 744782410 744238892
1838.1 744238892 744560471 744817505 745320740 745320358 745772400 746716385 743883972 745185013 746831207 746874771
$$ packed form
1773.5G23691940K548828J177521j159668P45468o6604Q30230N98450j50604P62482
1782.2G28978043J201248J132278M9134K95562N24292L95737Q4991P38678j44119j9684
1791.8G33236160l92456j422119J663666L93829K30179J446686J540909N93109j169510
1800.5G36120453J461716k5101j70288Q74862r1781m9057l11737N3863J61743N22614
1810.2G38547287l89633N97534J291809L36227R59244L81623O34994j6403j46637J89743
1819.8G42385788l91693K35977q20084M67530Q91494j862411q7662J255875J310196
1828.5G43385010M64935j143951O68487J487427L0518m5166N7601j43127K0676n43518
1838.1G44238892L21579K57034N03235l82M52042R43985k832413J301041J646194M3564
$$ plain form
1847.8 746874771 746633606 746667862 746650314 746013260 746085892 745890884 746072540 746206131 746218414 746753540
1857.4 746753540 746820831 746993027 747132111 747902451 747792740 747348633 747375717 747400589 747966995 747402954
1867.1 747402954 747275620 746599045 745927963 746974335 747824402 748400574 748298187 748436966 748586349
1875.7 748586349 748591156 748294983 748519897 748987732 748532486 748396454 748199844 748903656 749375076 749220886
1885.4 749220886 749698334 750021973 750912323 751105499 749962387 749712982 750171661 750181198 750158997 750022888
1895 750022888 749261246 749662476 750120239 750713654 751059952 751169815 751736908 751662521 751572495 751496124
1904.7 751496124 751595306 751413574 751127548 750754623 750593719 750432968 749647827 750456696 750758209 750936508
1914.3 750936508 751521454 751616058 752714539 751716309 750876923 751626587 751986465 752202911 751343689 750643997
$$ packed form
1847.8G46874771k41165L4256j7548o37054P2632j95008J81656J33591J2283N35126
1857.4G46753540O7291J72196J39084P70340j09711m44107K7084K4872N66406n64041
1867.1G47402954j27334o76575o71082J046372Q50067N76172j02387J38779J49383
1875.7G48586349M807k96173K24914M67835m55246j36032j96610P03812M71420j54190
1885.4G49220886M77448L23639Q90350J93176j143112k49405M58679R537k2201j36109
1895G50022888p61642M01230M57763N93415L46298J09863N67093p4387r0026p6371
1904.7G51496124R9182j81732k86026l72925j60904j60751p85141Q08869L01513J78299
1914.3G50936508N84946R4604J098481r98230q39386P49664L59878K16446q59222o99692
$$ plain form
1923.9 750643997 750614700 750632172 750587997 751097183 751563263 751944656 752529144 752900925 753549271 753476715
1933.6 753476715 753082047 752557220 752211761 751896210 751304855 750970306 750369720 750899963 750759125 749938202
1943.2 749938202 751280975 752616501 753146286 752983475 753015594 752932816 752685089 752460861 752389603 752323380
1952.9 752323380 751874390 751745987 751391602 751502380 751846542 751910019 752386246 752817688 753396225 753975601
1962.5 753975601 754305267 753996277 753608627 753533401 753241272 752851791 752615051 752495804 752327423 752780914
1972.2 752780914 753053207 753130035 753345490 753436737 753970795 754114532 753793411 753322830 753572464 753767776
1981.8 753767776 753437042 753395462 753115234 753247986 753139343 753506699 753861923 753541412 754235001 754405670
1991.5 754405670 753967972 753595276 753530655 753713684 753705902 753638153 753142014 752804718 752839508 753344116
$$ packed form
1923.9G50643997k9297J7472m4175N09186M66080L81393N84488L71781O48346p2556
1933.6G53476715l94668n24827l45459l15551n91355l34549o00586N30243j40838q20923
1943.2G49938202J342773J335526N29785j62811L2119q2778k47727k24228p1258o6223
1952.9G52323380m48990j28403l54385J10778L44162O3477M76227M31442N78537N79376
1962.5G53975601L29666l08990l87650p5226k92129l89481k36740j19247j68381M53491
1972.2G52780914K72293P6828K15455R1247N34058J43737l21121m70581K49634J95312
1981.8G53767776l30734m1580k80228J32752j08643L67356L55224l20511O93589J70669
1991.5G54405670m37698l72696o4621J83029p782o7749m96139l37296L4790N04608
$$ plain form
2001.1 753344116 753377533 753063278 753136139 753326492 753628922 753564911 753729553 753345642 752708359 752320709
2010.7 752320709 751781769 751652908 751408310 751661148 752012787 751817245 751604614 752016525 752424774 751977997
2020.4 751977997 751695175 751404114 751060944 750406036 749996643 750004501 749892654 750056610 749828644 749905014
2030 749905014 749941635 749877548 749950714 749787827 749839554 749507599 749131317 748523560 748199158 748086929 747652206
2040.6 747652206 747287750 747063446 747615662 747811356 747982712 748053665 747725372 748047943 748166199 748184891
2050.3 748184891 748079453 747645111 747024612 746879044 746757431 746332474 746473389 746521301 746694717 746785202
2059.9 746785202 747193146 747683792 747785492 748028488 747871399 748006592 747837906 747450409 747048340 746552734
2069.6 746552734 746421356 746285629 746708603 747086563 747368774 747381210 747431717 747550049 747280807 747835922
$$ packed form
2001.1G53344116L3417l14255P2861J90353L02430o4011J64642l83911o37283l87650
2010.7G52320709n38940j28861k44598K52838L51639j95542k12631M11911M08249m46777
2020.4G51977997k82822k91061l43170o54908m09393P858j11847J63956k27966P6370
2030G49905014L6621o4087P3166j62887N1727l31955l76282o07757l24402j12229m34723
2040.6G47652206l64456k24304N52216J95694J71356P0953l28293L22571J18256J8692
2050.3G48184891j05438m34342o20499j45568j21613m24957J40915M7912J73416R0485
2059.9G46785202M07944M90646J01700K42996j57089J35193j68686l87497m02069m95606
2069.6G46552734j31378j35727M22974L77960K82211J2436N0507J18332k69242N55115
$$ plain form
2079.2 747835922 748034744 747652969 747284088 747278290 747394562 747154160 747051468 746591339 746934433 747593765
2088.9 747593765 747585449 747418671 747513809 748247986 748801270 748819809 748408966 748484650 748051376 747364426
2098.5 747364426 747601395 747450409 747555771 747944260 748393860 748574982 748568649 748813324 748875122 748931732
2108.1 748931732 748544922 748772659 749113693 748571625 748076324 748049011 748304214 748217545 748388748 748498459
2117.8 748498459 748641663 748866959 748762894 748838654 748804703 748847046 748842239 748791580 748559341 748457413 748513565
2128.4 748513565 748409653 748523254 748383102 748616180 748711395 748505173 748596344 748631973 748820724 748849564
2138 748849564 749025040 748910828 748432388 748194199 748319016 748555984 748586426 748643723 748340607 748490143
2147.7 748490143 748902664 748992996 749045105 749218521 749565048 749384079 749238586 749009094 749038849 748993301
$$ packed form
2079.2G47835922J98822l81775l68881n798J16272k40402j02692m60129L43094O59332
2088.9G47593765q316j66778R5138P34177N53284J8539m10843P5684m33274o86950
2098.5G47364426K36969j50986J05362L88489M49600J81122o333K44675O1798N6610
2108.1G48931732l86810K27737L41034n42068m95301k7313K55203q6669J71203J09711
2117.8G48498459J43204K25296j04065P5760l3951M2343m807n0659k32239j01928N6152
2128.4G48513565j03912J13601j40152K33078R5215k06222R1171L5629J88751K8840
2138G48849564J75476j14212m78440k38189J24817K36968L0442N7297l03116J49536
2147.7G48490143M12521R0332N2109J73416L46527j80969j45493k29492K9755m5548
$$ plain form
2157.3 748993301 748534317 748758392 748924484 749153519 749306335 749568710 749866486 749936371 750260620 750483475
2167 750483475 750781403 750347214 750015106 750234375 750305862 750462112 750599442 751074142 751449585 751758957
2176.6 751758957 751524200 751578827 752338409 752449570 752455978 752280731 752342606 752552567 752758713 752846603
2186.3 752846603 752689209 752941818 752920227 753049316 753543549 754007111 754217682 754731522 755158920 754850464
2195.9 754850464 754853592 754465866 754303894 754430008 754430542 754455872 754338226 754778976 754894028 755253448 755605850
2206.5 755605850 755634995 755919876 756005554 756231461 756219330 756543121 756538620 755953217 755992661 756430206 756714554
2217.1 756714554 756778488 757263107 757367935 757346115 757468719 757463303 757497101 757401199 757729034 757919998 757905884
2227.7 757905884 757548599 757398834 757779007 758062286 758456192 758475952 758515778 758493652 758532791 758458633
$$ packed form
2157.3G48993301m58984K24075J66092K29035J52816K62375K97776O9885L24249K22855
2167G50483475K97928m34189l32108K19269P1487J56250J37330M74700L75443L09372
2176.6G51758957k34757N4627P59582J11161O408j75247O1875K09961K06146Q7890
2186.3G52846603j57394K52609k1591J29089M94233M63562K10571N13840M27398l08456
2195.9G54850464L128l87726j61972J26114N34K5330j17646M40750J15052L59420L52402
2206.5G55605850K9145K84881Q5678K25907j2131L23791m501n85403L9444M37545K84348
2217.1G56714554O3934M84619J04828k1820J22604n416L3798r5902L27835J90964j4114
2227.7G57905884l57285j49765L80173K83279L93906J9760L9826k2126L9139p4158
$$ plain form
2237.4 758458633 758482056 758991928 759053116 759105453 758945007 758884125 758347931 757848434 758211136 758362198
2247 758362198 758797684 758687286 758806686 759174576 759007797 758877182 758770218 758988037 758726654 758978195
2256.7 758978195 759088058 758701706 758702850 758566742 758999786 759043274 759062576 759501343 759450531 759093399
2266.3 759093399 759054565 758969193 758703461 759078217 758924179 759041138 759500580 759658813 759851303 759895554
2275.9 759895554 760270615 759884949 759677124 759718933 759584579 759787445 759855118 759687576 759066315 759387894
2285.6 759387894 759725494 759864044 759733963 759161148 759603119 759630661 759519119 759136124 758827744 758569641
2295.2 758569641 758105087 758173523 757722778 757440948 756494980 756156235 756458893 756611557 757054672 756165848
2304.9 756165848 755947113 755763397 755455627 754894867 753750381 753217316 752210159 752120743 751572647
$$ packed form
2237.4G58458633K3423N09872O1188N2337j60446o0882n36194m99497L62702J51062
2247G58362198M35486j10398J19400L67890j66779j30615j06964K17819k61383K51541
2256.7G58978195J09863l86352J144j36108M33044M3488J9302M38767n0812l57132
2266.3G59093399l8834q5372k65732L74756j54038J16959M59442J58233J92490M4251
2275.9G59895554L75061l85666k07825M1809j34354K02866O7673j67542o21261L21579
2285.6G59387894L37600J38550j30081n72815M41971K7542j11542l82995l08380k58103
2295.2G58569641m64554O8436m50745k81830r45968l38745L02658J52664M43115q88824
2304.9G56165848k18735j83716l07770n60760j144486n33065j007157q9416n48096
$$ plain form
2313.5 751572647 751545029 751847229 751101227 750779648 749941864 749480896 748395157 747774506 747748260 747628555
2323.2 747628555 747031784 745642471 745369110 743866882 743743134 743614807 742283325 742067490 741648560
2331.9 741648560 741744919 741208420 742296524 743088608 742991028 741842194 739332199 738806000 738654709
2340.6 738654709 739955597 740217285 739803619 739651566 739538040 741668854 743744431 746067581 746823578
2349.2 746823578 745597305 743782806 742006836 740072708 737039261 734297409 732137299 731558151
2356.9 731558151 731490479 730575867 729300308 729167862 730768967 731444473 733327026 733745041 733266220
2365.6 733266220 734428558 735941086 737169342 738007278 740189972 741322632 741541519 742064056 743316040
2374.3 743316040 744786530 745703506 747469711 748931808 749813309 750892639 752165375 752753525 752808304
$$ packed form
2313.5G51572647k7618L02200p46002l21579q37784m60968j085739o20651k6246j19705
2323.2G47628555n96771j389313k73361j502228j23748j28327j331482k15835m18930
2331.9G41648560R6359n36499J088104P92084r7580j148834k509995n26199j51291
2340.6G38654709J300888K61688m13666j52053j13526K130814K075577K323150P55997
2349.2G46823578j226273j814499j775970j934128l033447k741852k160110n79148
2356.9G31558151o7672r14612j275559j32446J601105O75506J882553M18015m78821
2365.6G33266220J162338J512528J228256Q37936K182694J132660K18887N22537J251984
2374.3G43316040J470490R16976J766205J462097Q81501J079330J272736N88150N4779
$$ plain form
2383 752808304 752854080 752827225 753537292 753812866 753777847 754069214 754191360 754228897 754212799 754664917 754701080
2393.6 754701080 754453201 754203110 753510513 752998810 752752228 752582321 752363815 752319565 752248917 752285233
2403.2 752285233 752258682 752444077 752963028 752790222 752808990 752801514 752191849 751648254 751484833 751441727
2412.9 751441727 751113281 750490036 749646988 749449921 749470215 749516754 749796906 750141525 750462646 750142746
2422.5 750142746 749927673 749478683 748844147 748282852 747486649 747097626 746721497 746239548 745816116 746050339
2432.2 746050339 746414337 746376801 746528168 746801682 746970139 746375504 745811768 745383759 744969330 744479904
2441.8 744479904 743522568 743092728 742827911 742598648 742477341 742582779 742683334 742491760 742571030 742578735
2451.5 742578735 742394485 741889954 741686935 741403122 740810547 740416946 739859467 739410019 738918381 738916779
$$ packed form
2383G52808304M5776k6855P10067K75574l5019K91367J22146L7537j6098M52118L6163
2393.6G54701080k47879k50091o92597n11703k46582j69907k18506m4250p0648L6316
2403.2G52285233k6551J85395N18951j72806J8768p476o09665n43595j63421m3106
2412.9G51441727l28446o23245q43048j97067K0294M6539K80152L44619L21121l19900
2422.5G50142746k15073m48990o34536n61295p96203l89023l76129m81949m23432K34223
2432.2G46050339L63998l7536J51367K73514J68457n94635n63736m28009m14429m89426
2441.8G44479904r57336m29840k64817k29263j21307J05438J00555j91574P9270P705
2451.5G42578735j84250n04531k03019k83813n92575l93601n57479m49448m91638j602
$$ plain form
2461.1 738916779 738530731 738239822 738980484 739111176 738862152 738394852 738315811 738290100 737969971 737647247
2470.7 737647247 736862030 736396179 735910110 735478134 735247879 735433655 735845566 735770569 735681229 735653915
2480.4 735653915 736009598 735986328 735348282 734531403 734155197 734037628 733372421 733156128 732997971 732913971
2490 732913971 732640381 732483749 733005676 732998123 732880096 732560272 732279129 731885529 731482620 731192245
2499.7 731192245 730455093 730369949 730381546 730332184 730377808 730395432 730584488 730694733 730711212 730453873 730389786
2510.3 730389786 730285339 730211182 729707718 729014359 728745956 728222427 728068848 727793045 727783432 728147583
2519.9 728147583 728232040 728331604 728290176 728479614 728226242 727739410 727158127 726618271 726413803 725896530
2529.6 725896530 725368652 724912643 724900742 724714661 724644699 724908905 724724197 724894638 724978638 724694443
$$ packed form
2461.1G38916779l86048k90909P40662J30692k49024m67300p9041k5711l20129l22724
2470.7G37647247p85217m65851m86069m31976k30255J85776M11911p4997q9340k7314
2480.4G35653915L55683k3270o38046q16879l76206j17569o65207k16293j58157q4000
2490G32913971k73590j56632N21927p553j18027l19824k81143l93600m02909k90375
2499.7G31192245p37152q5144J1597m9362M5624J7624J89056J10245J6479k57339o4087
2510.3G30389786j04447p4157n03464o93359k68403n23529j53579k75803r613L64151
2519.9G28147583Q4457R9564m1428J89438k53372m86832n81283n39856k04468n17273
2529.6G25896530n27878m56009j1901j86081o9962K64206j84708J70441Q4000k84195
$$ plain form
2539.2 724694443 724077606 723424377 723056488 722813721 722456131 721573563 721053619 721209106 721394043 720618668
2548.9 720618668 719901199 720166779 720491028 720764008 720569534 720392303 720046616 719575195 719147339 718331451
2558.5 718331451 718033218 717655334 717011108 716756439 716831207 716892471 717194366 717544785 717379532 717242279
2568.1 717242279 716732635 716241302 715541763 714865417 714692841 713902130 713354416 713074341 712978210 713091278
2577.8 713091278 712998810 712814331 712641830 712960052 712977371 712764664 712464218 712059326 711683197 711096649
2587.4 711096649 710837326 710697556 710342484 709608002 709384232 709495163 709344635 709429016 709290848 709399338
2597.1 709399338 709547806 709444504 709104233 708525543 708047638 707535858 707432327 707250748 707030563 706923141
2606.7 706923141 706617584 706386871 706267319 706144180 705750885 705564880 705423508 705262909 704797440 703805084
$$ packed form
2539.2G24694443o16837o53229l67889k42767l57590q82568n19944J55487J84937p75375
2548.9G20618668p17469K65580L24249K72980j94474j77231l45687m71421m27856q15888
2558.5G18331451k98233l77884o44226k54669P4768O1264L01895L50419j65253j37253
2568.1G17242279n09644m91333o99539o76346j72576p90711n47714k80075r6131J13068
2577.8G13091278r2468j84479j72501L18222J7319k12707l00446m04892l76129n86548
2587.4G11096649k59323j39770l55072p34482k23770J10931j50528Q4381j38168J08490
2597.1G09399338J48468j03302l40271n78690m77905n11780j03531j81579k20185j07422
2606.7G06923141l05557k30713j19552j23139l93295j86005j41372j60599m65469r92356
$$ plain form
2616.4 703805084 703182373 702830048 702646561 702361984 702176514 702095871 701934357 701952133 701753616 701357727
2626 701357727 700516434 699610214 699053421 698488312 697520218 696722107 696628418 696282730 695964508 695675354
2635.6 695675354 695487442 695512848 695274124 695071793 694462967 693685455 693124619 692760239 692159729 691262360
2645.3 691262360 690526428 689799347 689458008 689081268 688740387 688652039 688420334 688054657 687731247 687720490
2654.9 687720490 687251358 686471100 685761795 684980316 684335709 683891602 683279343 682604828 682733841 682739410
2664.6 682739410 682450409 682334290 682352371 682224197 681301575 680618820 680048676 679625778 679485855 678865509
2674.2 678865509 678181686 677620850 677289581 676983109 676859055 676689682 676489029 676410980 675914917 675500641
2683.9 675500641 675182114 675231171 675121841 674308090 673439865 672722702 672258530 671492310 671142578 671289520
$$ packed form
2616.4G03805084o22711l52325j83487k84577j85470q0643j61514J7776j98517l95889
2626G01357727q41293r06220n56793n65109r68094p98111r3689l45688l18222k89154
2635.6F95675354j87912K5406k38724k02331o08826p77512n60836l64380o00510q97369
2645.3F91262360p35932p27081l41339l76740l40881q8348k31705l65677l23410j0757
2654.9F87720490m69132p80258p09305p81479o44607m44107o12259o74515J29013N569
2664.6F82739410k89001j16119J8081j28174r22622o82755n70144m22898j39923o20346
2674.2F78865509o83823n60836l31269l06472j24054j69373k00653p8049m96063m14276
2683.9F75500641l18527M9057j09330q13751q68225p17163m64172p66220l49732J46942
$$ plain form
2693.5 671289520 671001282 670578461 670198288 669986725 669675598 669280548 669070282 668758469 667945328 667329102
2703.1 667329102 667026672 666268005 665745697 665225220 664609451 664440765 664196091 663859253 663773193 663829575
2712.8 663829575 663440475 662658615 662012482 661406937 660742416 660392838 659994888 659519577 659426193 659079285
2722.4 659079285 658860550 659003601 658966293 658371429 657347031 656928635 656677094 656097488 655589752 655283661
2732.1 655283661 655088577 654889908 654576569 654131012 653806610 653602448 653623810 653344955 652975922 652703476
2741.7 652703476 652261047 652320480 651981201 651307373 651000366 650644836 650191956 649814072 649813995 649713135
2751.4 649713135 649482193 649203339 649023972 648826828 648562469 648537674 648126984 647847900 647523270 647075119
2761 647075119 646875839 646561890 646705322 646568909 645845871 645446472 645474319 645586853 645464096 644984589
$$ packed form
2693.5F71289520k88238m22821l80173k11563l11127l95050k10266l11813q13141o16226
2703.1F67329102l02430p58667n22308n20477o15769j68686k44674l36838q6060N6382
2712.8F63829575l89100p81860o46133o05545o64521l49578l97950m75311r3384l46908
2722.4F59079285k18735J43051l7308n94864j024398m18396k51541n79606n07736l06091
2732.1F55283661j95084j98669l13339m45557l24402k04162K1362k78855l69033k72446
2741.7F52703476m42429N9433l39279o73828l07007l55530m52880l77884p7j00860
2751.4F49713135k30942k78854j79367j97144k64359k4795m10690k79084l24630m48151
2761F47075119j99280l13949J43432j36413p23038l99399K7847J12534j22757m79507
$$ plain form
2770.7 644984589 644642715 644719162 644361572 643899078 643461838 642703323 642035980 641828690 642044373 641857605
2780.3 641857605 641445847 641186142 640936356 640405884 639866638 639661674 639483414 639266167 638492012 637576942
2789.9 637576942 636687737 636098251 635732765 635163193 634979782 634189186 633516388 633146667 632498741 632123337
2799.6 632123337 631520309 631111488 630167542 629267159 628938179 628101883 627320061 626543312 625850601 625171356
2809.2 625171356 624282379 623304482 622857170 622674065 621974754 621391716 620323448 618856659 617624092
2817.9 617624092 616817818 616182594 615036888 614037094 613408661 612891998 611735077 610493927 609816246
2826.6 609816246 608774338 607848969 607239532 606332664 605036926 603957024 603111649 602012787 600692635
2835.3 600692635 599537086 598765221 597529068 596173363 595046349 593547058 591825867 590357628
$$ packed form
2770.7F44984589l41874P6447l57590m62494m37240p58515o67343k07290K15683j86768
2780.3F41857605m11758k59705k49786n30472n39246k04964j78260k17247p74155r15070
2789.9F37576942q89205n89486l65486n69572j83411p90596o72798l69721o47926l75404
2799.6F32123337o03028m08821r43946r00383l28980q36296p81822p76749o92711o79245
2809.2F25171356q88977r77897m47312j83105o99311n83038j068268j466789j232567
2817.9F17624092q06274o35224j145706r99794o28433n16663j156921j241150o77681
2826.6F09816246j041908r25369o09437r06868j295738j079902q45375j098862j320152
2835.3F00692635j155549p71865j236153j355705j127014j499291j721191j468239
$$ plain form
2843 590357628 589206581 587717857 586132240 584544792 582548218 580509949 578781776 576971169 575258484
2851.7 575258484 574129181 572989769 572119217 571252785 570121040 569206429 568650360 568323059 567315979
2860.3 567315979 566251297 565193138 563950653 562588425 560935555 559663582 557776604 555615616
2868.1 555615616 553954430 552443466 551029205 549528732 547949867 545451889 542822647 540787659
2875.8 540787659 538822670 536848373 534789810 532968559 531311760 530090218 528962364 527686844
2883.5 527686844 526575279 525254250 523942566 523181610 522984619 522387695 521728783 521400375 520909882
2892.2 520909882 520614357 520484009 520387001 519967308 519802895 519769020 519240379 519089508 518824539 517940941
2901.8 517940941 517115250 516942520 516610794 515600548 515052795 514914894 514316597 513277893 512296143
$$ packed form
2843E90357628j151047j488724j585617j587448j996574k038269j728173j810607j712685
2851.7E75258484j129303j139412q70552q66432j131745r14611n56069l27301j007080
2860.3E67315979j064682j058159j242485j362228j652870j271973j886978k160988
2868.1E55615616j661186j510964j414261j500473j578865k497978k629242k034988
2875.8E40787659j964989j974297k058563j821251j656799j221542j127854j275520
2883.5E27686844j111565j321029j311684p60956j96991n96924o58912l28408m90493
2892.2E20909882k95525j30348r7008m19693j64413l3875n28641j50871k64969q83598
2901.8E17940941q25691j72730l31726j010246n47753j37901n98297j038704r81750
$$ plain form
2910.5 512296143 511272621 510430794 509562836 508163223 506671448 505143623 503377495 501225853 499326172
2919.2 499326172 497674255 496208801 495176735 493848572 492399902 491067467 490296936 489804001 489626427
2927.8 489626427 489907684 489384422 488948250 489054375 489329376 490042572 491271400 492815666 494350815
2936.5 494350815 495966530 497277946 498801956 500637932 502815666 505212555 507150269 509269295
2944.2 509269295 511337357 513690910 516334114 518470879 520284271 522116852 524501991 526898804
2952 526898804 528879433 530698814 532769012 534901543 536925125 539147797 541163483 543084068 545209885
2960.6 545209885 547497253 549446411 551376915 553333244 554709282 556127052 557579575 559162712
2968.3 559162712 561086273 562982903 564358101 565703049 567601776 568993607 570024567 571452942
$$ packed form
2910.5E12296143j023522q41827q67958j399613j491775j527825j766128k151642j899681
2919.2D99326172j651917j465454j032066j328163j448670j332435p70531m92935j77574
2927.8D89626427K81257n23262m36172J06125K75001P13196J228828J544266J535149
2936.5D94350815J615715J311416J524010J835976K177734K396889J937714K119026
2944.2E09269295K068062K353553K643204K136765J813392J832581K385139K396813
2952E26898804J980629J819381K070198K132531K023582K222672K015686J920585K125817
2960.6E45209885K287368J949158J930504J956329J376038J417770J452523J583137
2968.3E59162712J923561J896630J375198J344948J898727J391831J030960J428375
$$ plain form
2976.1 571452942 572997437 574118195 575199509 576434822 577594719 578972473 579976616 581052780
2983.8 581052780 582296028 583198509 584175835 584949646 585616112 586196175 586697655 587378311 588029938
2992.5 588029938 588460579 588681259 588916473 589682007 590486488 590447540 590431900 590542603 590675087 591018448
3002.1 591018448 591170387 591170616 590568619 589921989 589638481 589402847 589481506 589637337 589513588 589022102
3011.7 589022102 588274574 587688484 587476006 586929245 586455269 586096916 585265160 584727402 583839378 582631493
3021.4 582631493 581883087 581277122 580461617 579472313 578835716 578357086 577730064 576756973 576082878 575678291
3031 575678291 574656410 573601761 572655792 571687775 570573959 569375916 568478241 567965279 567231445
3039.7 567231445 566170807 565159492 563848953 563045692 562331276 561348724 560420303 559010506 557887650
$$ packed form
2976.1E71452942J544495J120758J081314J235313J159897J377754J004143J076164
2983.8E81052780J243248R02481R77326P73811O66466N80063N01480O80656O51627
2992.5E88029938M30641K20680K35214P65534Q04481l8948j5640J10703J32484L43361
3002.1E91018448J51939K29o01997o46630k83508k35634P8659J55831j23749m91486
3011.7E89022102p47528n86090k12478n46761m73976l58353q31756n37758q88024j207885
3021.4E82631493p48406o05965q15505r89304o36597m78630o27022r73091o74095m04587
3031E75678291j021881j054649r45969r68017j113816j198043q97675n12962p33834
3039.7E67231445j060638j011315j310539q03261p14416r82552r28421j409797j122856
$$ plain form
3048.4 557887650 556650810 555506058 554702263 553632507 552883720 552066650 551062889 549945450 548529091
3057.1 548529091 547335396 546319809 545049477 544385376 543897476 542580147 541450958 539873543 538649139
3065.7 538649139 538509598 537644806 536381531 535189972 534084206 533005753 531952400 530898819 529823074
3074.4 529823074 529158516 528340530 527074928 525814934 525003929 524011803 522695961 521522217 520494804
3083.1 520494804 519873505 518873596 517725601 516723938 515420265 514233208 513264046 512399445 511207047
3091.8 511207047 509853516 508710022 507911263 507186089 506110802 505269890 504728775 503907318 502575264
3100.5 502575264 501315536 500377388 499345169 498110466 497111168 495971794 494412956 493719254 493063354
3109.1 493063354 492080765 491322136 490168877 489229546 488469086 487495651 486070747 484862595 484285698
$$ packed form
3048.4E57887650j236840j144752q03795j069756p48787q17070j003761j117439j416359
3057.1E48529091j193695j015587j270332o64101m87900j317329j129189j577415j224404
3065.7E38649139j39541q64792j263275j191559j105766j078453j053353j053581j075745
3074.4E29823074o64558q17986j265602j259994q11005r92126j315842j173744j027413
3083.1E20494804o21299r99909j147995j001663j303673j187057r69162q64601j192398
3091.8E11207047j353531j143494p98759p25174j075287q40912n41115q21457j332054
3100.5E02575264j259728r38148j032219j234703r99298j139374j558838o93702o55900
3109.1D93063354r82589p58629j153259r39331p60460r73435j424904j208152n76897
$$ plain form
3117.8 484285698 483250351 481714287 480542450 480180016 479162178 477721024 477171669 476522675 475490685
3126.5 475490685 474375496 473429718 472515221 471439819 470267792 469501305 468746529 467446976 466527100
3135.2 466527100 465471802 464603767 464001808 462988243 461982040 460827141 459811058 458763962 457956238
3143.9 457956238 457496719 457082939 456366081 455043831 454120407 452997398 452030640 451620522 450486069
3152.5 450486069 449114838 448352470 448204231 447703857 446678658 445679970 444969635 444149017 442606125
3161.2 442606125 441277580 440719604 440261612 439255180 438254623 437480392 436737862 435934029 434850006
3169.9 434850006 434320488 433871651 433340645 432765808 431670456 430870667 430266609 429586830 428478165
3178.6 428478165 427448120 426852417 426087341 425977783 425777626 424661636 423624268 422669144 421860695
$$ packed form
3117.8D84285698j035347j536064j171837l62434j017838j441154n49355o48994j031990
3126.5D75490685j115189r45778r14497j075402j172027p66487p54776j299553r19876
3135.2D66527100j055298q68035o01959j013565j006203j154899j016083j047096q07724
3143.9D57956238m59519m13780p16858j322250r23424j123009r66758m10118j134453
3152.5D50486069j371231p62368j48239n00374j025199r98688p10335q20618j542892
3161.2D42606125j328545n57976m57992j006432j000557p74231p42530q03833j084023
3169.9D34850006n29518m48837n31006n74837j095352p99789o04058o79779j108665
3178.6D28478165j030045n95703p65076j09558k00157j115990j037368r55124q08449
$$ plain form
3187.3 421860695 421500549 421131973 420411034 419197807 418320312 418125000 417274094 416149521 415640907
3195.9 415640907 415372810 414811096 414048653 413672562 413283806 412758522 411988525 411029205 410265694 409620781
3205.6 409620781 409134750 408490524 407767372 407130890 406899414 406689720 405948334 405345078 404780922 404176216
3215.2 404176216 403639183 403243217 402852402 402074547 401066246 400106544 399638519 399401207 399196243
3223.9 399196243 398903618 398292809 397714996 397191925 396462746 395799141 395715637 395437050 394634209 393889389
3233.5 393889389 393716202 393765297 393145561 392183113 391244736 391096878 390716591 389816055 389948349 389815216
3243.2 389815216 389342842 388685341 388159714 388277321 387787285 387005806 386083832 385425415 385445213 385494194
3252.8 385494194 385041580 384061356 383507576 383390884 383234978 382990417 382989120 382639923 381720657 381016083
$$ packed form
3187.3D21860695l60146l68576p20939j213227q77495j95312q50906j124573n08614
3195.9D15640907k68097n61714p62443l76091l88756n25284p69997r59320p63511o44913
3205.6D09620781m86031o44226p23152o36482k31476k09694p41386o03256n64156o04706
3215.2D04176216n37033l95966l90815p77855j008301r59702m68025k37312k04964
3223.9C99196243k92625o10809n77813n23071p29179o63605q3504k78587q02841p44820
3233.5C93889389j73187M9095o19736r62448r38377j47858l80287r00536J32294j33133
3243.2C89815216m72374o57501n25627J17607m90036p81479r21974o58417J9798M8981
3252.8C85494194m52614r80224n53780j16692j55906k44561j297l49197r19266p04574
$$ plain form
3262.5 381016083 380450287 380282478 380001526 379642220 379653168 379548645 379309006 378639488 377999802 377984886
3272.1 377984886 378226585 377858582 376941910 376161842 375314713 374923592 374897385 374767380 374670029 374542313
3281.8 374542313 374411163 374133224 373818626 373119202 372303543 372536278 372822495 372483673 372204361 371563835
3291.4 371563835 370853729 370694275 370911713 371036682 370665016 370075836 369168015 368389816 368169861 368166237
3301 368166237 368145332 367785454 367655106 367851982 367649689 366956482 366440964 366193886 365718727 365171165
3310.7 365171165 364673271 364744835 364542389 363864479 363771973 363262863 362626724 362560310 362510643 362140503
3320.3 362140503 361633301 361358986 361215630 360948868 360171967 359550438 359065361 358593979 358307838 357845612
3330 357845612 357883339 357728920 357465019 357222061 356127090 355681648 355738182 355221634 354739571 354309769
$$ packed form
3262.5C81016083n65796j67809k80952l59306J0948j04523k39639o69518o39686j4916
3272.1C77984886K41699l68003r16672p80068q47129l91121k6207j30005r7351j27716
3281.8C74542313j31150k77939l14598o99424q15659K32735K86217l38822k79312o40526
3291.4C71563835p10106j59454K17438J24969l71666n89180r07821p78199k19955l624
3301C68166237k0905l59878j30348J96876k02293o93207n15518k47078m75159n47562
3310.7C65171165m97894P1564k02446o77910r2506n09110o36139o6414m9667l70140
3320.3C62140503n07202k74315j43356k66762p76901o21529m85077m71382k86141m62226
3330C57845612L7727j54419k63901k42958j094971m45442N6534n16548m82063m29802
$$ plain form
3339.6 354309769 354123993 354286613 353901253 353171425 352656517 352284508 352093277 351673355 351194267 350664024
3349.3 350664024 350195847 350048561 349557381 348651237 348049469 348133316 347951698 347688141 347401657 346729164
3358.9 346729164 346575356 346221657 345610657 345090103 344773903 344731407 344452171 344121704 343450851 343192444
3368.6 343192444 342952461 342330704 342191429 341699905 341250191 340959396 340367813 340159988 340107231 339473267
3378.2 339473267 338755569 338639565 338514938 338198700 337922516 337769203 337538948 337261925 337282715 337347717
3387.8 337347717 337299728 336944084 336613388 336516991 336109085 335411263 335123100 334862175 334569817 334831276
3397.5 334831276 334621124 334672775 334964867 334172859 333644524 333888435 334071922 333525848 332904015 332827187
3407.1 332827187 333156166 333543243 333291130 333163071 333066216 332776070 332654762 332618103 332894173 332995949
$$ packed form
3339.6C54309769j85776J62620l85360p29828n14908l72009j91231m19922m79088n30243
3349.3C50664024m68177j47286m91180r06144o01768Q3847j81618k63557k86484o72493
3358.9C46729164j53808l53699o11000n20554l16200m2496k79236l30467o70853k58407
3368.6C43192444k39983o21757j39275m91524m49714k90795n91583k07825n2757o33964
3378.2C39473267p17698j16004j24627l16238k76184j53313k30255k77023K0790O5002
3387.8C37347717m7989l55644l30696r6397m07906o97822k88163k60925k92358K61459
3397.5C34831276k10152N1651K92092p92008n28335K43911J83487n46074o21833p6828
3407.1C32827187L28979L87077k52113j28059r6855k90146j21308l6659K76070J01776
$$ plain form
3416.8 332995949 332649231 332392921 332598991 332454796 332201118 332396584 332474899 332676315 332731705 332675285
3426.4 332675285 332592545 332525215 332456589 332081718 332097015 332410736 332658958 333088646 333770752 334034386
3436.1 334034386 333468132 333199196 333694458 334020576 334333420 334676971 334042473 334128952 335062599 335765228
3445.7 335765228 336214943 335360641 335539551 336418648 336337357 336454811 336786652 337258911 337576103 337636795
3455.3 337636795 337873993 338152924 338229027 338696175 339552994 339863815 340069351 340118713 340011444 340316048
3465 340316048 341113167 341502876 341451263 342000084 342273026 342592049 343108826 343631973 344447098 344657478
3474.6 344657478 344635239 345346336 346530380 346901512 346956367 347442093 348053055 348249359 347984962 348930855
3484.3 348930855 349811630 349921913 350379410 351236382 351837654 351928101 352640648 353381500 353928566 354015770
$$ packed form
3416.8C32995949l46718k56310K06070j44195k53678J95466P8315K01416N5390n6420
3426.4C32675285q2740o7330o8626l74871J5297L13721K48222M29688O82106K63634
3436.1C34034386n66254k68936M95262L26118L12844L43551o34498Q6479R33647P02629
3445.7C35765228M49715q54302J78910Q79097q1291J17454L31841M72259L17192O0692
3455.3C37636795K37198K78931P6103M67148Q56819L10821K05536M9362j07269L04604
3465C40316048P97119L89709n1613N48821K72942L19023N16777N23147Q15125K10380
3474.6C44657478k2239P11097J184044L71132N4855M85726O10962J96304k64397R45893
3484.3C48930855Q80775J10283M57497Q56972O01272R0447P12547P40852N47066Q7204
$$ plain form
3493.9 354015770 354284477 355088120 354913521 355244980 355638771 355908775 356839447 358010750 358972435
3502.6 358972435 358880157 359232063 360246353 361020813 361161995 362154846 362962608 362210579 363065567 364033508
3512.2 364033508 364891319 365650063 365584755 365776978 366413918 367655411 368243408 368734474 369533005 370844383
3521.9 370844383 371515503 370128403 370213394 371457443 372959061 373772049 374048309 374776840 375581741
3530.6 375581741 376129265 376087189 377059288 378127480 379102173 379264030 379208069 380548058 380964012 382047539
3540.2 382047539 382979088 383286705 384177513 385044670 385753479 386132927 387306137 387122421 388295593
3548.9 388295593 389763947 390482140 392277832 391773682 392451897 393848534 395535469 397175713 397011757
3557.6 397011757 398154640 399518700 400832062 400860291 402448692 404245567 404318657 407836761 407701836
$$ packed form
3493.9C54015770K68707Q03643j74599L31459L93791K70004R30672J171303R61685
3502.6C58972435r2278L51906J014290P74460J41182R92851Q07762p52029Q54988R67941
3512.2C64033508Q57811P58744o5308J92223O36940J241493N87997M91066P98531J311378
3521.9C70844383O71120j387100Q4991J244049J501618Q12988K76260P28531Q04901
3530.6C75581741N47524m2076R72099J068192R74693J61857n5961J339989M15954J083527
3540.2C82047539R31549L07617Q90808Q67157P08809L79448J173210j83716J173172
3548.9C88295593J468354P18193J795692n04150O78215J396637J686935J640244j63956
3557.6C97011757J142883J364060J313362K8229J588401J796875P3090L518104j34925
$$ plain form
3566.2 407701836 406553116 406388016 406172256 410452843 412733154 414033890 415400658 416777916 417612534
3574.9 417612534 418396492 420482330 421380005 423517075 424786491 425409775 427340965 429353752 431108971
3583.6 431108971 431941338 435805397 437618790 436431046 438165207 437709160 440237732 442861633 445878372
3592.3 445878372 446861725 447159309 450713234 449671211 452085152 455266342 455716248 459180298 460194130
3601 460194130 460458832 462169838 464275818 466642685 469653435 472365952 471702728 475273247 474803085
3609.6 474803085 474302444 481329041 481443443 480141716 485021744 484544792 488048592 491837883 491174622
3618.3 491174622 493207817 492909355 493916092 497396698 500297394 502822914 504816780 505893631
3626 505893631 507619057 514034157 514222374 503861771 508885956 514447021 519833260 521542206 520468216
$$ packed form
3566.2D07701836j148720j65100k15760M280587K280311J300736J366768J377258Q34618
3574.9D17612534P83958K085838Q97675K137070J269416O23284J931190K012787J755219
3583.6D31108971Q32367L864059J813393j187744J734161m56047K528572K623901L016739
3592.3D45878372R83353K97584L553925j042023K413941L181190M49906L464050J013832
3601D60194130K64702J711006K105980K366867L010750K712517o63224L570519m70162
3609.6D74803085n00641P026597J14402j301727M880028m76952L503800L789291o63261
3618.3D91174622K033195k98462J006737L480606K900696K525520J993866J076851
3626E05893631J725426O415100J88217j0360603N024185N561065N386239J708946j073990
$$ plain form
3634.7 520468216 522670212 525304451 527207832 527949944 530018272 532037773 533568687 534627914
3642.4 534627914 535847588 538876076 542359390 547864151 546867599 543470459 549107819 548602753 545208054
3651.1 545208054 544763756 550622864 555145073 558779488 563649979 556247520 557204933 562155495 564101906
3659.8 564101906 565731621 566045761 567956848 569035568 570492477 572396164 573321304 577543945 580494003
3668.5 580494003 580633163 580849648 574864388 577041550 584967842 594026680 593135643 574328041 577971077
3677.1 577971077 586295052 591570740 589771767 589895782 592979813 594596901 595575943 595923424 596593094
3685.8 596593094 601272545 608260498 599439697 596542244 605908928 599895897 599155312 604748116
3693.5 604748116 605436554 606651993 606665993 606556053 608093071 608621101 611460724 614752769 609372826
$$ packed form
3634.7E20468216K201996K634239J903381P42112K068328K019501J530914J059227
3642.4E34627914J219674L028488L483314N504761r96552l397140N637360n05066l394699
3651.1E45208054m44298N859108M522209L634415M870491p402459R57413M950562J946411
3659.8E64101906J629715L14140J911087J078720J456909J903687R25140M222641K950058
3668.5E80494003J39160K16485n985260K177162P926292R058838q91037j8807602L643036
3677.1E77971077Q323975N275688j798973J24015L084031J617088R79042L47481O69670
3685.8E96593094M679451O987953q820801k897453R366684o013031p40585N592804
3693.5F04748116O88438J215439J4000j09940J537018N28030K839623L292045n379943
$$ plain form
3702.2 609372826 607662125 612936401 614098511 614070015 615184402 618307152 621697540 613504105 618069496
3710.9 618069496 623232994 610840454 615326233 619193764 620277557 622107697 624305801 625754738
3718.6 625754738 622782059 623532562 628567162 623743134 619251022 625367737 627418861 626857185 623153229
3727.3 623153229 623169556 627600174 628948517 634671478 632017441 624367714 633823891 636756783 627747040
3736 627747040 626769905 628875465 629469376 633274269 637665176 633568764 636768951 649040527 636286697
3744.7 636286697 620576553 631921425 638197556 645069656 641774063 630778427 642690887 637912369
3752.4 637912369 630537300 635736008 640769043 645178757 639513969 641611099 647530289 639607964
3760.1 639607964 638262024 642637558 644378433 645378418 648784866 645211182 640967407 645547638
$$ packed form
3702.2F09372826j710701N274276J162110k8496J114387L122750L390388q193435M565391
3710.9F18069496N163498j2392540M485779L867531J083793J830140K198104J448937
3718.6F25754738k972679P50503N034600m824028m492112O116715K051124n61676l703956
3727.3F23153229J6327M430618J348343N722961k654037p649727R456177K932892r009743
3736F27747040r77135K105560N93911L804893M390907m096412L200187J2271576j2753830
3744.7F36286697j5710144J1344872O276131O872100l295593j0995636J1912460m778518
3752.4F37912369p375069N198708N033035M409714n664788K097130N919190p922325
3760.1F39607964j345940M375534J740875R99985L406448l573684m243775M580231
$$ plain form
3767.8 645547638 651010895 650737762 640952454 643198929 647134171 647553024 648645020 648479919 649256516
3776.5 649256516 649797440 652882233 653184814 645051956 647348175 649825516 651270905 653682785 650562363
3785.2 650562363 649582520 651132889 652365036 652777176 652462463 653501053 653634949 653704453 653609924
3793.8 653609924 655615540 660035477 656614075 651983261 653258362 657310028 664152069 657438126
3801.5 657438126 646802673 651117554 654505539 659934692 666479187 657105484 651808319 656271744
3809.3 656271744 658083572 658531265 659397964 659462585 660991745 667128067 665085602 650167465 655472870
3817.9 655472870 661907578 667041931 667971802 648905792 653255310 660543747 662012787 664459000
3825.7 664459000 665254211 660611038 660424042 662210083 665356979 666511536 658186493 661846848 669579773
$$ packed form
3767.8F45547638N463257k73133r785308K246475L935242M18853J091996j65101P76597
3776.5F49256516N40924L084793L02581q132858K296219K477341J445389K411880l120422
3785.2F50562363r79843J550369J232147M12140l14713J038590J33896O9504r4529
3793.8F53609924K005616M419937l421402m630814J275101M051666O842041o713943
3801.5F57438126j0635453M314881L387985N429153O544495r373703n297165M463425
3809.3F56271744J811828M47693Q66699O4621J529160O136322k042465j4918137N305405
3817.9F55472870O434708N134353R29871j9066010M349518P288437J469040K446213
3825.7F64459000P95211m643173j86996J786041L146896J154557q325043L660355P732925
$$ plain form
3834.3 669579773 663166199 661926575 670504150 663266830 659692307 667897339 661922226 661812134
3842.1 661812134 668519440 665332642 661739273 664454498 666192398 667075500 668756714 667268829
3849.8 667268829 669520950 675549316 669810257 671261749 654765472 656594315 668187256 667148895
3857.5 667148895 664698334 667093430 669844131 672241974 666411057 667405014 675384750 668616714
3865.2 668616714 661965027 666346893 672425308 678803711 670152130 660843430 665256424 672781982
3872.9 672781982 675792313 663907242 665435715 669906158 670065994 672614059 677506180 672393875
3880.6 672393875 665062714 671323700 672714233 674346390 679562683 666800842 667790604 671578598
3888.3 671578598 671876526 676026840 675233154 667200241 669093018 672481537 671511459 672775574 673529816
$$ packed form
3834.3F69579773o413574j239624Q577575p237320l574523Q205032n975113j10092
3842.1F61812134O707306l186798l593369K715225J737900Q83102J681214j487885
3849.8F67268829K252121O028366n739059J451492j6496277J828843J1592941j038361
3857.5F67148895k450561K395096K750701K397843n830917R93957P979736o768036
3865.2F68616714o651687M381866O078415O378403q651581r308700M412994P525558
3872.9F72781982L010331j1885071J528473M470443J59836K548065M892121n112305
3880.6F72393875p331161O260986J390533J632157N216293j2761841R89762L787994
3888.3F71578598K97928M150314p93686q032913J892777L388519r70078J264115P54242
$$ plain form
3897 673529816 676227646 678270950 669033279 674646912 676392288 670443039 675717926 672854538 670840149
3905.7 670840149 671612244 672529144 674989548 674993057 674827271 674768600 674743042 673948441 673594131 675553360
3915.3 675553360 677694550 674678955 671835403 676337585 675742950 671910172 674723663 676307373
3923.1 676307373 676851501 674180679 671463394 673261566 675174332 677324829 676180267 675445480 677654724
3931.7 677654724 675935211 674750671 675578690 675857391 676522751 676970444 676444626 676103210 676533661
3940.4 676533661 678615265 679376602 674361191 673722916 675185471 676125717 677804260 675645981 676846085
3949.1 676846085 677673569 674970016 676738892 677385864 676784363 677281799 677754440 678022614 677895126
3957.8 677895126 678147202 678078613 679199600 678934021 676488953 676322556 677407837 677999878 677666245
$$ packed form
3897F73529816K697830K043304r237671N613633J745376n949249N274887k863388k014389
3905.7F70840149P72095R16900K460404L509j65786n8671k5558p94601l54310J959229
3915.3F75553360K141190l015595k843552M502182n94635l832778K813491J583710
3923.1F76307373N44128k670822k717285J798172J912766K150497j144562p34787K209244
3931.7F77654724j719513j184540Q28019K78701O65360M47693n25818l41416M30451
3940.4F76533661K081604P61337n015411o38275J462555R40246J678543k158279J200104
3949.1F76846085Q27484k703553J768876O46972o01501M97436M72641K68174j27488
3957.8F77895126K52076o8589J120987k65579k445068j66397J085281N92041l33633
$$ plain form
3966.5 677666245 677978745 678880005 678485413 677806931 678296432 678457794 677930145 678303986 678655548 678231506
3976.1 678231506 677931595 678434601 678390808 678384781 679000092 678859253 678599548 677745590 677801285 678834839
3985.7 678834839 679126282 678807373 678478088 679471283 679262161 678950348 680066376 680668869 680968323
3994.4 680968323 679590378 678541565 678991776 679554977 680193024 679966660
4000.2 679966660
$$ packed form
3966.5F77666245L12500R01260l94592o78482M89501J61362n27649L73841L51562m24042
3976.1F78231506k99911N03006m3793o027O15311j40839k59705q53958N5695J033554
3985.7F78834839K91443l18909l29285R93195k09122l11813J116028O02493K99454
3994.4F80968323j377945j048813M50211N63201O38047k26364
4000.2F79966660
##END=$$ End of the data block
