##TITLE=$$ Begin of the data block
##JCAMP-DX=5.00 $$ ACD/SpecManager v 10.08
##SPECTROMETER/DATA SYSTEM=Varian
##DATE=20 Nov 2012 13:28:32
##DATA TYPE=INFRARED SPECTRUM
##DATA CLASS=XYDATA
##ORIGIN=
##OWNER=
##NPOINTS=3735
##FIRSTX=399.26403809
##LASTX=4000.35498047
##MAXX=4000.35498047
##MINX=399.26403809
##MAXY=76.09544373
##MINY=27.00846672
##XFACTOR=1.0000000000
##YFACTOR=0.000000100000000
##FIRSTY=52.39168167
##DELTAX=0.96440572
##XUNITS=1/CM
##YUNITS=TRANSMITTANCE
##XYDATA=(X++(Y..Y))
399.3E23916817L047561J767884j874543o825370p988968J238289K824859n332489
407E10774040M01879J289405R135285P927704o560898l633003M959449J793747n497589
415.7E20590019j974945k697830j315384P967453k531929O92978L496895M906196l346710
424.3E25786743n346374j237221K065620p293396j1180381M056243Q91343n89714M21409
433E07574272K89574P941437q47626l317757k152481j695709R61647K40021L607254
441.7E12600632m68560J138001K873993j413880q3389J701584M868622M601631P62939
450.4E26581573K122193M730415j367645p210197j281548N344467L321953m430428
458.1E27810783l874015m557305Q48847N830612K16598J526718P38221n487290n411987
$$ y = [523916817, 526964378, 528732262, 526857719, 520032349, 512043381, 513281670, 516106529, 510774040, 511175919, 512465324, 521600609, 529528313, 522967415, 519334412, 524293861, 526087608, 520590019, 518615074, 515917244, 514601860, 522569313, 520037384, 520730362, 524227257, 529133453, 525786743, 520440369, 519203148, 521268768, 513975372, 502794991, 506851234, 507742577, 507152863, 507574272, 507863846, 515805283, 514957657, 511639900, 509487419, 507791710, 508753357, 508993378, 512600632, 512132072, 513270073, 516144066, 514730186, 514646797, 516348381, 521217003, 525818634, 526581573, 528703766, 533434181, 532066536, 524856339, 523574791, 528919258, 532241211, 527810783, 523936768, 519379463, 520228310, 526058922, 526275520, 527802238, 528540459, 523053169, 517641182]
466.8E17641182l380165k133942j818390k550506K480430K421379o721611j860237
474.5E04078140J004067N615577n70373p481117k036934j913224k379074l821869j8920
483.2D92476273K984314J02920L664360L952255j374015p463837j805801R144020O672401
491.8E08352890j766701k394638k775879m780540k912750N10101K69318n656434l247604
500.5D85597763N96275l628196K114448N134545J081276l986779l83377K460938j823922
509.2D87162971l367729o658439m776078k105293j526871O0769J52969J530228o16990
517.9D69855537k604370l321228L01056n15365l198815k174721k161331l48549j010513
526.6D54821701P63741J39923K37426R7695j901245J833648J549225L044358J815567
$$ y = [517641182, 514261017, 512127075, 510308685, 507758179, 510238609, 512659988, 505938377, 504078140, 505082207, 510697784, 510127411, 502646294, 500609360, 498696136, 496317062, 492495193, 492476273, 495460587, 495563507, 499227867, 503180122, 501806107, 494342270, 492536469, 501680489, 508352890, 506586189, 504191551, 501415672, 496635132, 493722382, 494232483, 494501801, 488845367, 485597763, 486194038, 482565842, 484680290, 489814835, 490896111, 486909332, 486525955, 488986893, 487162971, 483795242, 477136803, 472360725, 470255432, 468728561, 468789330, 468942299, 470472527, 469855537, 467251167, 463929939, 464230995, 463715630, 460516815, 458342094, 456180763, 455832214, 454821701, 455585442, 455725365, 455962791, 456060486, 454159241, 455992889, 457542114, 460586472, 462402039]
535.2D62402039P68394K789955N12009K588920J669808Q02879K464409K112351J077919
543.9D77188683j40877J241989R94377J884193J876755M22402o82144k478257k223777
552.6D78083344j937447k52266j398239j321564o03256k588654P43142K403488q23975
561.3D72304573l899116l517952l022538l220062k177811l618049m601441n332374
569D42915230k732315j015930j196938p90863J05171J727638R64585J403694N67322
577.7D41947594J381836J932258M20914R70344K840424L458939K004280L530807L958283
586.4D62445679L950195L334923K766228J926803l28140O15883L84140J163711K0829
595D76280251j115151K33269j269570q20388j214218j22796J199952J894722K682952
$$ y = [462402039, 463170433, 465960388, 466472397, 469061317, 470731125, 471534004, 473998413, 476110764, 477188683, 477047806, 478289795, 479284172, 481168365, 483045120, 483467522, 482785378, 480307121, 478083344, 476145897, 475893631, 474495392, 473173828, 472570572, 469981918, 470725060, 473128548, 472304573, 468405457, 464887505, 461864967, 458644905, 456467094, 452849045, 448247604, 442915230, 440182915, 439166985, 437970047, 437179184, 437284355, 439011993, 439976578, 441380272, 441947594, 443329430, 445261688, 445682602, 446652946, 449493370, 452952309, 454956589, 458487396, 462445679, 466395874, 469730797, 472497025, 474423828, 474095688, 474711571, 475095711, 476259422, 476280251, 475165100, 475398369, 474128799, 473308411, 472094193, 471971397, 473171349, 475066071, 477749023]
603.7D77749023L20282k21595o89698J28746l33786l66058p095j408043O40335k70767
613.4D75541344Q67309K305298J191292J940689J303940K535095L178291K330361L91769
622D91585388j20697R81445K70730L96766J133690J746254P19223J231232K794189
630.7E00738220K385636K646560K273941J156273p34634n92118K40098o64177j38932
639.4E07310867O7826J02272j46828R3040J410675J509362J509590K538109J814613
648.1E16209526j89438L33595N51377l86734q94203j155167n93719Q57048K172889
656.8E16905174P16782O13632J958351J365509P12624K51655P50580k85377j571503
665.4E21417427M2038k864456j1615753P693100O107673K328034L87649J060791L174401
$$ y = [477749023, 478069305, 477847710, 477158012, 477286758, 476952972, 476586914, 476579819, 475171776, 475812111, 475541344, 476408653, 478713951, 479905243, 481845932, 483149872, 485684967, 488863258, 491193619, 491585388, 491464691, 492446136, 492716866, 493113632, 494247322, 495993576, 496712799, 497944031, 500738220, 503123856, 505770416, 508044357, 509200630, 508465996, 507873878, 508113976, 507449799, 507310867, 507378693, 507480965, 507334137, 507427177, 508837852, 510347214, 511856804, 514394913, 516209526, 516020088, 516353683, 516905060, 516518326, 515624123, 514468956, 513875237, 514732285, 516905174, 517621956, 518235588, 520193939, 521559448, 522272072, 522523727, 523274307, 522988930, 521417427, 521459465, 518595009, 506979256, 514672356, 520780029, 523108063, 523495712, 524556503, 527730904]
674.1E27730904K519912O21491M60625M99992k33116j133118m22363k1897n37681J84212
683.8E29668961J077728J106872O21453J170082K369003K095986Q97293M32472p47032
692.4E38692818j478348q43735j516762k298355k686691j898880j64413L73764P26242
701.1E28905640k32506l05672J81236o67877o67419q57048j339379j603584r25178
709.8E22488213m68598p09228K8953J036988K740325L665047K599373K376060L771325
718.5E37528458K857055J695481K174720J578560J671982J775322R07478M92134J486664
727.2E52167854L408242M086265L670731L158302L221130K767182K028732J877937
734.9E76386375K84653q65707k73896p61871j157493o36101Q34732J260872L25584
$$ y = [527730904, 530250816, 530872307, 531332932, 531832924, 531599808, 530466690, 530044327, 530022430, 529484749, 529668961, 530746689, 531853561, 532475014, 533645096, 536014099, 538110085, 539007378, 539439850, 538692818, 537214470, 536370735, 534853973, 532555618, 529868927, 527970047, 527805634, 528179398, 528905640, 528673134, 528367462, 528548698, 527880821, 527213402, 526356354, 525016975, 523413391, 522488213, 522019615, 521310387, 521339340, 522376328, 525116653, 528781700, 531381073, 533757133, 537528458, 540385513, 542080994, 544255714, 545834274, 547506256, 549281578, 550189056, 550681190, 552167854, 555576096, 559662361, 563333092, 566491394, 569712524, 572479706, 574508438, 576386375, 576671028, 575805321, 575531425, 574769554, 573612061, 572975960, 573810692, 575071564, 575397148]
743.6E75397148J114349J389351R01909J32485q11463n88798k541161m053192k872848
752.2E68067780l115731k909660k336350k516708n72128j19324o09093p89718j168938
760.9E53930130o13136k227822k173195o19087j191406j146507o80580P25059J945572
769.6E47949028K582893L277207L152771M217071N079728M614295M031601L991967
777.3E78896561L975029K189445R63669Q60176K089386K756996K673302L487167L455391
786F01347122L257828L234558L790855K524796J648636J426201r2926K47955M8981
794.7F17434006L40843l13683J71662K199554K165566L305587K928086L022423L445777
803.4F34699821K422905J492615K12593l58543k282410k520675j004220j43928j10283
$$ y = [575397148, 576511497, 577900848, 578802757, 578935242, 578123779, 577534981, 574993820, 570940628, 568067780, 564952049, 562042389, 559706039, 557189331, 556617203, 556497879, 555888786, 555099068, 553930130, 553316994, 551089172, 548915977, 548296890, 547105484, 545958977, 545278397, 546003456, 547949028, 550531921, 553809128, 556961899, 561178970, 566258698, 570872993, 574904594, 578896561, 582871590, 585061035, 586024704, 586884880, 588974266, 591731262, 594404564, 597891731, 601347122, 604604950, 607839508, 611630363, 614155159, 615803795, 617229996, 617137070, 617385025, 617434006, 617774849, 617461166, 617632828, 619832382, 621997948, 625303535, 628231621, 631254044, 634699821, 637122726, 638615341, 638827934, 638469391, 636186981, 633666306, 632662086, 632518158, 632407875]
812F32407875k55127R38339K103958K163125J404419K079696J410980o57272j348495
820.7F40247498k194024l194084k769737j444130l029365k992630k63596P77435O19393
829.4F25756760J22642O8360r57375j057205j154557l532753m901847l977471l429146
838.1F06937408l654899k733231k341537j695824p30247K03666O87714m90341p89528
846.8E95393181r69849r52606j238747k688408l291511l870125m121246k996674j683006
855.4E73581009k041054j701507m57802n24140P5150R04617J403732J791268J536827
864.1E74568100K047119K702026K962342L324241M489022N136261N592994O656037
871.8F07478142O201553N853729N287629M117393K509537J039123j00822n01251j013413
$$ y = [632407875, 632152748, 633091087, 635195045, 637358170, 638762589, 640842285, 642253265, 641595993, 640247498, 638053474, 634859390, 632089653, 630645523, 627616158, 624623528, 624359932, 625137367, 625756760, 625879402, 625947762, 624990387, 623933182, 622778625, 619245872, 614344025, 610366554, 606937408, 603282509, 600549278, 598207741, 596511917, 595781670, 595985336, 596673050, 596182709, 595393181, 594423332, 593470726, 592231979, 589543571, 586252060, 582381935, 578260689, 575264015, 573581009, 571539955, 569838448, 569380646, 568856506, 568931656, 569836273, 571240005, 573031273, 574568100, 576615219, 579317245, 582279587, 585603828, 590092850, 595229111, 600822105, 607478142, 613679695, 619533424, 624821053, 628938446, 631447983, 632487106, 632386284, 631885033, 630871620]
880.5F30871620k356605l071671l622208k015686q39462p24487j139221j718483p63436
889.2F14620361j971626l446312m138145l860093l246688m691239m650726l462296
896.9E85153236k749633j435166j056518j274491j022834j290856j647034k128486
904.6E72548218k766037l437767m187470m279213m901352m890060m408035m902687
912.3E38775597m689522l248978k638054l404617l251038k852935l607712m239350
920E10843391l316345k857322k680550j646843j200409j342049j185798N72128J127205
928.7D98313408J216431J431045J208153J873245J512833R97886O49949P73620J84441
937.4E08161011j94664J017112Q13256J732902K855149K591819K731018K504845J587563
$$ y = [630871620, 628515015, 625443344, 621821136, 619805450, 618965988, 618241501, 617102280, 615383797, 614620361, 612648735, 609202423, 605064278, 601204185, 597957497, 593266258, 588615532, 585153236, 582403603, 580968437, 579911919, 578637428, 577614594, 576323738, 574676704, 572548218, 569782181, 566344414, 562156944, 557877731, 552976379, 548086319, 543678284, 538775597, 534086075, 530837097, 528199043, 524794426, 521543388, 518690453, 515082741, 510843391, 507527046, 504669724, 501989174, 500342331, 499141922, 497799873, 496614075, 497186203, 498313408, 499529839, 500960884, 502169037, 504042282, 505555115, 506553001, 507202950, 507976570, 508161011, 507966347, 508983459, 509796715, 511529617, 514384766, 516976585, 519707603, 522212448, 523800011]
946.1E23800011l95356k170372l105850m418106n328293n261879n792732p009773o666870
954.8D83650780o137619n838967n880737n779114n912056o179390o009903p456970
962.5D34456024p667274q362694q900642q284684p785415p683449q938942p947998
970.2C68884926q013764p306709p520027p276382n787392q089523o847954o365299
977.9C11677876o477929o496811o146011m389572m273529l434792l602924j938229
985.6B74918079k196197j026344J2416o43043K63958j244202O54469Q7147j03245P5836
995.3B70798874o38199N05333K2526J835975K15836R01699J372013J59512R81044j27010
1004.9B76027603J331749O19812O66866k00634j092376o07453r19819L36419r90506
$$ y = [523800011, 523404655, 521234283, 518128433, 513710327, 508382034, 503120155, 497327423, 490317650, 483650780, 477513161, 471674194, 465793457, 460014343, 454102287, 447922897, 441912994, 434456024, 426788750, 418426056, 409525414, 401240730, 393455315, 385771866, 376832924, 368884926, 360871162, 353564453, 346044426, 338768044, 332980652, 324891129, 318043175, 311677876, 305199947, 298703136, 292557125, 288167553, 283894024, 280459232, 276856308, 274918079, 272721882, 271695538, 271707954, 271064911, 271328869, 270084667, 270739136, 270826283, 270723038, 270798874, 270160675, 270666008, 270688534, 272524509, 272740345, 273642044, 275014057, 275173569, 276154613, 276027603, 277359352, 277979164, 278646030, 278445396, 277353020, 276745567, 275825748, 276162167, 275171661]
1013.6B75171661J66130K19231P48959J028766O44741J976185Q32367J983586M10175
1022.3B83181801Q47263J294880O57215J275978j72443K044105K079144K225571J182289
1031B94615803J464195K239208J154843K279682p74021N64022J173439R1419K22874
1039.6C03031464q94242L2425q97064O01177q5678J32904Q14991M25739R01967k00558
1049.3C03863125J906223J207771J758633P58515Q79745K695007J388302L469925K588310
1058C20515556L465882L310394L796310N014191L734856M073295K434960M337539L859177
1066.6C54542160K059402K85035j501580k298011n285798l724632m413261l957939
1074.4C35705376k709046k637710j718712k153015M74739l57704L67775L91082R27124
$$ y = [275171661, 275337791, 275557022, 276305981, 277334747, 277979488, 279955673, 280788040, 282771626, 283181801, 284029064, 285323944, 285981159, 287257137, 287084694, 289128799, 291207943, 293433514, 294615803, 296079998, 298319206, 299474049, 301753731, 300979710, 301543732, 302717171, 302808590, 303031464, 302137222, 302169647, 301272583, 301873760, 301788082, 301920986, 302735977, 303161716, 304063683, 303863125, 305769348, 306977119, 308735752, 309494267, 310374012, 313069019, 314457321, 317927246, 320515556, 323981438, 327291832, 331088142, 336102333, 339837189, 343910484, 346345444, 350682983, 354542160, 356601562, 356886597, 355385017, 353087006, 347801208, 344076576, 339663315, 335705376, 332996330, 330358620, 328639908, 326486893, 326961632, 326603928, 326971703, 327362785, 328289909]
1083C28289909J467018L8338K067719J382026L036309K510643K716598L637200K942619
1091.7C48088379L295174J419677K514839J236535J978416J769295O90994J687088
1099.4C62680397k01225J157379k01645j9341M3488m51851J419029P55310J550026
1108.1C66731567P29218J543579J840553K033119J841965M26102R45969P99980K867050
1116.8C79759102J810226J699906K152023J157036J078796J12190J688653J80816J95503
1125.5C89834251R11255M43421J233406J316910K415885J411095K668419K509155J670037
1134.1D04413834J905288J147042P26089j716995j234131k517281l031387k076492
1141.9C97615967l262024k606697l283882k294770l038673l070183j865196k041512
$$ y = [328289909, 329756927, 329795265, 331862984, 333245010, 336281319, 338791962, 341508560, 345145760, 348088379, 351383553, 352803230, 355318069, 356554604, 358533020, 360302315, 360993309, 362680397, 362479172, 363636551, 363434906, 363415565, 363459053, 363007202, 364426231, 365181541, 366731567, 367460785, 369004364, 370844917, 372878036, 374720001, 375146103, 376092072, 376892052, 379759102, 381569328, 383269234, 385421257, 386578293, 387657089, 387769279, 389457932, 389638748, 389834251, 390745506, 391188927, 392422333, 393739243, 396155128, 397566223, 400234642, 402743797, 404413834, 406319122, 407466164, 408192253, 406475258, 405241127, 402723846, 399692459, 397615967, 394353943, 391747246, 388463364, 386168594, 383129921, 380059738, 378194542, 376153030]
1149.6C76153030j817894k461547q67653j593056j275024r16329q40607k72407j002426
1158.3C65106087N2566j83143J679153J443939J975899K933083J882820K928505K535934
1166.9C80354843L808823L301964L959350M766808M434738N080604M661828O157073
1174.6D16526031N441323O091347O564064O182746O423455M995422N017014N370025
1182.4D62611427O188736M892731L712997L942986M176025M652710L373986L338012
1190.1D96889610L597489L500862K835541J842994J765900R20715O94237N98068L28102
1198.8E12973518M06990M13628M43955K43453R47304J620980J649360J486130J614685
1207.4E21800003J629181J547203J455765Q62884J457482K309913J678734J036873
$$ y = [376153030, 374335136, 371873589, 371005936, 369412880, 368137856, 367221527, 366380920, 366108513, 365106087, 365158653, 364975510, 366654663, 368098602, 370074501, 373007584, 374890404, 377818909, 380354843, 384163666, 387465630, 391424980, 396191788, 400626526, 405707130, 410368958, 416526031, 421967354, 428058701, 434622765, 440805511, 447228966, 452224388, 457241402, 462611427, 468800163, 473692894, 477405891, 481348877, 485524902, 490177612, 493551598, 496889610, 500487099, 503987961, 506823502, 508666496, 510432396, 511353111, 512047348, 512645416, 512973518, 513380508, 513794136, 514238091, 514481544, 515428848, 517049828, 518699188, 520185318, 521800003, 523429184, 524976387, 526432152, 527295036, 528752518, 531062431, 532741165, 533778038]
1215.1E33778038J623497K341309K376670K095070J955834J934700J416321R07974
1222.9E48429413N32951l48205r52340p21740j104050j263313j030236o80885j67618
1231.5E42693977n11779n97268j52359j63726m45519k31285k61917p97730m79469q53653
1241.2E38199272j253013n19677k85415k14043K1095P61032J119156R88961J311264
1249.9E40128632J327018J481400J036148O47545L29475j10702K27928M10423K95563
1258.5E45773430J17340L28064L69301M12559O52619P07092J110420Q26111O35185
1267.2E50932121R34143R00803P78961P13043O67153O04439M96711O81420J018943
1275.9E57727737R0332j61743N16320K39906m32739n10178j89857p84646q72650m26025
$$ y = [533778038, 535401535, 537742844, 540119514, 542214584, 544170418, 546105118, 547521439, 548429413, 548962364, 548614159, 547661819, 546940079, 545836029, 544572716, 543542480, 542861595, 542693977, 542182198, 541584930, 541432571, 541268845, 540823326, 540592041, 540330124, 539532394, 539052925, 538199272, 536946259, 536426582, 536141167, 535927124, 535948219, 536709251, 537828407, 538817368, 540128632, 541455650, 542937050, 543973198, 544620743, 544950218, 544839516, 545067444, 545477867, 545773430, 545890770, 546218834, 546588135, 547000694, 547653313, 548360405, 549470825, 550296936, 550932121, 551866264, 552767067, 553546028, 554259071, 554926224, 555530663, 556027374, 556708794, 557727737, 557818069, 557656326, 558172646, 558412552, 557979813, 557469635, 557279778, 556495132, 555622482, 555196457]
1285.5E55196457l76625n77202m22440P6676j45111O3896K05460j27717q45909j362991
1295.2E51684494r05189q97522j303902j765213j328087j081123j419449p80449m91409
1303.9E41712151o52237q55332j273117j000976m54712n19982q53729j369820j616821
1312.5E33115425j165924r18694q43009q96416n75257r1209m00505m09241K4643L777
1322.2E27843590q69522j685639j653480j937981k414398k659989k816162k455101
1329.9E11351318k244758j931534j543198j614113j156158r34334p77321r46502n13993
1338.6D99689407k79655j079521n22805m11644k03399p4082L66593N93071M15115N42565
1348.2D99035645L15055M76532J53695j01548k50396J2397k66952r94110m53568o45523
$$ y = [555196457, 554819832, 554242630, 553820190, 553896866, 553751755, 553815651, 554021111, 553893394, 553047485, 551684494, 550779305, 549881783, 548577881, 546812668, 545484581, 544403458, 542984009, 542203560, 541712151, 541059914, 540204582, 538931465, 537930489, 537475777, 536955795, 536102066, 534732246, 533115425, 531949501, 531030807, 530187798, 529291382, 528716125, 528624916, 528224411, 527815170, 527839813, 527843590, 526974068, 525288429, 523634949, 521696968, 519282570, 516622581, 513806419, 511351318, 509106560, 507175026, 505631828, 504017715, 502861557, 501927223, 501149902, 500203400, 499689407, 499409752, 498330231, 497807426, 497395782, 497192383, 497118301, 497484894, 498077965, 498493080, 499035645, 499350700, 499827232, 499980927, 499879379, 499628983, 499641380, 499374428, 498380318, 497926750, 497281227]
1357.9D97281227p59811m63524M3220k31208p50962O5155L11432O39038m158L205m37470
1368.5D95696144q01468r8419l18718O28853Q4991o3858M98391R07669J318321N51224
1378.1D98403130P43942O3133O57387R26666L86620L27301K44064J289520J079178
1386.8E04120941J426163J569519J946716J894226J197586J051445Q35762M08249j716690
1395.5E12733917K39754L92876j81771j285247j558266K32239n99862l15628k00271
1404.2E09457741j155663m89654L9062m86412j211967n18608j329804j144295j268196
1412.8E01892204j369934n19867j095085l57284n06401o78254k337570J104736K373085
1421.5D98505630M04740P09228l22380J44654L80249m4213O11000l36341J23443K51274
$$ y = [497281227, 496521416, 496057892, 496101112, 495869904, 495118942, 495184097, 495495529, 496134567, 496130409, 496133614, 495696144, 494894676, 494796257, 494477539, 495106392, 495191383, 495127525, 495625916, 496533585, 497851906, 498403130, 499147072, 499210205, 499867592, 500794258, 501180878, 501508179, 501752243, 503041763, 504120941, 505547104, 507116623, 509063339, 510957565, 512155151, 513206596, 514042358, 514450607, 512733917, 512973671, 513366547, 513184776, 511899529, 510341263, 510573502, 509973640, 509658012, 509457741, 508302078, 507812424, 507851486, 507365074, 506153107, 505634499, 504304695, 503160400, 501892204, 500522270, 500002403, 498907318, 498550034, 498043633, 497365379, 495027809, 496132545, 498505630, 498910370, 499619598, 499297218, 499441872, 499822121, 499777908, 500388908, 500052567, 500176010, 500427284]
1431.2E00427284J275826N72777O25076J756897N40428O04362Q55065K253876Q69560
1439.8E09781151N44586P34482l53470N51414j6288N11474j75819l0861j56097O75468
1449.5E12066040J549110m30717J68304p37304L35960j1749j407051j848412m802322
1458.2E04881859J767311o89507J609803N70907N89905K009964l96080K817764J521149
1466.8E14683075K900009K317619L075295L643188J764374M266243J726151N346946
1474.6E39722900L284760M186249L847427L107796M162674L073234M253578K466050
1482.3E68104668L564224K767296K215233L155555J626740K623024M18243J754837
1490E86229820J081047K860642L291664J918144L416557J691056R13963J560898J241798
$$ y = [500427284, 501703110, 502275887, 502900963, 504657860, 505198288, 505802650, 506657715, 508911591, 509781151, 510325737, 511060219, 510706749, 511258163, 511241875, 511753349, 511577530, 511546669, 511390572, 512066040, 513615150, 513184433, 513352737, 512615433, 512951393, 512939644, 511532593, 509684181, 504881859, 506649170, 505959663, 507569466, 508140373, 508730278, 510740242, 510344162, 513161926, 514683075, 517583084, 519900703, 522975998, 526619186, 528383560, 532649803, 534375954, 539722900, 543007660, 547193909, 551041336, 554149132, 558311806, 561385040, 565638618, 568104668, 571668892, 574436188, 576651421, 579806976, 581433716, 584056740, 584474983, 586229820, 587310867, 590171509, 593463173, 595381317, 598797874, 600488930, 601402893, 602963791, 604205589]
1498.7F04205589K74048J751251J821976L96538K492637J348267K070465o50558o326180
1507.3F07384033N506859J956253K598000J681366K034492o62651M93813Q88290k58942
1516F21621513J395989k042160L132210K216529l74755m12331N22194M029426J724739
1524.7F31813354M50097j33591J455421J23291k76527J175194J2970Q61130k472992
1533.4F33008347p98302L250160J981926J980019R60464K30713m328461L842011O33926
1542.1F40760803j835327J597061k13623m08592M83894P68662P80258K90680q3389
1550.7F42140427J205749J839600P63550j915436p44324K648010J702347m891128J580200
1559.4F44328995o164704J848984J358185O15997j23749j075515L61175O09665Q78525
$$ y = [604205589, 604479637, 606230888, 608052864, 608449402, 610942039, 612290306, 614360771, 613710213, 607384033, 612890892, 614847145, 617445145, 619126511, 621161003, 620498352, 620992165, 621880455, 621621513, 623017502, 620975342, 624107552, 626324081, 625949326, 625536995, 626059189, 630088615, 631813354, 632263451, 632129860, 633585281, 633708572, 633432045, 634607239, 634620209, 635481339, 633008347, 632210045, 635460205, 637442131, 639422150, 640382614, 640613327, 636284866, 640126877, 640760803, 638925476, 640522537, 640308914, 639900322, 640384216, 641152878, 641933136, 642223816, 642140427, 643346176, 645185776, 645949326, 644033890, 643289566, 645937576, 647639923, 642748795, 644328995, 638164291, 640013275, 641371460, 641987457, 641863708, 640788193, 641149368, 641759033, 642637558]
1568.1F42637558Q3160l954963O08368J090736q40797j166497j51024q40721m850807
1576.8F32615013Q64830R45664m34418n33943j29776O6261o99577n77927n70488q87909
1586.4F30657730j034317j851044j262283j166763j349678j422463q56819r20677j585236
1595.1F19208450q05511o01044l39088j116410j237526j394691j583290j305580k221909
1603.8F08603401j760444j821175j451721k145844j543693j296769k124786q45718
1611.5E95613251j818772j357193j871948q12797q32062p865296J01967q33168j558151
1620.2E78765831k146797n60684j090889m330254O0425l79296j66740k909965j940575
1628.9E65301056j05362j010399q65478j481362L01247M36439m411659j191521J308937
$$ y = [642637558, 642720718, 638765755, 639374123, 640464859, 639624062, 638457565, 638306541, 637465820, 632615013, 633479843, 634425507, 633991089, 633457146, 633327370, 633393631, 632694054, 632116127, 631545639, 630657730, 629623413, 627772369, 626510086, 625343323, 623993645, 622571182, 621714363, 620793686, 619208450, 618402939, 617801895, 617462807, 616346397, 615108871, 613714180, 612130890, 610825310, 608603401, 606842957, 605021782, 603570061, 601424217, 599880524, 598583755, 596458969, 595613251, 593794479, 592437286, 590565338, 589752541, 588920479, 581055183, 581157150, 580323982, 578765831, 576619034, 576058350, 574967461, 570637207, 570697632, 570318336, 570151596, 567241631, 565301056, 565195694, 564185295, 563319817, 561838455, 562139702, 562576141, 558164482, 556972961, 558281898]
1637.5E58281898k42767O84204Q70552o12869J005020j50413Q07228J185112k263565
1646.2E59564400m40560O7063K332496J573830K176170J949540j309357k854843L373337
1654.9E66432076L737373J590233J405563R30901J139030R39789J077537J197129j82724
1663.6E78266907K374153K302475J836700J576577K493095J850815O14433K722435
1671.3E94037590J186447K291336K822609J473007L2311K745933L009415K008782K301025
1680F11908455J529426L522225M232902L68538j450538N098953M869385L462524K148666
1688.6F35690536K475548J986885J722107J998139J682129K716369K839966p13730
1696.4F50397949L294525L262940L775711O99234k398224M710541L413925J831207
$$ y = [558281898, 558039131, 558723335, 559593887, 558981018, 559986038, 559835625, 560642853, 561827965, 559564400, 559123840, 559190903, 561523399, 563097229, 565273399, 567222939, 565913582, 563058739, 566432076, 570169449, 571759682, 573165245, 574096146, 575235176, 576174965, 577252502, 578449631, 578266907, 580641060, 582943535, 584780235, 586356812, 588849907, 590700722, 591315155, 594037590, 595224037, 597515373, 600337982, 601810989, 601843300, 604589233, 607598648, 609607430, 611908455, 613437881, 616960106, 621193008, 621561546, 620111008, 625209961, 630079346, 633541870, 635690536, 638166084, 640152969, 641875076, 643873215, 645555344, 648271713, 651111679, 650397949, 653692474, 656955414, 660731125, 661430359, 659032135, 663742676, 667156601, 668987808]
1704.1F68987808L5935J389236K38648P47528J805343Q74329Q53348J612320J853637
1712.8F78398132J507721K17133j2894K535095Q04062l641357K720718J892700O06232
1721.4F85027542K29874J25274j86920Q54111J240921R19571J347961J387024J63346
1730.1F91108704o68030J945038K264175k400207l149338K467270K291565N26275J365433
1738.8F95750885M82025r29489K104950J338425o0959K38189J750718R10034J107330
1747.5G02692108J863709k77558K429734M96902q15506K282791J596222J619949J825486
1756.2G13713837j63040N47332J907273R25064J400222n99517m50058J907425P80029
1764.8G19968567Q79440J211472J293564r91211J051483K451019k97546j221p96051
$$ y = [668987808, 669023743, 670412979, 670651627, 671399155, 673204498, 674078827, 674932175, 676544495, 678398132, 679905853, 680122986, 680110092, 682645187, 683449249, 679807892, 682528610, 684421310, 685027542, 685257416, 685382690, 685195770, 686049881, 687290802, 688210373, 689558334, 690945358, 691108704, 690440674, 692385712, 694649887, 692249680, 689100342, 691567612, 693859177, 694385452, 695750885, 696232910, 695303421, 697408371, 698746796, 698685837, 698924026, 700674744, 701584778, 702692108, 704555817, 704278259, 706707993, 707204895, 706389389, 708672180, 710268402, 711888351, 713713837, 713550797, 714098129, 716005402, 716930466, 718330688, 717731171, 717281113, 719188538, 719968567, 720848007, 722059479, 723353043, 722361832, 723413315, 725864334, 725566788, 725565567, 724769516]
1773.5G24769516J894608J075363p13654Q51898k99987Q67385N76935m34723J206818
1782.2G29794159J206512O81076K0676N65109P67365M76303r3002L59649k05764J907
1791.8G33573990n44205j017227J803360M47006j8539R62829J136475Q15506k66190
1800.5G36893005J439133k77252j11542R94568K9221l3570j79138n7983K6703O63375
1810.2G39386520k67715M10385Q47778R1935R88845O09436P19452k46963k13852M25491
1819.8G42751312j54190K14005r02787L47672R25064j556549K91367J334075Q90961
1828.5G44140930L74603j203308Q50678J821823j02463k19879l64838r8953K92053
1837.2G45490646q38394M63562K00196J28021P8506Q17414J087265l013459J164246
$$ y = [724769516, 726664124, 727739487, 727025833, 727877731, 727577744, 728445129, 729022064, 728587341, 729794159, 731000671, 731681747, 731702423, 732267532, 733034897, 733511200, 733418198, 733777847, 733572083, 733573990, 733029785, 732012558, 733815918, 734262924, 734244385, 735207214, 736343689, 737159195, 736893005, 738332138, 738054886, 737943344, 738937912, 738967133, 738933563, 738754425, 738696442, 738723145, 739386520, 739118805, 739529190, 740376968, 740468903, 741457748, 742067184, 742786636, 742539673, 742325821, 742751312, 742597122, 742811127, 741908340, 742256012, 743181076, 741624527, 741915894, 743249969, 744140930, 744515533, 743312225, 744162903, 745984726, 745882263, 745662384, 745297546, 745198593, 745490646, 744652252, 745115814, 745316010, 745444031, 745522537, 746339951, 747427216, 744413757, 745578003]
1845.8G45578003J485138K7923l50189K28958M15116n31082P9269k03400K39029L0365
1855.5G46999130k37274M75235K27661O76575K83661K21100l61405j27563K5635o51093
1865.1G47531662R1400n4016K70233p71103n01022R36279Q62122P38830J61209J19248
1874.8G49384842l35541J4038m20456j25808O67038M6463K15454m13285M56314N01328
1884.4G49990387O3858O00662J18256Q61435K15225j175308j57700N42069P9574J0834
1894.1G51149292k30331q33207M82178J75171L45459M95529J69831O06689Q9874K39182
1903.7G52689667m4556q7356k05460o54144o43235k00958N0507j78528N33829j33057
1913.3G51126709M58450O50711K79618J393280q35190r97925J32294O0653Q8120q06732
$$ y = [745578003, 747063141, 747091064, 746740875, 746969833, 747384949, 746853867, 746933136, 746729736, 746968765, 746999130, 746761856, 747237091, 747464752, 748141327, 748424988, 748646088, 748284683, 748157120, 748182755, 747531662, 747623062, 747569046, 747839279, 747068176, 746567154, 747503433, 748365555, 749104385, 749265594, 749384842, 749049301, 749063339, 748642883, 748517075, 749184113, 749230576, 749446030, 749032745, 749489059, 749990387, 750054245, 750654907, 750773163, 751634598, 751849823, 750674515, 750516815, 751058884, 751138458, 751149292, 750918961, 750085754, 750567932, 750743103, 751088562, 751584091, 751753922, 752360611, 752450485, 752689667, 752645111, 752557755, 752352295, 751698151, 751054916, 750853958, 750904465, 750725937, 751259766, 751126709, 751585159, 752235870, 752515488, 753908768, 753073578, 752075653, 752207947, 752268600, 752356720, 751549988]
1923G51549988m0360K81906n035k99072J70593K34451L60337P75222M09317M38233
1932.6G53875580k87247j51520k24380n52826m66614m32815m0055l23791N81207o7367
1942.3G51910172r11103J013260J185989L04261k81143K96402R1857k67868l21121
1951G53020706n3329j20087o20422l3188k70691R6435M69742K01264L29590L38821
1960.6G53358841N65948L39127N69839J27564k86713j45263n53666m12597j06201j23520
1970.2G53333359m82331J30311M47921M39301M13818K0447M18549R2391j89132l05329
1979.9G54319305j40609j82495k45362K02255j14822J44501j30844L4027J53274j02310
1989.5G53936920R00803L89251o51245k30255L78571p9575l93448l53927k84729P2784
$$ y = [751549988, 751509628, 751791534, 751786499, 751487427, 751658020, 751892471, 752252808, 753028030, 753437347, 753875580, 753588333, 753436813, 753212433, 752659607, 752192993, 751760178, 751720123, 751396332, 751977539, 751910172, 750999069, 752012329, 753198318, 753502579, 753221436, 753517838, 753609695, 753341827, 753020706, 752967377, 752847290, 752226868, 752193680, 751922989, 752019424, 752489166, 752690430, 753020020, 753358841, 753924789, 754263916, 754833755, 754961319, 754674606, 754529343, 753975677, 753563080, 753456879, 753333359, 752851028, 752981339, 753429260, 753868561, 754282379, 754302826, 754721375, 754813766, 754624634, 754319305, 754178696, 753996201, 753750839, 753953094, 753838272, 753982773, 753851929, 753885956, 754039230, 753936920, 754837723, 755226974, 754575729, 754345474, 754724045, 754644470, 754251022, 753897095, 753612366, 753685150]
1999.2G53685150l80859J85470K42691Q2169L67966M5166N2643j16120J05820n17731
2008.8G53752365m74548j77689m05121O4850k86407J41067L13187k29874m55093K56195
2018.5G52498932P52792j11923k43988n70908o82067m87595l31116m77752k97013L29437
2028.1G50378799q5372Q7814J373L49808R6969n06591J83410k42538k47879l60871
2037.7G49654922l52325m84772n07049n6381k12174O11725M3259k03400J68610q927
2047.4G48653488L01361j1444P7896j70364k30179m43726l90548k35901n39856J1749
2057G47022476Q164M37011L33939J28555K75116K91443N06439l65982k33536j39999
2066.7G48263626k36053k72446k82669K0904k68783K29568J77231L35388J59836J0681
$$ y = [753685150, 753304291, 753489761, 753732452, 753814621, 754182587, 754227753, 754280396, 754164276, 754270096, 753752365, 753277817, 753100128, 752695007, 752759857, 752473450, 752614517, 752927704, 752697830, 752242737, 752498932, 753251724, 753139801, 752895813, 752324905, 751642838, 751155243, 750824127, 750346375, 750049362, 750378799, 750293427, 750381241, 750382614, 750732422, 750829391, 750322800, 750506210, 750263672, 750015793, 749654922, 749302597, 748817825, 748310776, 748254395, 748042221, 748653946, 748697205, 748493805, 748662415, 748653488, 748954849, 748943405, 749021301, 748850937, 748620758, 748177032, 747786484, 747550583, 747010727, 747022476, 747030640, 747467651, 747801590, 747930145, 748205261, 748496704, 749003143, 748637161, 748403625, 748263626, 748027573, 747755127, 747472458, 747493362, 747224579, 747454147, 747631378, 747966766, 748126602, 748137283]
2076.3G48137283M64173k63901R8953K67487j58386k96631K9220J450n58396q7814
2086G47633438j50604J04980O18668M58298j08490j2665M29764J32980J59531k86713
2095.6G48979187j87225k97470l58811p7972l03116M97055N69305M82026l3265k67334
2105.2G49002380K17362l7995J90812J48086M15421K6550l45306j71814l27912L5095
2114.9G49152679k04544l8375K21099K57035m7760p172K85111m4327M14200j81962
2124.5G49805984n03845p5073R8572J85242l52097j62277J51596N53207K47650k49481
2134.2G49699478p4234J52130J32523k33612k1134l78265o8436J25122k61154O1417
2143.8G49133835K37808L64304m48380j14822L15552R918O0806J4801N67703R0332
$$ y = [748137283, 748601456, 748337555, 748436508, 748703995, 748545609, 748248978, 748278198, 748279648, 747721252, 747633438, 747482834, 747587814, 748206482, 748664780, 748556290, 748543625, 748973389, 749106369, 749265900, 748979187, 748791962, 748494492, 748135681, 748057709, 747754593, 748251648, 748820953, 749302979, 749269714, 749002380, 749219742, 749181747, 749372559, 749520645, 749936066, 749962616, 749617310, 749445496, 749117584, 749152679, 748948135, 748909760, 749130859, 749387894, 749340134, 749332962, 749618073, 749573746, 749987946, 749805984, 749302139, 749227066, 749325638, 749510880, 749158783, 748996506, 749148102, 749701309, 749948959, 749699478, 749625244, 749777374, 749909897, 749676285, 749655151, 749276886, 749208450, 749333572, 749072418, 749133835, 749371643, 749735947, 749287567, 749172745, 749488297, 749498215, 749559021, 749573822, 750141525, 750231857]
2153.5G50231857j41220k90451j20544K53372k99225j12686q8654M92783O12717K72445
2163.1G50810394J27793M5929L33557j67008N2796j07727p4234J9760j62277N29174
2172.8G51408157J67847K5940J24435M08936L54080M8828M89121K89383N7907j99661
2182.4G53174973k34910r7274L28064L43628J57013L37142l128M08860J75705j05820
2192G54484253J73416K84119L82690Q2169N1346l60566J80588K38266l46680j49307
2201.7G55020294R9564O77643K74429L63922O2943j45951N69535K71301J1368l43323
2211.3G56861725K46811K92053m36401k59171K55890N05905K43302M60205r5292M6235
2221G58121262M17480j29166j01013K6627L63922k34222j35499M23890K18200M5853
$$ y = [750231857, 750090637, 749800186, 749679642, 749933014, 749633789, 749521103, 749432449, 749925232, 750537949, 750810394, 750938187, 750984116, 751317673, 751150665, 751203461, 751095734, 751021500, 751041260, 750878983, 751408157, 751576004, 751601944, 751726379, 752135315, 752489395, 752538223, 753027344, 753316727, 753374634, 753174973, 752940063, 752842789, 753170853, 753514481, 753671494, 754008636, 754005508, 754414368, 754590073, 754484253, 754657669, 754941788, 755324478, 755406647, 755457993, 755097427, 755278015, 755516281, 755169601, 755020294, 755119858, 755797501, 756071930, 756435852, 756498795, 756352844, 756922379, 757193680, 757205048, 756861725, 757108536, 757400589, 756964188, 756705017, 756960907, 757466812, 757710114, 758170319, 758075027, 758121262, 758538742, 758409576, 758308563, 758335190, 758699112, 758464890, 758329391, 758753281, 758971481, 759017334]
2230.6G59017334k06146k2202n6457L23028K45133Q5525K6398l14255R6283J37711
2240.3G59332352K35519R2621R1476k04239l84063J22528O180M1504j68610L71551
2249.9G59536819M08478j06048N8975j20316j01318k64053J09253J52435R918j72119
2259.5G59512024P248M58984k38952J95922K63596j85776k85797O2332M5166m64706
2269.2G59370041O32858K94876J9226K26441Q0642J43586j43357K06757m88358J01166
2278.8G60443878N10559l95965k83509K14768M12292l90930p9880k16903n5847J84326
2288.5G60342789q2093M08173k83890J01242k67868n88836l95508n01023j7700l50113
2298.1G58365173J74027q25577l34778M46167Q4229M50973j196594o26450l09753j46866
$$ y = [759017334, 758811188, 758788986, 758732529, 759055557, 759300690, 759386215, 759412613, 759098358, 759194641, 759332352, 759567871, 759660492, 759751968, 759547729, 759163666, 759286194, 759292374, 759333878, 759165268, 759536819, 759945297, 759839249, 759898224, 759777908, 759676590, 759412537, 759521790, 759674225, 759684143, 759512024, 759519272, 759978256, 759739304, 759935226, 760198822, 760013046, 759727249, 759789581, 759834747, 759370041, 760002899, 760297775, 760317001, 760543442, 760624084, 760767670, 760624313, 760831070, 760342712, 760443878, 760954437, 760558472, 760274963, 760489731, 760902023, 760511093, 760431213, 760214310, 760158463, 760342789, 760260696, 760668869, 760384979, 760486221, 760218353, 759629517, 759234009, 758732986, 758715286, 758365173, 758539200, 757713623, 757378845, 757825012, 757909241, 758360214, 757163620, 756537170, 756227417, 756080551]
2307.8G56080551k67105j124725m77219j228256j79444m62112n06592k35977j009674
2316.4G50589447K3346o19049k89154l84140o39343m27399k12174p52563j289978J84555
2326.1G46183548j008148L29284l16314j918640J16958M1886m77753j362915J130981
2334.8G42718887P58744k87323Q1482j482316r41543j655502m74091J87454R98841
2343.4G39904633O26678m75540J808243K507019K965011P58438j678085k194443j987457
2352.1G42234497j687012k219696j812057k393646j582947q56934r58023O88477N93948
2360.8G32006607O0349n39780N83115K22778O86035J659012R91440R70611J471329
2369.5G38111496K343521O32629J33667R18274J587067J447144J090622K020340J274185
$$ y = [756080551, 755813446, 754688721, 754211502, 752983246, 752803802, 752341690, 751835098, 751599121, 750589447, 750612793, 749993744, 749704590, 749320450, 748681107, 748253708, 748041534, 747288971, 745998993, 746183548, 745175400, 745504684, 745188370, 743269730, 743386688, 743428574, 742950821, 741587906, 742718887, 743477631, 743190308, 743271790, 741789474, 740847931, 739192429, 738718338, 738905792, 739904633, 740531311, 740055771, 741864014, 744371033, 747336044, 748094482, 746416397, 744221954, 742234497, 740547485, 738327789, 736515732, 734122086, 732539139, 731682205, 730724182, 731412659, 732006607, 732066956, 731527176, 732110291, 732333069, 733019104, 734678116, 735669556, 736640167, 738111496, 740455017, 741087646, 741221313, 742139587, 743726654, 745173798, 746264420, 748284760, 749558945]
2378.2G49558945Q55636J083756J039886N94406L81775L93982l24936K99683N97153
2386.8G54480286K02942J32598L0365R0332k3117M45557K98843k43148l06321k85492
2396.5G54822845m78591n17960k04163l33786k41546k58255J7852J61438L81546N98450
2406.1G53947830k47421o6223k8534l87802m78363m61045k63519m33350m76531p97806
2415.8G50307236l95890q0642K76413M97970j99661P0725p9346o4240l2196o23779
2425.4G49676590p62253p89947k14386J77002j78147o81228k44751K19421N0812m9591
2435.1G47203522J56326L72238m85153p41119m10004l8376m64172j186219l41186k95258
2444.7G43770599l22189l281N8594q4686n51758n5771L71781N3634m66461k74887m26636
$$ y = [749558945, 750414581, 751498337, 752538223, 753132629, 753514404, 753908386, 753583450, 753883133, 754480286, 754683228, 754815826, 754846191, 754936523, 754913406, 755358963, 755657806, 755414658, 755108337, 754822845, 754344254, 753826294, 753622131, 753288345, 753046799, 752788544, 752806396, 752967834, 753349380, 753947830, 753700409, 753634186, 753605652, 753217850, 752739487, 752278442, 752014923, 751581573, 751105042, 750307236, 749911346, 749830704, 750107117, 750605087, 750405426, 750476151, 750396805, 750332565, 750300369, 749676590, 748914337, 748124390, 747910004, 748087006, 747908859, 747227631, 746982880, 747202301, 747253113, 747203522, 747359848, 747732086, 747246933, 746505814, 746095810, 746057434, 745593262, 744407043, 744065857, 743770599, 743448410, 743445129, 743503723, 743419037, 742867279, 742811508, 743183289, 743236923, 742770462, 742495575, 742068939]
2455.3G42068939n67779l51181n62516j56097l62549l15475k82669o6681M05349k31399
2465G39577942L6468J62507N34l36838n37644o34994r92813k24686k53601l56903j32217
2475.6G36307755Q9263K31705k86713j50070n493J56784Q621l31192n00869j61820
2485.2G35357971k7847p65305n04989k92816j39695j62964J21537N78766j11390k62832
2494.8G33790436l99475k24991k90222k83890n1804o41021m18625j25275K31247J00021
2504.5G31686401j82876J4496k4262J36795J5335m7531l04336k00653l70331o95954
2514.1G30027084o44378o14395J5945j90735L19443M46167j01624K34604j93634o0577
2523.8G29237900j28708k81525o77032r28421m4327k06757n41763n68466k89993k18659
$$ y = [742068939, 741501160, 741149979, 740587463, 740431366, 740068817, 739753342, 739470673, 739403992, 739809341, 739577942, 739614410, 739776917, 739777451, 739440613, 738902969, 738267975, 737275162, 737050476, 736796875, 736439972, 736307755, 736397018, 736628723, 736342010, 736191940, 736186447, 736343231, 736351852, 736020660, 735519791, 735357971, 735330124, 734564819, 734059830, 733767014, 733627319, 733464355, 733585892, 734164658, 734053268, 733790436, 733390961, 733165970, 732875748, 732591858, 732540054, 731899033, 731480408, 731355133, 731586380, 731686401, 731503525, 731518021, 731493759, 731630554, 731645889, 731598358, 731294022, 731093369, 730723038, 730027084, 729382706, 728768311, 728784256, 728593521, 728912964, 729359131, 729257507, 729492111, 729298477, 729237900, 729109192, 728827667, 728150635, 727222214, 727177887, 726971130, 726429367, 725860901, 725570908, 725352249]
2533.4G25352249n9814L14789J09024L17993J12686k50855m46090l28980l54767p07702
2543.1G24058533o17905q85773n77926J4496Q5907l30506l50265L56140M17023J15814
2552.7G22285538m39987m61655l78952o28510m45175l31726l01514n66253p13501m19235
2562.4G17599030k0295K39563K40555l9215N1575M4174n91736m87823n95169n64576
2572G15876083k68859l79792l66745l51791K42386j08719n10254l80936m53949J92414
2581.6G13489838Q4228l85055k74048N264k08816k57645k26517n94253m95606m74548
2591.3G10662842M1046L8910k6169J17722l00751j72959k79159R0713j57089p04498
2600.9G09310608n41687l16849l3951l47519K36206l5553m97665J27182j18790n32989
$$ y = [725352249, 725292435, 725607224, 725716248, 726034241, 726146927, 725896072, 725449982, 725121002, 724766235, 724058533, 723440628, 722554855, 721976929, 721991425, 722077332, 721746826, 721396561, 721752701, 722169724, 722285538, 721845551, 721383896, 721004944, 720376434, 719931259, 719599533, 719298019, 718731766, 718018265, 717599030, 717578735, 717818298, 718058853, 718019638, 718071213, 718115387, 717523651, 717035828, 716440659, 715876083, 715607224, 715227432, 714860687, 714508896, 714751282, 714642563, 714132309, 713751373, 713297424, 713489838, 713574066, 713189011, 712914963, 712920227, 712711411, 712453766, 712227249, 711632996, 711137390, 710662842, 710703888, 710742798, 710716629, 710834351, 710533600, 710360641, 710081482, 710172195, 710015106, 709310608, 708768921, 708452072, 708418121, 708070602, 708306808, 708271255, 707773590, 707900772, 707781982, 707248993]
2610.6G07248993n59158r0561m16413l44314k39182n80368l36685m71649k05689o36749
2620.2G03368225m32205M2419q1634J86691l77884l50799p71866q76923m39148q78448
2629.9F99388428q25653o44837m43878o20956k71225j0071j6174J47323m51050l96576
2639.5F95855331n71975o77109k70462m44183p47605o97403n90515p77206n13306m93469
2649.1F90072098k51618L1662j41220l01361o88248k97927m35563q25729m52881n31540
2658.8F86177673q22525o04171m09928p13501m18777o8665J68686L9597j59226P2327
2668.4F83261490o28510q53500n29251j91956k05002o47048m58680n95626p50428l86200
2678.1F78015289M4403k51922m68750l09677l34320N645j7547N6152m67300j201783
$$ y = [707248993, 706689835, 706599274, 706182861, 705838547, 705599365, 705018997, 704682312, 704210663, 704004974, 703368225, 702936020, 702978439, 702896805, 703083496, 702705612, 702354813, 701582947, 700706024, 700266876, 699388428, 698562775, 697917938, 697474060, 696853104, 696581879, 696571808, 696555634, 696702957, 696251907, 695855331, 695283356, 694606247, 694335785, 693891602, 693143997, 692446594, 691856079, 691078873, 690565567, 690072098, 689820480, 689852142, 689710922, 689409561, 688721313, 688423386, 687987823, 687162094, 686709213, 686177673, 685355148, 684750977, 684341049, 683627548, 683208771, 683140106, 683308792, 683348389, 683189163, 683261490, 682632980, 681779480, 681250229, 681058273, 680853271, 680206223, 679747543, 679151917, 678401489, 678015289, 678059692, 677807770, 677339020, 677029343, 676695023, 676700668, 676683121, 676739273, 676271973, 675070190]
2687.7F75070190j162948o64444j28021p70035m21219J40839q5984m8752l29589j54877
2697.4F71445160j08566l16620q22068p10678j79824o22559p09763o49108k60087q9416
2707F66976471p34253q33359j81961J91422k42310m77295o33926m81262j06202l26690
2716.6F63150635p18384o22025l12576o13098k63824J33743k19193j34964l00216o53611
2726.3F59446487n14679l11965n45121p19070n39322l11432l08380m24805j5411J6327
2735.9F55772629o12641n66711N7526N0888m22745o47049m32510M5852K6856m18930
2745.6F52853165q47626m71268l8681k97470k05917j59989j53122j95999r9563m3030
2755.2F50340500k84653j56174k59933j61133l26690p68738o15998m09469m6845M5166
$$ y = [675070190, 673907242, 673242798, 673114777, 672344742, 671923523, 672064362, 671978378, 671929626, 671600037, 671445160, 671336594, 671019974, 670197906, 669487228, 669307404, 668684845, 667975082, 667325974, 667065887, 666976471, 666242218, 665408859, 665226898, 665418320, 665176010, 664698715, 664064789, 663583527, 663477325, 663150635, 662432251, 661810226, 661497650, 660884552, 660620728, 660754471, 660535278, 660400314, 660100098, 659446487, 658931808, 658619843, 658074722, 657355652, 656816330, 656504898, 656196518, 655771713, 655756302, 655772629, 655159988, 654593277, 654650803, 654701691, 654278946, 653631897, 653199387, 653245239, 653272095, 652853165, 652005539, 651534271, 651495590, 651198120, 650992203, 650832214, 650679092, 650483093, 650383530, 650340500, 650055847, 649899673, 649639740, 649478607, 649151917, 648383179, 647767181, 647357712, 647310867, 647356033]
2764.9F47356033P0038j13296n21393k58103l8833j74866k18735k90985l22494l78189
2774.5F45109177o99005p46689o24314l09906p6904j8234J33362m65622n63660k48566
2784.2F41489639l63388m90112m98352k79846o05889n37681n52140o11915l68538o70509
2793.8F36511269o09627p64771m57496j94550m27208n48591r56536o07490o53000o98242
2803.4F30593758n11284q25882r46198r43565m79813m87137o61506o04706n47104m20074
2813.1F24166489o83709r70611j253510j100273p23877n34248r37233j271591q44956
2821.8F15846481q84437j075821j208878j009559n93071n87845r58367j406097j175804
2830.4F06946602q29735n43175o43730j192627j453132j269837j117782j258011r99298
$$ y = [647356033, 647426071, 647312775, 646791382, 646533279, 646494446, 646319580, 646100845, 645809860, 645487366, 645109177, 644410172, 643663483, 643039169, 642729263, 642652359, 642634125, 642767487, 642301865, 641738205, 641489639, 641126251, 640636139, 640137787, 639857941, 639252052, 638714371, 638162231, 637550316, 637181778, 636511269, 635901642, 635136871, 634679375, 634484825, 634057617, 633509026, 632552490, 631945000, 631292000, 630593758, 630082474, 629256592, 628310394, 627366829, 626887016, 626399879, 625738373, 625133667, 624586563, 624166489, 623482780, 622512169, 621258659, 620158386, 619434509, 618900261, 617963028, 616691437, 615846481, 614962044, 613886223, 612677345, 611667786, 611074715, 610486870, 609528503, 608122406, 606946602, 606116867, 605573692, 604929962, 603737335, 602284203, 601014366, 599896584, 598638573, 597639275]
2839.1E97639275j189003j629563j548157j294059j461640j963615j717453j324768
2846.8E85511017j303101j815605j886902j788749j735840j029778j353683j467858
2854.6E73129501j336403j225242p50923n84717k64320q88978j199684j216011j517029
2863.2E64146194j420059j279106j112862j480903j451874j818657j891746j485520
2870.9E52205467j709862j511878k262078k564316k208480k058068j748695k164536
2878.7E35977554k033271j592370j322937j323280j083832q31413j514168j327896
2886.4E24948387m82254k06528o50825o85005m20304n62706k62985j74026p2289j73607
2896E21257858m66461m45976m97132l55873j68647k03324p00454n76058j02730l82461
$$ y = [597639275, 596450272, 594820709, 593272552, 591978493, 590516853, 588553238, 586835785, 585511017, 584207916, 582392311, 580505409, 578716660, 576980820, 575951042, 574597359, 573129501, 571793098, 570567856, 569816933, 569232216, 568967896, 568078918, 566879234, 565663223, 564146194, 562726135, 561447029, 560334167, 558853264, 557401390, 555582733, 553690987, 552205467, 550495605, 548983727, 546721649, 544157333, 541948853, 539890785, 538142090, 535977554, 533944283, 532351913, 531028976, 529705696, 528621864, 527790451, 526276283, 524948387, 524466133, 524259605, 523608780, 522923775, 522503471, 521940765, 521677780, 521503754, 521431465, 521257858, 520791397, 520345421, 519848289, 519492416, 519323769, 519120445, 518419991, 517843933, 517741203, 517358742]
2905.7E17358742j039200j150551m78401p12013j108666j057129j015053r73358j109657
2914.3E08714714j071968j677094j763381j573029k197571j785164j334724j816139
2922.1D95495644j573220p19986n09224p34901p53326R384J92413o30875l90548r0409
2931.7D90294952K9717N10521P91740J160012J618309J845283J664009J838684J934929
2940.4E01688156K028999K168999K225952K749062K409477J886406J742706J685257
2948.1E18585014K130928K405968K494164K516822J989747J502723K155647K374688
2955.8E36155701J959457K055855J995392J796951J908302K355500K288665J674958
2963.5E52190781R97123J405983K318688K095413J647949J406555J765290J762046
$$ y = [517358742, 516319542, 515168991, 514690590, 513978577, 512869911, 511812782, 510797729, 509824371, 508714714, 507642746, 505965652, 504202271, 502629242, 500431671, 498646507, 497311783, 495495644, 493922424, 493202438, 492693214, 491958313, 491204987, 491214371, 491406784, 490775909, 490385361, 490294952, 490324669, 490835190, 491626930, 492786942, 494405251, 496250534, 497914543, 499753227, 501688156, 503717155, 505886154, 508112106, 510861168, 513270645, 515157051, 516899757, 518585014, 520715942, 523121910, 525616074, 528132896, 530122643, 531625366, 533781013, 536155701, 538115158, 540171013, 542166405, 543963356, 545871658, 548227158, 550515823, 552190781, 553187904, 554593887, 556912575, 559007988, 560655937, 562062492, 563827782, 565589828]
2971.2E65589828J670952J772728J171570J048584J231842J498680J233712J362762
2979E76580658J617889J180725J311989Q27942O96297Q22639J146393J385689M60739
2987.6E86030960P18460Q58345N56565P11860N29633M61578M24843M60815L85285M26979
2997.3E91565323L89938J07117J15662J46904k45591k95410L2349j32027j19743k99378
3006.9E91265144k37999J85585l9177l44543n77660p89070o15310K13661O6833n71747
3016.6E88555717p69691j218491q66279q55942p92007k79389k52571m83246j320801
3025.2E81717300j303443o23131n74379q24204p60154o00701q44765r56077r65271
3033.9E74265175r88808r47609p67936r94797r44138q49151j319733j058655r22165
$$ y = [565589828, 567260780, 569033508, 570205078, 571253662, 572485504, 573984184, 575217896, 576580658, 578198547, 579379272, 580691261, 581519203, 582215500, 583038139, 584184532, 585570221, 586030960, 586749420, 587607765, 588164330, 588876190, 589405823, 589867401, 590292244, 590753059, 591138344, 591565323, 591955261, 592062378, 592178040, 592324944, 592079353, 591783943, 591816292, 591684265, 591564522, 591265144, 591027145, 591212730, 591173553, 590829010, 590251350, 589462280, 588846970, 589060631, 589127464, 588555717, 587786026, 586567535, 585701256, 584845314, 584053307, 583773918, 583521347, 583038101, 581717300, 580413857, 579790726, 579216347, 578392143, 577631989, 577031288, 576186523, 575230446, 574265175, 573276367, 572328758, 571560822, 570566025, 569621887, 568772736, 567453003, 566394348, 565472183]
3042.6E65472183p60307p89337r14879q91495j466827j273957j234359j123047r89418
3051.3E56028557j157608o64940r53674j105576q61435j001358j076393j080208q38318
3060E47289047q51135j114578j076279j059761j281586q52890q82454j407623j133881
3068.6E37628860q91571p81402j057968r88083q04482j239090j233749j058540j033326
3077.3E28540649j068916r67903j076660j156388r60845q54302j002541j130447n76210
3086E19746437r77478j497574r97314r99031j421318j417389p63054p63893p11212
3094.7E10198174q90007j790314j423111n23491n17655j345939j078377q51440j026917
3103.4E00750923n44777r78470j280822j416092j152878q69255j252480r93271p59658
$$ y = [565472183, 564711876, 563922539, 563007660, 562116165, 560649338, 559375381, 558141022, 557017975, 556028557, 554870949, 554206009, 553252335, 552146759, 551285324, 550283966, 549207573, 548127365, 547289047, 546437912, 545323334, 544247055, 543187294, 541905708, 541052818, 540170364, 538762741, 537628860, 536737289, 535955887, 534897919, 533909836, 533105354, 531866264, 530632515, 529573975, 528540649, 527471733, 526503830, 525427170, 524270782, 523309937, 522455635, 521453094, 520322647, 519746437, 518768959, 517271385, 516274071, 515275040, 513853722, 512436333, 511673279, 510909386, 510198174, 509308167, 507517853, 506094742, 505571251, 505053596, 503707657, 502629280, 501777840, 500750923, 500206146, 499227676, 497946854, 496530762, 495377884, 494508629, 493256149, 492262878, 491503220]
3112D91503220n45769p23648j082497j356697j384621o38198n27916j048012j186180
3120.7D83009682q73795j170654j366158r61456r19304q72841r92546o70433o58378
3129.4D74524117j381913j168441n56908j072502j342278q56170j145478o94999o71349
3138.1D65634079j048584o86150j466941j277695p48978q83789n49164o99272j078262
3146.8D57195244j151314p45659p71255o60591m84620j013412j061440j029510q40149
3155.4D49437294o22482r24530j189156j063385p21664q52585j151009q73680r01260
3164.1D41137543j207657o25916m33807m64973l65792p87124r52378j171188j081886
3172.8D34046822j041222p79991l56140p22504o70624p17506n82543o19354j182823
$$ y = [491503220, 490957451, 490233803, 489151306, 487794609, 486409988, 485771790, 485243874, 484195862, 483009682, 482135887, 480965233, 479599075, 478637619, 477718315, 476845474, 475852928, 475182495, 474524117, 473142204, 471973763, 471416855, 470344353, 469002075, 468145905, 467000427, 466305428, 465634079, 464585495, 463899345, 462432404, 461154709, 460405731, 459521942, 458972778, 458273506, 457195244, 456043930, 455298271, 454527016, 453866425, 453381805, 452368393, 451306953, 450277443, 449437294, 448814812, 447890282, 446701126, 445637741, 444916077, 444063492, 442912483, 442038803, 441137543, 439929886, 439303970, 438870163, 438405190, 438039398, 437252274, 436299896, 435128708, 434046822, 433005600, 432225609, 431869469, 431146965, 430476341, 429758835, 429176292, 428556938, 427374115]
3181.5D27374115p91206m75006m29421n72815j144943r33609m65431p70913q60977
3190.1D20929794n59044m65393r13581j145936n88531o96945l46718l92037j015586
3198.8D14806023m70124p02324n09376j85280l76854n32532r85221q20504j105842
3207.5D09117966r82056m77638l74603n36538n61103o4354o01578q00095n83610m12293
3217.2D03724098l37868p86476p61604p56950k31896m04587j005592o70052m02183
3225.8C98366890o4507j08184m21486p59278p05375n95970k35787J64757p91779j095085
3235.5C93754196n08957k69928m26025m20113k25906j05248l07731r13124m97170n85823
3245.1C89494171r23347m08058n3635j12953j021653q22219k19231l34930m78745l74222
$$ y = [427374115, 426582909, 426107903, 425678482, 425105667, 423960724, 423027115, 422561684, 421790771, 420929794, 420370750, 419905357, 418991776, 417845840, 417257309, 416560364, 416213646, 415821609, 414806023, 414335899, 413633575, 413124199, 412938919, 412562065, 412029533, 411044312, 410223808, 409117966, 408135910, 407658272, 407283669, 406747131, 406186028, 406121674, 405520096, 404720001, 404136391, 403724098, 403386230, 402599754, 401838150, 401081200, 400849304, 400444717, 399439125, 398769073, 398366890, 398302383, 398194199, 397772713, 397013435, 396308060, 395712090, 395476303, 395641060, 394849281, 393754196, 393245239, 392975311, 392549286, 392129173, 391903267, 391798019, 391490288, 390577164, 390079994, 389494171, 388570824, 388162766, 388109131, 387996178, 386974525, 386152306, 385933075, 385598145, 385119400, 384745178]
3254.8C84745178o1683l45536k08320j16577k95296r61914j303940m83017l6583K88887
3264.4C81221199k43149m50172j17607k37732o8932j76315l16010o40335k84042j53046
3274C78533859o84051o59256r31397p24525k28234M9897m47846m99077J75629k67105
3283.7C74317894k66991O0845k87628n73616k33841J13067K4033m59480p91588j94283
3293.3C71708412j85814k54478l79219p78389n92041L7384M00963p33414n67093J48163
3303C68804474l10516l33329n14068j22414l49121p68662k23159q6480n416m89197
3312.6C65602112p04193j73340k31934m68139l96538n60303l63312k43225n87539n9700
3322.3C61813889k31286q81652o73066l18222Q0033q812l77083l95699k64358n72090
$$ y = [384745178, 384683495, 384337959, 384129639, 384013062, 383717766, 382755852, 381451912, 380968895, 380932312, 381221199, 380978050, 380527878, 380410271, 380172539, 380103607, 379927292, 379611282, 378970947, 378686905, 378533859, 377849808, 377190552, 376259155, 375534630, 375306396, 375356293, 374908447, 374409370, 374584999, 374317894, 374050903, 374111748, 373824120, 373250504, 373016663, 373129730, 373153763, 372694283, 371902695, 371708412, 371522598, 371268120, 370888901, 370110512, 369518471, 369555855, 369956818, 369223404, 368656311, 368804474, 368493958, 368160629, 367646561, 367524147, 367175026, 366406364, 366183205, 366096725, 366091309, 365602112, 364897919, 364724579, 364492645, 364024506, 363627968, 363067665, 362704353, 362461128, 361873589, 361813889, 361582603, 360700951, 360027885, 359709663, 359789696, 359780884, 359403801, 359008102, 358743744, 358171654]
3331.9C58171654m48303m03862n43328K33650P6867o64559j041641q45299o41327p11059
3341.6C53182793j52970m58107n10063K11296Q8921o22368n81856m9629k94189k36931
3351.2C50576897m37966o48727o05469o47201q3275n6153j33857l53890l95088m63219
3360.8C46752052q53576l99475m05922l39318j27716k99225m81643n91584k6702l07122
3370.5C42919769o82029k42005p38411r37042J73454M36516m34799p47261l76282l93448
3380.1C38978462m90989m3068r6970j41258k01111m30832k56500m85230l814K89840
3389.8C37118530J49575K90412n61790q85735m53529r6283p0686m90418n63469j82037
3399.4C34254570O88972M37508p08885p66678j48735J23062J53771J62315j2207j17607
$$ y = [358171654, 357723351, 357319489, 356776161, 357009811, 357086678, 356422119, 355380478, 354535179, 353893852, 353182793, 353029823, 352571716, 352061653, 352272949, 352361870, 351739502, 351157646, 351108017, 350813828, 350576897, 350138931, 349490204, 348884735, 348237534, 348154259, 348098106, 347964249, 347610359, 347215271, 346752052, 345898476, 345499001, 345093079, 344753761, 344626045, 344326820, 343845177, 343253593, 343226891, 342919769, 342237740, 341995735, 341257324, 340320282, 340493736, 340930252, 340495453, 339748192, 339371910, 338978462, 338487473, 338444405, 338347435, 338206177, 338005066, 337574234, 337317734, 336832504, 336828690, 337118530, 337268105, 337558517, 336996727, 336110992, 335657463, 335561180, 335490494, 335000076, 334436607, 334254570, 334943542, 335381050, 334672165, 333905487, 333756752, 333879814, 334033585, 334195900, 334183693, 334066086]
3409.1C34066086l36533k65770K42386J44081o26945n13878J57966j68495l24554J1024
3418.7C32385368J78070l5972j02501K39944k53982l63045m58j49841K21214Q52394
3428.3C32971191L19329n16892j20964L09029J7967L6011N34439L49884r0675L204
3438C33812523J53084L68652o5536l25661j08414M02603P60956N95512P17812l86581
3447.6C35924950l56522M56467J16424K96135K93160P37457N44472q0490K86522K92930
3457.3C38511505K07825L33824P36809M33845P9804j44997j81274O25801P16209N53055
3466.9C41872406P1678N05905Q39959Q0337N55878L46946K08016L51906K8991R09577
3476.6C45771599J060257K35214k81181O3781P62330O82563N57823P03240N55077L19480
$$ y = [334066086, 333729553, 333463783, 333706169, 333850250, 333223305, 332709427, 332867393, 332698898, 332374344, 332385368, 332563438, 332527466, 332424965, 332664909, 332410927, 332047882, 332047424, 331897583, 332118797, 332971191, 333290520, 332773628, 332652664, 332961693, 332979660, 333015671, 333550110, 333899994, 333809319, 333812523, 333965607, 334334259, 334268723, 333943062, 333834648, 334237251, 334998207, 335593719, 336311531, 335924950, 335568428, 336024895, 336141319, 336437454, 336730614, 337468071, 338012543, 337932053, 338218575, 338511505, 338719330, 339053154, 339789963, 340223808, 340303612, 340158615, 339977341, 340603142, 341319351, 341872406, 341944084, 342449989, 343289948, 343370285, 343926163, 344273109, 344481125, 344833031, 344862022, 345771599, 346831856, 347067070, 346785889, 346849670, 347612000, 348294563, 348852386, 349555626, 350110703, 350430183]
3486.2C50430183O33622L26576q2359Q78486O83212j88331L07617Q82759J157532L95813
3495.8C55425110l92494K86407Q39081R83124M52766M52347L96461j51672P11365O95648
3505.5C59698143L79410Q37745J624299O16226n13230J073723M67911K05688R08623
3514.2C65298538M83628J63040k32048J166877J928101M95872J48087J238098J075859
3522.9C71766052m79889j09176P34558J273041Q37860K44903L69797P25937O08864
3531.5C75971947K90603J173897J160813J313667K72789p62367J044845J177712R11255
3540.2C82555161N38291Q88825Q84819O78062Q45147M92019J334648r82818O08101
3548.9C87842255K203292J397896J851006n73654P99751R56840Q84972J952782N48858
$$ y = [350430183, 351063805, 351390381, 351308022, 352186508, 352869720, 352681389, 352989006, 353871765, 355029297, 355425110, 355032616, 355319023, 356158104, 357141228, 357593994, 358046341, 358442802, 358291130, 359002495, 359698143, 360077553, 360915298, 362539597, 363155823, 362642593, 363716316, 364184227, 364389915, 365298538, 365782166, 365945206, 365713158, 366880035, 368808136, 369304008, 369452095, 370690193, 371766052, 371286163, 371176987, 371911545, 373184586, 374022446, 374267349, 374637146, 375363083, 375971947, 376262550, 377436447, 378597260, 379910927, 380183716, 379421349, 380466194, 381643906, 382555161, 383093452, 383982277, 384867096, 385545158, 386390305, 386882324, 388216972, 387234154, 387842255, 390045547, 391443443, 393294449, 392720795, 393520546, 394477386, 395362358, 397315140, 397863998]
3557.6C97863998J430207J161117Q58345L35465J533890Q03031l12919M241257J09062
3566.2D08023453q16689Q94509n50080M223747K117959J015281J467400J429443J246796
3574.9D19051819R54361J959915M73366J899833J318131L22533K071228K107238J633377
3583.6D31791801Q52204L839264J892891j514206J464348n29480K879219L278160K886886
3592.3D46841087O47087K16790L141250o10809K542076L053093R82475K789955M67530
3601D60070534J315803K456436K020112K128410L109436J880722j976967M022064O95191
3609.6D75721741n41153O932716J531067j069183M267883o18248L288994M543266l57818
3618.3D93699265J004524r45664P75452L566017K852020K552452K758370K199135K156448
$$ y = [397863998, 399294205, 400455322, 401313667, 401649132, 403183022, 403986053, 403673134, 407914391, 408023453, 407206764, 408101273, 407551193, 411774940, 413892899, 414908180, 416375580, 417805023, 419051819, 420006180, 421966095, 422439461, 424339294, 425657425, 425979958, 428051186, 430158424, 431791801, 432644005, 436483269, 438376160, 436861954, 438326302, 437796822, 440676041, 443954201, 446841087, 447488174, 447704964, 450846214, 450235405, 452777481, 455830574, 456813049, 459603004, 460070534, 461386337, 463842773, 465862885, 467991295, 471100731, 472981453, 471004486, 475026550, 475721741, 475180588, 482113304, 483644371, 482575188, 486843071, 486224823, 489513817, 494057083, 493699265, 494703789, 493758125, 494533577, 498099594, 500951614, 503504066, 506262436, 508461571, 510618019]
3627E10618019N711670j103363r576569M734726N051613N092735Q84896n33219L321305
3635.7E24201813K898979J543083J62811K035447K229003K145768J613731P05071K581558
3644.4E40117264L839264O047287j325074l890571N045662k010117l812713J347084
3652.1E45358086O999130M682121M201393M872856q392868J499215M816703J391335
3659.8E65427971J733665R23729K160340P39441J362381J976661Q90045L758965K060432
3668.5E81033630k49939J28479n505218L090019Q160401Q253936k032051j8605995
3676.2E74273262M673996R336357N070419k624664j91917L140297J997680J230393
3683.9E96905823O69861Q74061M500008O577377q881302k641563Q681488o596565l56255
$$ y = [510618019, 516329689, 515226326, 505649757, 510384483, 515436096, 520528831, 521413727, 520880508, 524201813, 527100792, 528643875, 528806686, 530842133, 533071136, 535216904, 536830635, 537535706, 540117264, 543956528, 550003815, 548678741, 544788170, 549833832, 547823715, 544011002, 545358086, 552357216, 557039337, 561240730, 566113586, 557720718, 559219933, 564036636, 565427971, 567161636, 568085365, 570245705, 570985146, 572347527, 574324188, 575214233, 578973198, 581033630, 580783691, 580912170, 575406952, 578496971, 586657372, 594911308, 592879257, 574273262, 578947258, 588283615, 593354034, 590729370, 590537453, 593677750, 595675430, 596905823, 597575684, 598449745, 602949753, 609527130, 600645828, 598004265, 606685753, 600089188, 599732933]
3692.6E99732933N527916P22122J721001K66914q3542J387825L79868L261986L453293
3701.3F16370316n877419k349892N026017J885910L36761M59137K612991L917618p070389
3709.9F15311050M024010M194832j2351341N745735M861717L26004P62940K302208
3717.7F25177155J377983l700943J314659O143379m129219m330788N673332J078721
3725.4F28604279r36737l011017L88107M034233J253624N764999m125862p312584J0401726
3734F35060768J177940p716789P11556J535377O87828K746773L513985l708649L008270
3742.7F37017059J2622681j0939903j6733170J0611916O103668O350327m962006q990822
3750.4F31079750J3327522m989395o986046N385018M759674L743973o120072K353668
$$ y = [599732933, 605260849, 605982971, 607703972, 607970886, 607887344, 609275169, 609655037, 612917023, 616370316, 610492897, 608143005, 613169022, 615054932, 615391693, 615850830, 618463821, 622381439, 615311050, 619335060, 623529892, 611178551, 616924286, 621786003, 622112007, 622874947, 625177155, 626555138, 622854195, 624168854, 630312233, 626183014, 621852226, 627525558, 628604279, 627667542, 624656525, 625044632, 629078865, 630332489, 636097488, 631971626, 624659042, 635060768, 636238708, 628521919, 629233475, 630768852, 631456680, 634203453, 637717438, 634008789, 637017059, 649639740, 638699837, 621966667, 632578583, 638682251, 645032578, 640070572, 631079750, 644407272, 639417877, 632431831, 637816849, 642576523, 646320496, 640200424, 642554092]
3758.2F42554092O614991q139573j640625N127793J528702N25055M182663k709275
3765.9F48043823n306701K955780M822311L2120r105454K496033M082031Q56934J027679
3774.5F49904556o26754N10559J015396L831024l48206q532943L257598K998581J583252
3783.2F53593063K758713l583374j312332J736526L75977J69220M6997O70624K18582
3791.9F54673996L75214j82038J796799M467850l159256m323654J634292L484497N638504
3800.6F64406204p066726r841767M448776L405304N577393O060715j0398484m643936
3808.3F51947479N201187K619477N78155o2790k97928J628800N569305k925110j4006424
3817F50252151O346436O721497M463272Q35037j6425934K656250N813294K572631K709580
$$ y = [642554092, 649169083, 641029510, 639388885, 644516678, 646045380, 646570435, 650753098, 648043823, 642737122, 645692902, 650515213, 650547333, 641441879, 643937912, 648019943, 648876877, 649904556, 649277802, 649788361, 650803757, 654634781, 654286575, 645753632, 649011230, 652009811, 653593063, 656351776, 652768402, 651456070, 653192596, 653568573, 653737793, 653784790, 654455414, 654673996, 655049210, 654867172, 656663971, 661131821, 657972565, 653648911, 655283203, 658767700, 664406204, 657339478, 647497711, 651946487, 655351791, 660929184, 666989899, 656591415, 651947479, 657148666, 659768143, 660346298, 660283508, 659985580, 661614380, 667183685, 664258575, 650252151, 656598587, 663320084, 667783356, 668618393, 652192459, 654848709, 660662003, 663234634, 665944214]
3825.7F65944214j55640m409332l36914K423477M349899J596909q295212K704010O338806
3834.3F70160217n680618J67160P857285r006424l539048Q689423n748291j61285O767120
3843F69505539k679672l542099K276840J432114J50375J646042n93491K599411O478272
3851.7F77273331n899124K608947j6025543L34320J1822281q49762k827148J525955
3859.4F67963257K535171L317795n482101K86026P430038o378555o150208M343415
3867.1F67864838N451584N894546q643036q517074M867248O383362L336716j0184861
3874.8F66453323R63211M047394n83648K502975N424271m951706p997971N853119J851196
3883.5F73562164K074280N429993j3796158R30862M809647Q75931L980636j326599
$$ y = [665944214, 665788574, 661379242, 661042328, 663465805, 667815704, 669412613, 661117401, 663821411, 670160217, 664479599, 664646759, 672504044, 663497620, 659958572, 668647995, 662899704, 662738419, 669505539, 666825867, 663283768, 665560608, 666992722, 667143097, 668789139, 668195648, 670795059, 677273331, 671374207, 673983154, 657957611, 658291931, 670114212, 669264450, 666437302, 667963257, 670498428, 673816223, 668334122, 668620148, 676050186, 669671631, 663521423, 667864838, 673316422, 679210968, 670567932, 662050858, 666918106, 673301468, 676638184, 666453323, 667416534, 671463928, 670880280, 673383255, 678807526, 673855820, 665857849, 671710968, 673562164, 675636444, 681066437, 667270279, 668201141, 673010788, 673886719, 677867355, 676540756]
3891.2F76540756q125000J892929L538285j126252J188431J212845L002167K191849
3898.9F80316010j0599137M877625K610931m666748N393829l302841k201919J61590
3906.7F72589340P58743K318345k70539K18201J89362K93121k66495j50833J617203
3915.3F77296448J516495l339921k740554M996948k19498m246826K476425K043762
3923.1F77783279J442032k712707l528519J632004J838302J731644j527710r41009
3930.8F75717316K411575j534576l67966J651459j74637N59082J89590r78012l0212
3939.5F77443619K2125J655045J532745l895264m29229J553421M71572J230317k224579
3948.1F77359772q8196P57370j377945J966019M06799j066513L71399P28378j25122
$$ y = [676540756, 668415756, 670308685, 673846970, 672720718, 673909149, 675121994, 678124161, 680316010, 669716873, 674594498, 677205429, 672538681, 677932510, 674629669, 672427750, 672589340, 673348083, 675666428, 675395889, 675614090, 675803452, 676096573, 675830078, 675679245, 677296448, 678812943, 675473022, 672732468, 677729416, 677509918, 673263092, 675739517, 677783279, 679225311, 676512604, 672984085, 674616089, 676454391, 678186035, 676658325, 675717316, 678128891, 676594315, 676226349, 677877808, 677703171, 678262253, 678451843, 677473831, 677443619, 677465744, 679120789, 680653534, 676758270, 676329041, 677882462, 678354034, 679584351, 677359772, 677271576, 678028946, 676651001, 678617020, 679023819, 677957306, 678328705, 679057083, 678931961]
3956.8F78931961r46426Q74862N80063K17514M7837j203614l73382M64401M85077l08228
3966.5F78770065J40457P47986l72772l62396Q60061J81656n32837O21415m0055q55255
3976.1F79158325k81753P26699Q45566k21863l4790Q393q5831k64435l26919J30157
3985.7F79653549K63138L43018K060L41415m39682m47693J334000L74756n29786n89370
3995.4F80305405n59540M98428M22745K9297M14657
4000.2F81110992
$$ y = [678931961, 677985535, 678860397, 679440460, 679657974, 679705811, 678502197, 678128815, 678593216, 679078293, 678770065, 678910522, 679658508, 679285736, 678923340, 679783401, 679965057, 679432220, 680053635, 680013580, 679158325, 678876572, 679603271, 680448837, 680226974, 680192184, 680200577, 680114746, 679850311, 679523392, 679653549, 679916687, 680259705, 680261765, 680603180, 680163498, 679715805, 681049805, 681424561, 680894775, 680305405, 679745865, 680244293, 680667038, 680696335, 681110992]
##END=$$ End of the data block
